{"text_format":"1","workbook":"xlsx","n_sheets":17,"sheets":["Start","Bad Pitches","BCBC","Ghetto Bombers","Thunder Ducks","X Team","XXX Team","YY Team","XX Team","Female","Male","Sheet1","STANDINGS","print","Sheet2","Module1","Module2"],"not_rendered":{"charts":0,"images":0,"macros":1,"external_links":0,"defined_names":9,"comments":0,"pivot_tables":0},"unopened":[{"sheet":"Module1","index":15,"reason":"part_missing"},{"sheet":"Module2","index":16,"reason":"part_missing"}],"bounds":{"document_bytes":16777216,"sheet_cells":100000,"rows_first":2000,"rows_last":500,"rows_between":2000,"halvings":0,"cell_chars":16384,"cell_head_chars":4096},"cells_cut":0,"cells_raw":0,"read":"whole","date_system":"1900"}

{"sheet":"Start","index":0,"n_rows":10,"n_cols":10,"rows_kept":10,"cut":false,"hidden":false,"merged":[]}
["Last game day"]
["2023-08-31",null,null,null,null,null,null,null,"Team Legends"]
[null,null,null,null,null,null,null,null,"Team 1",{"$f":"'Bad Pitches'!D1","v":"Bad Pitches"}]
[null,null,null,null,null,null,null,null,"Team 2",{"$f":"BCBC!D1","v":"BCBC"}]
[null,null,null,null,null,null,null,null,"Team 3",{"$f":"'Ghetto Bombers'!D1","v":"Ghetto Bombers"}]
[null,null,null,null,null,null,null,null,"Team 4",{"$f":"'Thunder Ducks'!D1","v":"Thunder Ducks"}]
[null,null,null,null,null,null,null,null,"Team 5",{"$f":"'X Team'!D1","v":"X Team"}]
[null,null,null,null,null,null,null,null,"Team 6",{"$f":"'XXX Team'!D1","v":"XXX Team"}]
[null,null,null,null,null,null,null,null,"Team 7",{"$f":"'YY Team'!D1","v":"YY Team"}]
[null,null,null,null,null,null,null,null,"Team 8",{"$f":"'XX Team'!D1","v":"XX Team"}]

{"sheet":"Bad Pitches","index":1,"n_rows":115,"n_cols":27,"rows_kept":115,"cut":false,"hidden":false,"merged":[]}
[null,null,"Team Name","Bad Pitches",null,null,null,null,"Score",21,9,15,7]
[null,null,null,null,null,null,null,null,"Opponents Score",22,11,11,0]
[null,null,null,"Wins",null,{"$f":"SUM(J6:AA6)","v":2},null,null,"W or L",{"$f":"IF(SUM(J1,J2)=0,\"\",IF(J1<J2,\"L\",\"W\"))","v":"L"},{"$f":"IF(SUM(K1,K2)=0,\"\",IF(K1<K2,\"L\",\"W\"))","v":"L"},"W","W","","","","","","",{"$f":"IF(SUM(T1,T2)=0,\"\",IF(T1<T2,\"L\",\"W\"))","v":""},"","","","","","",""]
[null,null,null,"Losses",null,{"$f":"SUM(J7:AA7)","v":2},null,"Forfeit","FW or FL",null,null,null,"FW"]
[null,null,null,null,"games played excluding Forfeit Wins",null,null,null,null,{"$f":"IF(J3=\"\",\"\",IF(J4=\"FW\",\"\",1))","v":1},{"$f":"IF(K3=\"\",\"\",IF(K4=\"FW\",\"\",1))","v":1},1,"","","","","","","","","","","",null,{"$f":"IF(Y3=\"\",\"\",IF(Y4=\"FW\",\"\",1))","v":""},{"$f":"IF(Z3=\"\",\"\",IF(Z4=\"FW\",\"\",1))","v":""},{"$f":"IF(AA3=\"\",\"\",IF(AA4=\"FW\",\"\",1))","v":""}]
[null,null,null,null,null,null,null,{"$f":"IF(H4=\"w\",1,\"\")","v":""},"win",{"$f":"IF(J3=\"w\",1,\"\")","v":""},{"$f":"IF(K3=\"w\",1,\"\")","v":""},1,1,"","","","","","","","","","",null,{"$f":"IF(Y3=\"w\",1,\"\")","v":""},{"$f":"IF(Z3=\"w\",1,\"\")","v":""},{"$f":"IF(AA3=\"w\",1,\"\")","v":""}]
[null,null,null,null,null,null,null,{"$f":"IF(H4=\"l\",1,\"\")","v":""},"loss",{"$f":"IF(J3=\"l\",1,\"\")","v":1},{"$f":"IF(K3=\"l\",1,\"\")","v":1},"","","","","","","","","","","","",null,{"$f":"IF(Y3=\"l\",1,\"\")","v":""},{"$f":"IF(Z3=\"l\",1,\"\")","v":""},{"$f":"IF(AA3=\"l\",1,\"\")","v":""}]
[null,null,null,"Games Played Excluding Forfeit Wins",null,{"$f":"SUM(J5:AA5)","v":3},null,"Opponents Team Name",null,"Thunder Ducks","BCBC","Ghetto Bombers","Thunderducks"]
[null,null,null,"League Run Diff     ",null,{"$f":"SUM(J9:AA9)","v":8},null,null,"Game Run Diff",{"$f":"IF(J1=\"\",\"\",J1-J2)","v":-1},{"$f":"IF(K1=\"\",\"\",K1-K2)","v":-2},4,7,"","","","","","",null,{"$f":"IF(U1=\"\",\"\",U1-U2)","v":""},"","","","","",""]
[null,null,null,"Team Batting Avg   ",null,{"$f":"$H$115","v":0.4765625},null,null,"Game Date","2023-08-10","2023-08-17","2023-08-24","2023-08-31","2023-09-07"]
[]
[null,null,null,null,null,null,null,"STATS",null,1,2,3,4,5,6,7,8,9,10,11,12,13,14,15,16,17,18]
[1,{"$f":"$D$1","v":"Bad Pitches"},"L-Name","Harrison",null,"# of AB's",null,{"$f":"SUM(J13:AA13)","v":14},"AB's",5,4,5]
[null,null,"F-Name","Van Dyke",null,"# of Hits",null,{"$f":"SUM(J14:AA14)","v":10},"Hits",3,4,3]
[null,null,null,null,null,"# of PA",null,{"$f":"SUM(J15:AA15)","v":15},"PA",6,4,5]
[null,null,null,"m",null,"Avg",null,{"$f":"IF(H13=0,\"\",(H14/H13))","v":0.7142857142857143},"Avg",{"$f":"IF(J13=\"\",\"\",J14/J13)","v":0.6},1,0.6,"","","","","","","",{"$f":"IF(T13=\"\",\"\",T14/T13)","v":""},"","","","","","",""]
[2,{"$f":"$D$1","v":"Bad Pitches"},"L-Name","Paige",null,"# of AB's",null,{"$f":"SUM(J17:AA17)","v":10},"AB's",6,null,4]
[null,null,"F-Name","Reynolds",null,"# of Hits",null,{"$f":"SUM(J18:AA18)","v":3},"Hits",2,null,1]
[null,null,null,null,null,"# of PA",null,{"$f":"SUM(J19:AA19)","v":10},"PA",6,null,4]
[null,null,null,"f",null,"Avg",null,{"$f":"IF(H17=0,\"\",H18/H17)","v":0.3},"Avg",{"$f":"IF(J17=\"\",\"\",J18/J17)","v":0.33333333333333331},"",0.25,"","","","","","","",{"$f":"IF(T17=\"\",\"\",T18/T17)","v":""},"","","","","","",""]
[3,{"$f":"$D$1","v":"Bad Pitches"},"L-Name","Ryan",null,"# of AB's",null,{"$f":"SUM(J21:AA21)","v":14},"AB's",6,4,4]
[null,null,"F-Name","Watt",null,"# of Hits",null,{"$f":"SUM(J22:AA22)","v":10},"Hits",4,2,4]
[null,null,null,null,null,"# of PA",null,{"$f":"SUM(J23:AA23)","v":14},"PA",6,4,4]
[null,null,null,"m",null,"Avg",null,{"$f":"IF(H21=0,\"\",H22/H21)","v":0.7142857142857143},"Avg",{"$f":"IF(J21=\"\",\"\",J22/J21)","v":0.66666666666666663},0.5,null,"","","","","","","",{"$f":"IF(T21=\"\",\"\",T22/T21)","v":""},"","","","","","",""]
[4,{"$f":"$D$1","v":"Bad Pitches"},"L-Name","Tanzie",null,"# of AB's",null,{"$f":"SUM(J25:AA25)","v":14},"AB's",6,4,4]
[null,null,"F-Name","Gasu",null,"# of Hits",null,{"$f":"SUM(J26:AA26)","v":7},"Hits",3,2,2]
[null,null,null,null,null,"# of PA",null,{"$f":"SUM(J27:AA27)","v":14},"PA",6,4,4]
[null,null,null,"f",null,"Avg",null,{"$f":"IF(H25=0,\"\",H26/H25)","v":0.5},"Avg",{"$f":"IF(J25=\"\",\"\",J26/J25)","v":0.5},0.5,0.5,"","","","","","","",{"$f":"IF(T25=\"\",\"\",T26/T25)","v":""},"","","","","","",""]
[5,{"$f":"$D$1","v":"Bad Pitches"},"L-Name","Parker",null,"# of AB's",null,{"$f":"SUM(J29:AA29)","v":6},"AB's",6]
[null,null,"F-Name","Van Dyke",null,"# of Hits",null,{"$f":"SUM(J30:AA30)","v":2},"Hits",2]
[null,null,null,null,null,"# of PA",null,{"$f":"SUM(J31:AA31)","v":6},"PA",6]
[null,null,null,"m",null,"Avg",null,{"$f":"IF(H29=0,\"\",H30/H29)","v":0.33333333333333331},"Avg",{"$f":"IF(J29=\"\",\"\",J30/J29)","v":0.33333333333333331},"","","","","","","","","",{"$f":"IF(T29=\"\",\"\",T30/T29)","v":""},"","","","","","",""]
[6,{"$f":"$D$1","v":"Bad Pitches"},"C","Callianne",null,"# of AB's",null,{"$f":"SUM(J33:AA33)","v":9},"AB's",5,4]
[null,null,"F-Name","Hodson",null,"# of Hits",null,{"$f":"SUM(J34:AA34)","v":3},"Hits",3,0]
[null,null,null,null,null,"# of PA",null,{"$f":"SUM(J35:AA35)","v":9},"PA",5,4]
[null,null,null,"f",null,"Avg",null,{"$f":"IF(H33=0,\"\",H34/H33)","v":0.33333333333333331},"Avg",{"$f":"IF(J33=\"\",\"\",J34/J33)","v":0.6},0,"","","","","","","","","","","","","","","",""]
[7,{"$f":"$D$1","v":"Bad Pitches"},"L-Name","Jeff",null,"# of AB's",null,{"$f":"SUM(J37:AA37)","v":7},"AB's",4,3]
[null,null,"F-Name","Cagle",null,"# of Hits",null,{"$f":"SUM(J38:AA38)","v":5},"Hits",3,2]
[null,null,null,null,null,"# of PA",null,{"$f":"SUM(J39:AA39)","v":8},"PA",5,3]
[null,null,null,"m",null,"Avg",null,{"$f":"IF(H37=0,\"\",H38/H37)","v":0.7142857142857143},"Avg",{"$f":"IF(J37=\"\",\"\",J38/J37)","v":0.75},0.66666666666666663,"","","","","","","","",{"$f":"IF(T37=\"\",\"\",T38/T37)","v":""},"","","","","","",""]
[8,{"$f":"$D$1","v":"Bad Pitches"},"L-Name","Janae",null,"# of AB's",null,{"$f":"SUM(J41:AA41)","v":7},"AB's",5,2]
[null,null,"F-Name","Cook",null,"# of Hits",null,{"$f":"SUM(J42:AA42)","v":1},"Hits",1,0]
[null,null,null,null,null,"# of PA",null,{"$f":"SUM(J43:AA43)","v":8},"PA",5,3]
[null,null,null,"f",null,"Avg",null,{"$f":"IF(H41=0,\"\",H42/H41)","v":0.14285714285714285},"Avg",{"$f":"IF(J41=\"\",\"\",J42/J41)","v":0.2},0,"","","","","","","","",{"$f":"IF(T41=\"\",\"\",T42/T41)","v":""},"","","","","","",""]
[9,{"$f":"$D$1","v":"Bad Pitches"},"L-Name","Aaron",null,"# of AB's",null,{"$f":"SUM(J45:AA45)","v":12},"AB's",5,3,4]
[null,null,"F-Name","Montgomery",null,"# of Hits",null,{"$f":"SUM(J46:AA46)","v":5},"Hits",2,2,1]
[null,null,null,null,null,"# of PA",null,{"$f":"SUM(J47:AA47)","v":12},"PA",5,3,4]
[null,null,null,"m",null,"Avg",null,{"$f":"IF(H45=0,\"\",H46/H45)","v":0.41666666666666669},"Avg",{"$f":"IF(J45=\"\",\"\",J46/J45)","v":0.4},0.66666666666666663,0.25,"","","","","","","",{"$f":"IF(T45=\"\",\"\",T46/T45)","v":""},"","","","","","",""]
[10,{"$f":"$D$1","v":"Bad Pitches"},"L-Name","Megan",null,"# of AB's",null,{"$f":"SUM(J49:AA49)","v":9},"AB's",5,null,4]
[null,null,"F-Name","Timpson",null,"# of Hits",null,{"$f":"SUM(J50:AA50)","v":4},"Hits",3,null,1]
[null,null,null,null,null,"# of PA",null,{"$f":"SUM(J51:AA51)","v":9},"PA",5,null,4]
[null,null,null,"f",null,"Avg",null,{"$f":"IF(H49=0,\"\",H50/H49)","v":0.44444444444444442},"Avg",{"$f":"IF(J49=\"\",\"\",J50/J49)","v":0.6},"",0.25,"","","","","","","",{"$f":"IF(T49=\"\",\"\",T50/T49)","v":""},"","","","","","",""]
[11,{"$f":"$D$1","v":"Bad Pitches"},"L-Name","Vincente",null,"# of AB's",null,{"$f":"SUM(J53:AA53)","v":8},"AB's",null,4,4]
[null,null,"F-Name","Herrera",null,"# of Hits",null,{"$f":"SUM(J54:AA54)","v":2},"Hits",null,1,1]
[null,null,null,null,null,"# of PA",null,{"$f":"SUM(J55:AA55)","v":8},"PA",null,4,4]
[null,null,null,"m",null,"Avg",null,{"$f":"IF(H53=0,\"\",H54/H53)","v":0.25},"Avg",{"$f":"IF(J53=\"\",\"\",J54/J53)","v":""},0.25,0.25,"","","","","","","",{"$f":"IF(T53=\"\",\"\",T54/T53)","v":""},"","","","","","",""]
[12,{"$f":"$D$1","v":"Bad Pitches"},"L-Name","Teya",null,"# of AB's",null,{"$f":"SUM(J57:AA57)","v":7},"AB's",null,3,4]
[null,null,"F-Name","Gasu",null,"# of Hits",null,{"$f":"SUM(J58:AA58)","v":2},"Hits",null,1,1]
[null,null,null,null,null,"# of PA",null,{"$f":"SUM(J59:AA59)","v":8},"PA",null,4,4]
[null,null,null,"f",null,"Avg",null,{"$f":"IF(H57=0,\"\",H58/H57)","v":0.2857142857142857},"Avg",{"$f":"IF(J57=\"\",\"\",J58/J57)","v":""},0.33333333333333331,0.25,"","","",null,"","","",{"$f":"IF(T57=\"\",\"\",T58/T57)","v":""},"","","","","","",""]
[13,{"$f":"$D$1","v":"Bad Pitches"},"B","Karson",null,"# of AB's",null,{"$f":"SUM(J61:AA61)","v":7},"AB's",null,3,4]
[null,null,"F-Name","Vanderver",null,"# of Hits",null,{"$f":"SUM(J62:AA62)","v":5},"Hits",null,1,4]
[null,null,null,null,null,"# of PA",null,{"$f":"SUM(J63:AA63)","v":7},"PA",null,3,4]
[null,null,null,"f",null,"Avg",null,{"$f":"IF(H61=0,\"\",H62/H61)","v":0.7142857142857143},"Avg",{"$f":"IF(J61=\"\",\"\",J62/J61)","v":""},0.33333333333333331,1,"","","","","","","",{"$f":"IF(T61=\"\",\"\",T62/T61)","v":""},"","","","","","",""]
[14,{"$f":"$D$1","v":"Bad Pitches"},"L-Name","Britton",null,"# of AB's",null,{"$f":"SUM(J65:AA65)","v":4},"AB's",null,null,4]
[null,null,"F-Name","Lund",null,"# of Hits",null,{"$f":"SUM(J66:AA66)","v":2},"Hits",null,null,2]
[null,null,null,null,null,"# of PA",null,{"$f":"SUM(J67:AA67)","v":4},"PA",null,null,4]
[null,null,null,"m",null,"Avg",null,{"$f":"IF(H65=0,\"\",H66/H65)","v":0.5},"Avg",{"$f":"IF(J65=\"\",\"\",J66/J65)","v":""},"",0.5,"","","","","","","",{"$f":"IF(T65=\"\",\"\",T66/T65)","v":""},"","","","","","",""]
[15,{"$f":"$D$1","v":"Bad Pitches"},"L-Name",null,null,"# of AB's",null,{"$f":"SUM(J69:AA69)","v":0},"AB's"]
[null,null,"F-Name",null,null,"# of Hits",null,{"$f":"SUM(J70:AA70)","v":0},"Hits"]
[null,null,null,null,null,"# of PA",null,{"$f":"SUM(J71:AA71)","v":0},"PA"]
[null,null,null,"f",null,"Avg",null,{"$f":"IF(H69=0,\"\",H70/H69)","v":""},"Avg",{"$f":"IF(J69=\"\",\"\",J70/J69)","v":""},"","","","","","","","",null,{"$f":"IF(T69=\"\",\"\",T70/T69)","v":""},"","","","","","",""]
[16,{"$f":"$D$1","v":"Bad Pitches"},"R",null,null,"# of AB's",null,{"$f":"SUM(J73:AA73)","v":0},"AB's"]
[null,null,"F-Name",null,null,"# of Hits",null,{"$f":"SUM(J74:AA74)","v":0},"Hits"]
[null,null,null,null,null,"# of PA",null,{"$f":"SUM(J75:AA75)","v":0},"PA"]
[null,null,null,"f",null,"Avg",null,{"$f":"IF(H73=0,\"\",H74/H73)","v":""},"Avg",{"$f":"IF(J73=\"\",\"\",J74/J73)","v":""},"","","","","","","","","",{"$f":"IF(T73=\"\",\"\",T74/T73)","v":""},"","","","","","",""]
[17,{"$f":"$D$1","v":"Bad Pitches"},"L-Name",null,null,"# of AB's",null,{"$f":"SUM(J77:AA77)","v":0},"AB's"]
[null,null,"F-Name",null,null,"# of Hits",null,{"$f":"SUM(J78:AA78)","v":0},"Hits"]
[null,null,null,null,null,"# of PA",null,{"$f":"SUM(J79:AA79)","v":0},"PA"]
[null,null,null,"f",null,"Avg",null,{"$f":"IF(H77=0,\"\",H78/H77)","v":""},"Avg",{"$f":"IF(J77=\"\",\"\",J78/J77)","v":""},"","","","","","","","","",{"$f":"IF(T77=\"\",\"\",T78/T77)","v":""},"","","","","","",""]
[18,{"$f":"$D$1","v":"Bad Pitches"},"L-Name",null,null,"# of AB's",null,{"$f":"SUM(J81:AA81)","v":0},"AB's"]
[null,null,"F-Name",null,null,"# of Hits",null,{"$f":"SUM(J82:AA82)","v":0},"Hits"]
[null,null,null,null,null,"# of PA",null,{"$f":"SUM(J83:AA83)","v":0},"PA"]
[null,null,null,"m",null,"Avg",null,{"$f":"IF(H81=0,\"\",H82/H81)","v":""},"Avg",{"$f":"IF(J81=\"\",\"\",J82/J81)","v":""},"","","","","","","","","",{"$f":"IF(T81=\"\",\"\",T82/T81)","v":""},"","","","","","",""]
[19,{"$f":"$D$1","v":"Bad Pitches"},"L-Name",null,null,"# of AB's",null,{"$f":"SUM(J85:AA85)","v":0},"AB's"]
[null,null,"F-Name",null,null,"# of Hits",null,{"$f":"SUM(J86:AA86)","v":0},"Hits"]
[null,null,null,null,null,"# of PA",null,{"$f":"SUM(J87:AA87)","v":0},"PA"]
[null,null,null,"m",null,"Avg",null,{"$f":"IF(H85=0,\"\",H86/H85)","v":""},"Avg",{"$f":"IF(J85=\"\",\"\",J86/J85)","v":""},"","","","","","","","","",{"$f":"IF(T85=\"\",\"\",T86/T85)","v":""},"","","","","","",""]
[20,{"$f":"$D$1","v":"Bad Pitches"},"L-Name",null,null,"# of AB's",null,{"$f":"SUM(J89:AA89)","v":0},"AB's"]
[null,null,"F-Name",null,null,"# of Hits",null,{"$f":"SUM(J90:AA90)","v":0},"Hits"]
[null,null,null,null,null,"# of PA",null,{"$f":"SUM(J91:AA91)","v":0},"PA"]
[null,null,null,"f",null,"Avg",null,{"$f":"IF(H89=0,\"\",H90/H89)","v":""},"Avg",{"$f":"IF(J89=\"\",\"\",J90/J89)","v":""},"","","","","","","","","",{"$f":"IF(T89=\"\",\"\",T90/T89)","v":""},"","","","","","",""]
[21,{"$f":"$D$1","v":"Bad Pitches"},"L-Name",null,null,"# of AB's",null,{"$f":"SUM(J93:AA93)","v":0},"AB's"]
[null,null,"F-Name",null,null,"# of Hits",null,{"$f":"SUM(J94:AA94)","v":0},"Hits"]
[null,null,null,null,null,"# of PA",null,{"$f":"SUM(J95:AA95)","v":0},"PA"]
[null,null,null,"f",null,"Avg",null,{"$f":"IF(H93=0,\"\",H94/H93)","v":""},"Avg",{"$f":"IF(J93=\"\",\"\",J94/J93)","v":""},"","","","","","","","","",{"$f":"IF(T93=\"\",\"\",T94/T93)","v":""},"","","","","","",""]
[22,{"$f":"$D$1","v":"Bad Pitches"},"L-Name",null,null,"# of AB's",null,{"$f":"SUM(J97:AA97)","v":0},"AB's"]
[null,null,"F-Name",null,null,"# of Hits",null,{"$f":"SUM(J98:AA98)","v":0},"Hits"]
[null,null,null,null,null,"# of PA",null,{"$f":"SUM(J99:AA99)","v":0},"PA"]
[null,null,null,"f",null,"Avg",null,{"$f":"IF(H97=0,\"\",H98/H97)","v":""},"Avg",{"$f":"IF(J97=\"\",\"\",J98/J97)","v":""},"","","","","","","","","",{"$f":"IF(T97=\"\",\"\",T98/T97)","v":""},"","","","","","",""]
[23,{"$f":"$D$1","v":"Bad Pitches"},"L-Name",null,null,"# of AB's",null,{"$f":"SUM(J101:AA101)","v":0},"AB's"]
[null,null,"F-Name",null,null,"# of Hits",null,{"$f":"SUM(J102:AA102)","v":0},"Hits"]
[null,null,null,null,null,"# of PA",null,{"$f":"SUM(J103:AA103)","v":0},"PA"]
[null,null,null,"f",null,"Avg",null,{"$f":"IF(H101=0,\"\",H102/H101)","v":""},"Avg",{"$f":"IF(J101=\"\",\"\",J102/J101)","v":""},"","","","","","","","","",{"$f":"IF(T101=\"\",\"\",T102/T101)","v":""},"","","","","","",""]
[24,{"$f":"$D$1","v":"Bad Pitches"},"L-Name",null,null,"# of AB's",null,{"$f":"SUM(J105:AA105)","v":0},"AB's"]
[null,null,"F-Name",null,null,"# of Hits",null,{"$f":"SUM(J106:AA106)","v":0},"Hits"]
[null,null,null,null,null,"# of PA",null,{"$f":"SUM(J107:AA107)","v":0},"PA"]
[null,null,null,"f",null,"Avg",null,{"$f":"IF(H105=0,\"\",H106/H105)","v":""},"Avg",{"$f":"IF(J105=\"\",\"\",J106/J105)","v":""},"","","","","","","","","",{"$f":"IF(T105=\"\",\"\",T106/T105)","v":""},"","","","","","",""]
[25,{"$f":"$D$1","v":"Bad Pitches"},"L-Name",null,null,"# of AB's",null,{"$f":"SUM(J109:AA109)","v":0},"AB's"]
[null,null,"F-Name",null,null,"# of Hits",null,{"$f":"SUM(J110:AA110)","v":0},"Hits"]
[null,null,null,null,null,"# of PA",null,{"$f":"SUM(J111:AA111)","v":0},"PA"]
[null,null,null,"f",null,"Avg",null,{"$f":"IF(H109=0,\"\",H110/H109)","v":""},"Avg",{"$f":"IF(J109=\"\",\"\",J110/J109)","v":""},"","","","","","","","","",{"$f":"IF(T109=\"\",\"\",T110/T109)","v":""},"","","","","","",""]
[null,{"$f":"$D$1","v":"Bad Pitches"},null,"TEAM",null,"# of AB's",null,{"$f":"SUM(J113:AA113)","v":128},"AB's",{"$f":"IF(SUM(J109,J105,J101,J97,J93,J89,J85,J81,J77,J73,J69,J65,J61,J57,J53,J49,J45,J41,J37,J33,J29,J25,J21,J17,J13)=0,\"\",SUM(J13,J17,J21,J25,J29,J33,J37,J41,J45,J49,J53,J57,J61,J65,J69,J73,J77,J81,J85,J89,J93,J97,J101,J105,J109))","v":53},34,41,"","","","","","","","","","","","","","",""]
[null,null,null,"Summary",null,"# of Hits",null,{"$f":"SUM(J114:AA114)","v":61},"Hits",{"$f":"IF(SUM(J110,J106,J102,J98,J94,J90,J86,J82,J78,J74,J70,J66,J62,J58,J54,J50,J46,J42,J38,J34,J30,J26,J22,J18,J14)=0,\"\",SUM(J14,J18,J22,J26,J30,J34,J38,J42,J46,J50,J54,J58,J62,J66,J70,J74,J78,J82,J86,J90,J94,J98,J102,J106,J110))","v":26},15,20,"","","","","","","","","","","","","","",""]
[null,null,null,null,null,"Avg",null,{"$f":"IF(H113=0,\"N/A\",H114/H113)","v":0.4765625},"Avg",{"$f":"IF(J113=\"\",\"\",J114/J113)","v":0.49056603773584906},0.44117647058823528,0.48780487804878048,"","","","","","","",{"$f":"IF(T113=\"\",\"\",T114/T113)","v":""},"","","","","","",""]

{"sheet":"BCBC","index":2,"n_rows":115,"n_cols":27,"rows_kept":115,"cut":false,"hidden":false,"merged":[]}
[null,null,"Team Name","BCBC",null,null,null,null,"Score",19,11,8,9]
[null,null,null,null,null,null,null,null,"Opponents Score",20,9,21,28]
[null,null,null,"Wins",null,{"$f":"SUM(J6:AA6)","v":1},null,null,"W or L",{"$f":"IF(SUM(J1,J2)=0,\"\",IF(J1<J2,\"L\",\"W\"))","v":"L"},"W","L","L","","","","","","","","","","","","","",""]
[null,null,null,"Losses",null,{"$f":"SUM(J7:AA7)","v":3},null,"Forfeit","FW or FL"]
[null,null,null,null,"games played excluding Forfeit Wins",null,null,null,null,{"$f":"IF(J3=\"\",\"\",IF(J4=\"FW\",\"\",1))","v":1},1,1,1,"","","","","","","","","","","","","",""]
[null,null,null,null,null,null,null,{"$f":"IF(H4=\"w\",1,\"\")","v":""},"win",{"$f":"IF(J3=\"w\",1,\"\")","v":""},1,"","","","","","","","","","","","","","","",""]
[null,null,null,null,null,null,null,{"$f":"IF(H4=\"l\",1,\"\")","v":""},"loss",{"$f":"IF(J3=\"l\",1,\"\")","v":1},"",1,1,"","","","","","","","","","","","","",""]
[null,null,null,"Games Played Excluding Forfeit Wins",null,{"$f":"SUM(J5:AA5)","v":4},null,"Opponents Team Name",null,"Ghetto Bombers","Bad Pitches","Thunder Ducks","Ghetto Bombers"]
[null,null,null,"League Run Diff     ",null,{"$f":"SUM(J9:AA9)","v":-31},null,null,"Game Run Diff",{"$f":"IF(J1=\"\",\"\",J1-J2)","v":-1},2,-13,-19,"","",null,"","","","","","","","","","",""]
[null,null,null,"Team Batting Avg   ",null,{"$f":"$H$115","v":0.48026315789473684},null,null,"Game Date","2023-08-10","2023-08-17","2023-08-24","2023-08-31","2023-09-07"]
[]
[null,null,null,null,null,null,null,"STATS",null,1,2,3,4,5,6,7,8,9,10,11,12,13,14,15,16,17,18]
[1,{"$f":"$D$1","v":"BCBC"},"L-Name","Jordan",null,"# of AB's",null,{"$f":"SUM(J13:AA13)","v":10},"AB's",5,2,3]
[null,null,"F-Name","Rogers",null,"# of Hits",null,{"$f":"SUM(J14:AA14)","v":7},"Hits",4,0,3]
[null,null,null,null,null,"# of PA",null,{"$f":"SUM(J15:AA15)","v":11},"PA",5,3,3]
[null,null,null,"m",null,"Avg",null,{"$f":"IF(H13=0,\"\",(H14/H13))","v":0.7},"Avg",{"$f":"IF(J13=\"\",\"\",J14/J13)","v":0.8},0,1,"","","","","","","","","","","","","","",""]
[2,{"$f":"$D$1","v":"BCBC"},"L-Name","Alex",null,"# of AB's",null,{"$f":"SUM(J17:AA17)","v":11},"AB's",5,3,3]
[null,null,"F-Name","Ferrel",null,"# of Hits",null,{"$f":"SUM(J18:AA18)","v":5},"Hits",2,2,1]
[null,null,null,null,null,"# of PA",null,{"$f":"SUM(J19:AA19)","v":11},"PA",5,3,3]
[null,null,null,"f",null,"Avg",null,{"$f":"IF(H17=0,\"\",H18/H17)","v":0.45454545454545453},"Avg",{"$f":"IF(J17=\"\",\"\",J18/J17)","v":0.4},0.66666666666666663,0.33333333333333331,"","","","","","","","","","","","","","",""]
[3,{"$f":"$D$1","v":"BCBC"},"L-Name","Vinny",null,"# of AB's",null,{"$f":"SUM(J21:AA21)","v":12},"AB's",5,3,null,4]
[null,null,"F-Name","Dilworth",null,"# of Hits",null,{"$f":"SUM(J22:AA22)","v":6},"Hits",3,1,null,2]
[null,null,null,null,null,"# of PA",null,{"$f":"SUM(J23:AA23)","v":12},"PA",5,3,null,4]
[null,null,null,"m",null,"Avg",null,{"$f":"IF(H21=0,\"\",H22/H21)","v":0.5},"Avg",{"$f":"IF(J21=\"\",\"\",J22/J21)","v":0.6},0.33333333333333331,"",0.5,"","","","","","","","","","","","","",""]
[4,{"$f":"$D$1","v":"BCBC"},"L-Name","Casey",null,"# of AB's",null,{"$f":"SUM(J25:AA25)","v":11},"AB's",4,null,3,4]
[null,null,"F-Name","Velarde",null,"# of Hits",null,{"$f":"SUM(J26:AA26)","v":4},"Hits",1,null,1,2]
[null,null,null,null,null,"# of PA",null,{"$f":"SUM(J27:AA27)","v":12},"PA",5,null,3,4]
[null,null,null,"f",null,"Avg",null,{"$f":"IF(H25=0,\"\",H26/H25)","v":0.36363636363636365},"Avg",{"$f":"IF(J25=\"\",\"\",J26/J25)","v":0.25},"",0.33333333333333331,0.5,"","","","","","","","","","","","","",""]
[5,{"$f":"$D$1","v":"BCBC"},"L-Name","Ben",null,"# of AB's",null,{"$f":"SUM(J29:AA29)","v":11},"AB's",5,3,null,3]
[null,null,"F-Name","Mangum",null,"# of Hits",null,{"$f":"SUM(J30:AA30)","v":10},"Hits",4,3,null,3]
[null,null,null,null,null,"# of PA",null,{"$f":"SUM(J31:AA31)","v":11},"PA",5,3,null,3]
[null,null,null,"m",null,"Avg",null,{"$f":"IF(H29=0,\"\",H30/H29)","v":0.90909090909090906},"Avg",{"$f":"IF(J29=\"\",\"\",J30/J29)","v":0.8},1,"",1,"","","","","","","","","","","","","",""]
[6,{"$f":"$D$1","v":"BCBC"},"L-Name","Tiff",null,"# of AB's",null,{"$f":"SUM(J33:AA33)","v":10},"AB's",4,3,3]
[null,null,"F-Name","Morton",null,"# of Hits",null,{"$f":"SUM(J34:AA34)","v":4},"Hits",2,1,1]
[null,null,null,null,null,"# of PA",null,{"$f":"SUM(J35:AA35)","v":11},"PA",5,3,3]
[null,null,null,"f",null,"Avg",null,{"$f":"IF(H33=0,\"\",H34/H33)","v":0.4},"Avg",{"$f":"IF(J33=\"\",\"\",J34/J33)","v":0.5},0.33333333333333331,0.33333333333333331,"","","","","","","","","","","","","","",""]
[7,{"$f":"$D$1","v":"BCBC"},"L-Name","Jeff",null,"# of AB's",null,{"$f":"SUM(J37:AA37)","v":14},"AB's",5,2,3,4]
[null,null,"F-Name","Nielsen",null,"# of Hits",null,{"$f":"SUM(J38:AA38)","v":7},"Hits",2,1,2,2]
[null,null,null,null,null,"# of PA",null,{"$f":"SUM(J39:AA39)","v":14},"PA",5,2,3,4]
[null,null,null,"m",null,"Avg",null,{"$f":"IF(H37=0,\"\",H38/H37)","v":0.5},"Avg",{"$f":"IF(J37=\"\",\"\",J38/J37)","v":0.4},0.5,0.66666666666666663,0.5,"","","","","","","","","","","","","",""]
[8,{"$f":"$D$1","v":"BCBC"},"L-Name","Maree",null,"# of AB's",null,{"$f":"SUM(J41:AA41)","v":13},"AB's",4,3,3,3]
[null,null,"F-Name","Achermann",null,"# of Hits",null,{"$f":"SUM(J42:AA42)","v":2},"Hits",0,0,1,1]
[null,null,null,null,null,"# of PA",null,{"$f":"SUM(J43:AA43)","v":13},"PA",4,3,3,3]
[null,null,null,"f",null,"Avg",null,{"$f":"IF(H41=0,\"\",H42/H41)","v":0.15384615384615385},"Avg",{"$f":"IF(J41=\"\",\"\",J42/J41)","v":0},0,0.33333333333333331,0.33333333333333331,"","","","","","","","","","","","","",""]
[9,{"$f":"$D$1","v":"BCBC"},"L-Name","Dustin",null,"# of AB's",null,{"$f":"SUM(J45:AA45)","v":12},"AB's",4,2,3,3]
[null,null,"F-Name","Hunter",null,"# of Hits",null,{"$f":"SUM(J46:AA46)","v":9},"Hits",3,2,2,2]
[null,null,null,null,null,"# of PA",null,{"$f":"SUM(J47:AA47)","v":12},"PA",4,2,3,3]
[null,null,null,"m",null,"Avg",null,{"$f":"IF(H45=0,\"\",H46/H45)","v":0.75},"Avg",{"$f":"IF(J45=\"\",\"\",J46/J45)","v":0.75},1,0.66666666666666663,0.66666666666666663,"","","","","","","","","","","","","",""]
[10,{"$f":"$D$1","v":"BCBC"},null,"Sunni",null,"# of AB's",null,{"$f":"SUM(J49:AA49)","v":7},"AB's",4,3]
[null,null,null,"Jackson",null,"# of Hits",null,{"$f":"SUM(J50:AA50)","v":3},"Hits",2,1]
[null,null,null,null,null,"# of PA",null,{"$f":"SUM(J51:AA51)","v":7},"PA",4,3]
[null,null,null,"f",null,"Avg",null,{"$f":"IF(H49=0,\"\",H50/H49)","v":0.42857142857142855},"Avg",{"$f":"IF(J49=\"\",\"\",J50/J49)","v":0.5},0.33333333333333331,"","","","","","","","","","","","","","","",""]
[11,{"$f":"$D$1","v":"BCBC"},"L-Name","Shane",null,"# of AB's",null,{"$f":"SUM(J53:AA53)","v":9},"AB's",3,3,3]
[null,null,"F-Name","Singer",null,"# of Hits",null,{"$f":"SUM(J54:AA54)","v":8},"Hits",3,3,2]
[null,null,null,null,null,"# of PA",null,{"$f":"SUM(J55:AA55)","v":10},"PA",4,3,3]
[null,null,null,"m",null,"Avg",null,{"$f":"IF(H53=0,\"\",H54/H53)","v":0.88888888888888884},"Avg",{"$f":"IF(J53=\"\",\"\",J54/J53)","v":1},1,0.66666666666666663,"","","","","","","","","","","","","","",""]
[12,{"$f":"$D$1","v":"BCBC"},"Ha","Mel",null,"# of AB's",null,{"$f":"SUM(J57:AA57)","v":11},"AB's",3,2,3,3]
[null,null,"F-Name","Maile",null,"# of Hits",null,{"$f":"SUM(J58:AA58)","v":1},"Hits",0,0,0,1]
[null,null,null,null,null,"# of PA",null,{"$f":"SUM(J59:AA59)","v":12},"PA",4,2,3,3]
[null,null,null,"f",null,"Avg",null,{"$f":"IF(H57=0,\"\",H58/H57)","v":9.0909090909090912E-2},"Avg",{"$f":"IF(J57=\"\",\"\",J58/J57)","v":0},0,0,0.33333333333333331,"","","","","","","","","","","","","",""]
[null,{"$f":"$D$1","v":"BCBC"},"L-Name","Robyne",null,"# of AB's",null,{"$f":"SUM(J61:AA61)","v":5},"AB's",null,2,3]
[null,null,"F-Name","Oostveen",null,"# of Hits",null,{"$f":"SUM(J62:AA62)","v":0},"Hits",null,0,0]
[null,null,null,null,null,"# of PA",null,{"$f":"SUM(J63:AA63)","v":5},"PA",null,2,3]
[null,null,null,"f",null,"Avg",null,{"$f":"IF(H61=0,\"\",H62/H61)","v":0},"Avg",{"$f":"IF(J61=\"\",\"\",J62/J61)","v":""},0,0,"","","","","","","","","","","","","","",""]
[14,{"$f":"$D$1","v":"BCBC"},"L-Name","AJ",null,"# of AB's",null,{"$f":"SUM(J65:AA65)","v":3},"AB's",null,null,3]
[null,null,"F-Name","Avellar",null,"# of Hits",null,{"$f":"SUM(J66:AA66)","v":2},"Hits",null,null,2]
[null,null,null,null,null,"# of PA",null,{"$f":"SUM(J67:AA67)","v":3},"PA",null,null,3]
[null,null,null,"m",null,"Avg",null,{"$f":"IF(H65=0,\"\",H66/H65)","v":0.66666666666666663},"Avg",{"$f":"IF(J65=\"\",\"\",J66/J65)","v":""},"",0.66666666666666663,"","","","","","","","","","","","","","",""]
[15,{"$f":"$D$1","v":"BCBC"},"L-Name","Scotty",null,"# of AB's",null,{"$f":"SUM(J69:AA69)","v":3},"AB's",null,null,3]
[null,null,"F-Name","Garfield",null,"# of Hits",null,{"$f":"SUM(J70:AA70)","v":2},"Hits",null,null,2]
[null,null,null,null,null,"# of PA",null,{"$f":"SUM(J71:AA71)","v":3},"PA",null,null,3]
[null,null,null,"m",null,"Avg",null,{"$f":"IF(H69=0,\"\",H70/H69)","v":0.66666666666666663},"Avg",{"$f":"IF(J69=\"\",\"\",J70/J69)","v":""},"",0.66666666666666663,"","","","","","","","","","","","","","",""]
[16,{"$f":"$D$1","v":"BCBC"},"L-Name","Karen ",null,"# of AB's",null,{"$f":"SUM(J73:AA73)","v":4},"AB's",null,null,null,4]
[null,null,"F-Name","Springer",null,"# of Hits",null,{"$f":"SUM(J74:AA74)","v":2},"Hits",null,null,null,2]
[null,null,null,null,null,"# of PA",null,{"$f":"SUM(J75:AA75)","v":4},"PA",null,null,null,4]
[null,null,null,"f",null,"Avg",null,{"$f":"IF(H73=0,\"\",H74/H73)","v":0.5},"Avg",{"$f":"IF(J73=\"\",\"\",J74/J73)","v":""},"","",0.5,"","","","","","","","","","","","","",""]
[17,{"$f":"$D$1","v":"BCBC"},"L-Name","Craig",null,"# of AB's",null,{"$f":"SUM(J77:AA77)","v":3},"AB's",null,null,null,3]
[null,null,"F-Name","Patten",null,"# of Hits",null,{"$f":"SUM(J78:AA78)","v":1},"Hits",null,null,null,1]
[null,null,null,null,null,"# of PA",null,{"$f":"SUM(J79:AA79)","v":3},"PA",null,null,null,3]
[null,null,null,"m",null,"Avg",null,{"$f":"IF(H77=0,\"\",H78/H77)","v":0.33333333333333331},"Avg",{"$f":"IF(J77=\"\",\"\",J78/J77)","v":""},"","",0.33333333333333331,"","","","","","","","","","","","","",""]
[18,{"$f":"$D$1","v":"BCBC"},"L-Name","Melinda",null,"# of AB's",null,{"$f":"SUM(J81:AA81)","v":3},"AB's",null,null,null,3]
[null,null,"F-Name",null,null,"# of Hits",null,{"$f":"SUM(J82:AA82)","v":0},"Hits",null,null,null,0]
[null,null,null,null,null,"# of PA",null,{"$f":"SUM(J83:AA83)","v":3},"PA",null,null,null,3]
[null,null,null,"f",null,"Avg",null,{"$f":"IF(H81=0,\"\",H82/H81)","v":0},"Avg",{"$f":"IF(J81=\"\",\"\",J82/J81)","v":""},"","",0,"","","","","","","","","","","","","",""]
[19,{"$f":"$D$1","v":"BCBC"},"L-Name",null,null,"# of AB's",null,{"$f":"SUM(J85:AA85)","v":0},"AB's"]
[null,null,"F-Name",null,null,"# of Hits",null,{"$f":"SUM(J86:AA86)","v":0},"Hits"]
[null,null,null,null,null,"# of PA",null,{"$f":"SUM(J87:AA87)","v":0},"PA"]
[null,null,null,"f",null,"Avg",null,{"$f":"IF(H85=0,\"\",H86/H85)","v":""},"Avg",{"$f":"IF(J85=\"\",\"\",J86/J85)","v":""},"","","","","","","","","","","","","","","","",""]
[20,{"$f":"$D$1","v":"BCBC"},"L-Name",null,null,"# of AB's",null,{"$f":"SUM(J89:AA89)","v":0},"AB's"]
[null,null,"F-Name",null,null,"# of Hits",null,{"$f":"SUM(J90:AA90)","v":0},"Hits"]
[null,null,null,null,null,"# of PA",null,{"$f":"SUM(J91:AA91)","v":0},"PA"]
[null,null,null,"f",null,"Avg",null,{"$f":"IF(H89=0,\"\",H90/H89)","v":""},"Avg",{"$f":"IF(J89=\"\",\"\",J90/J89)","v":""},"","","","","","","","","","","","","","","","",""]
[21,{"$f":"$D$1","v":"BCBC"},"L-Name",null,null,"# of AB's",null,{"$f":"SUM(J93:AA93)","v":0},"AB's"]
[null,null,"F-Name",null,null,"# of Hits",null,{"$f":"SUM(J94:AA94)","v":0},"Hits"]
[null,null,null,null,null,"# of PA",null,{"$f":"SUM(J95:AA95)","v":0},"PA"]
[null,null,null,"f",null,"Avg",null,{"$f":"IF(H93=0,\"\",H94/H93)","v":""},"Avg",{"$f":"IF(J93=\"\",\"\",J94/J93)","v":""},"","","","","","","","","","","","","","","","",""]
[22,{"$f":"$D$1","v":"BCBC"},"L-Name",null,null,"# of AB's",null,{"$f":"SUM(J97:AA97)","v":0},"AB's"]
[null,null,"F-Name",null,null,"# of Hits",null,{"$f":"SUM(J98:AA98)","v":0},"Hits"]
[null,null,null,null,null,"# of PA",null,{"$f":"SUM(J99:AA99)","v":0},"PA"]
[null,null,null,"f",null,"Avg",null,{"$f":"IF(H97=0,\"\",H98/H97)","v":""},"Avg",{"$f":"IF(J97=\"\",\"\",J98/J97)","v":""},"","","","","","","","","","","","","","","","",""]
[23,{"$f":"$D$1","v":"BCBC"},"L-Name",null,null,"# of AB's",null,{"$f":"SUM(J101:AA101)","v":0},"AB's"]
[null,null,"F-Name",null,null,"# of Hits",null,{"$f":"SUM(J102:AA102)","v":0},"Hits"]
[null,null,null,null,null,"# of PA",null,{"$f":"SUM(J103:AA103)","v":0},"PA"]
[null,null,null,"f",null,"Avg",null,{"$f":"IF(H101=0,\"\",H102/H101)","v":""},"Avg",{"$f":"IF(J101=\"\",\"\",J102/J101)","v":""},"","","","","","","","","","","","","","","","",""]
[24,{"$f":"$D$1","v":"BCBC"},"L-Name",null,null,"# of AB's",null,{"$f":"SUM(J105:AA105)","v":0},"AB's"]
[null,null,"F-Name",null,null,"# of Hits",null,{"$f":"SUM(J106:AA106)","v":0},"Hits"]
[null,null,null,null,null,"# of PA",null,{"$f":"SUM(J107:AA107)","v":0},"PA"]
[null,null,null,"f",null,"Avg",null,{"$f":"IF(H105=0,\"\",H106/H105)","v":""},"Avg",{"$f":"IF(J105=\"\",\"\",J106/J105)","v":""},"","","","","","","","","","","","","","","","",""]
[25,{"$f":"$D$1","v":"BCBC"},"L-Name",null,null,"# of AB's",null,{"$f":"SUM(J109:AA109)","v":0},"AB's"]
[null,null,"F-Name",null,null,"# of Hits",null,{"$f":"SUM(J110:AA110)","v":0},"Hits"]
[null,null,null,null,null,"# of PA",null,{"$f":"SUM(J111:AA111)","v":0},"PA"]
[null,null,null,"f",null,"Avg",null,{"$f":"IF(H109=0,\"\",H110/H109)","v":""},"Avg",{"$f":"IF(J109=\"\",\"\",J110/J109)","v":""},"","","","","","","","","","","","","","","","",""]
[null,{"$f":"$D$1","v":"BCBC"},null,"TEAM",null,"# of AB's",null,{"$f":"SUM(J113:AA113)","v":152},"AB's",{"$f":"IF(SUM(J109,J105,J101,J97,J93,J89,J85,J81,J77,J73,J69,J65,J61,J57,J53,J49,J45,J41,J37,J33,J29,J25,J21,J17,J13)=0,\"\",SUM(J13,J17,J21,J25,J29,J33,J37,J41,J45,J49,J53,J57,J61,J65,J69,J73,J77,J81,J85,J89,J93,J97,J101,J105,J109))","v":51},31,36,34,"","","","","","","","","","","","","",""]
[null,null,null,"Summary",null,"# of Hits",null,{"$f":"SUM(J114:AA114)","v":73},"Hits",{"$f":"IF(SUM(J110,J106,J102,J98,J94,J90,J86,J82,J78,J74,J70,J66,J62,J58,J54,J50,J46,J42,J38,J34,J30,J26,J22,J18,J14)=0,\"\",SUM(J14,J18,J22,J26,J30,J34,J38,J42,J46,J50,J54,J58,J62,J66,J70,J74,J78,J82,J86,J90,J94,J98,J102,J106,J110))","v":26},14,17,16,"","","","","","","","","","","","","",""]
[null,null,null,null,null,"Avg",null,{"$f":"IF(H113=0,\"N/A\",H114/H113)","v":0.48026315789473684},"Avg",{"$f":"IF(J113=\"\",\"\",J114/J113)","v":0.50980392156862742},0.45161290322580644,0.47222222222222221,0.47058823529411764,"","","","","","","","","","","","","",""]

{"sheet":"Ghetto Bombers","index":3,"n_rows":115,"n_cols":27,"rows_kept":115,"cut":false,"hidden":false,"merged":[]}
[null,null,"Team Name","Ghetto Bombers",null,null,null,null,"Score",20,16,11,28]
[null,null,null,null,null,null,null,null,"Opponents Score",19,10,15,9]
[null,null,null,"Wins",null,{"$f":"SUM(J6:AA6)","v":3},null,null,"W or L",{"$f":"IF(SUM(J1,J2)=0,\"\",IF(J1<J2,\"L\",\"W\"))","v":"W"},"W","L","W","","","","","","","","","","","","","",""]
[null,null,null,"Losses",null,{"$f":"SUM(J7:AA7)","v":1},null,"Forfeit","FW or FL"]
[null,null,null,null,"games played excluding Forfeit Wins",null,null,null,null,{"$f":"IF(J3=\"\",\"\",IF(J4=\"FW\",\"\",1))","v":1},1,1,1,"","","","","","","","","","","","","",""]
[null,null,null,null,null,null,null,{"$f":"IF(H4=\"w\",1,\"\")","v":""},"win",{"$f":"IF(J3=\"w\",1,\"\")","v":1},1,"",1,"","","","","","","","","","","","","",""]
[null,null,null,null,null,null,null,{"$f":"IF(H4=\"l\",1,\"\")","v":""},"loss",{"$f":"IF(J3=\"l\",1,\"\")","v":""},"",1,"","","","","","","","","","","","","","",""]
[null,null,null,"Games Played Excluding Forfeit Wins",null,{"$f":"SUM(J5:AA5)","v":4},null,"Opponents Team Name",null,"BCBC","Thunder Ducks","Bad Pitches","BCBC"]
[null,null,null,"League Run Diff     ",null,{"$f":"SUM(J9:AA9)","v":22},null,null,"Game Run Diff",{"$f":"IF(J1=\"\",\"\",J1-J2)","v":1},6,-4,19,"","","","","","","","","","","","","",""]
[null,null,null,"Team Batting Avg   ",null,{"$f":"$H$115","v":0.58823529411764708},null,null,"Game Date","2023-08-10","2023-08-17","2023-08-24","2023-08-31","2023-09-07"]
[]
[null,null,null,null,null,null,null,"STATS",null,1,2,3,4,5,6,7,8,9,10,11,12,13,14,15,16,17,18]
[1,{"$f":"$D$1","v":"Ghetto Bombers"},"L-Name","Ryan",null,"# of AB's",null,{"$f":"SUM(J13:AA13)","v":13},"AB's",4,4,null,5]
[null,null,"F-Name","Newbold",null,"# of Hits",null,{"$f":"SUM(J14:AA14)","v":12},"Hits",4,4,null,4]
[null,null,null,null,null,"# of PA",null,{"$f":"SUM(J15:AA15)","v":14},"PA",5,4,null,5]
[null,null,null,"m",null,"Avg",null,{"$f":"IF(H13=0,\"\",(H14/H13))","v":0.92307692307692313},"Avg",{"$f":"IF(J13=\"\",\"\",J14/J13)","v":1},1,"",0.8,"","","","","","","","","","","","","",""]
[2,{"$f":"$D$1","v":"Ghetto Bombers"},"L-Name","Calleigh",null,"# of AB's",null,{"$f":"SUM(J17:AA17)","v":16},"AB's",5,4,4,3]
[null,null,"F-Name","DeYoung",null,"# of Hits",null,{"$f":"SUM(J18:AA18)","v":11},"Hits",3,2,3,3]
[null,null,null,null,null,"# of PA",null,{"$f":"SUM(J19:AA19)","v":18},"PA",5,4,4,5]
[null,null,null,"f",null,"Avg",null,{"$f":"IF(H17=0,\"\",H18/H17)","v":0.6875},"Avg",{"$f":"IF(J17=\"\",\"\",J18/J17)","v":0.6},0.5,0.75,1,"","","","","","","","","","","","","",""]
[3,{"$f":"$D$1","v":"Ghetto Bombers"},"L-Name","Matt",null,"# of AB's",null,{"$f":"SUM(J21:AA21)","v":17},"AB's",4,4,4,5]
[null,null,"F-Name","Newbold",null,"# of Hits",null,{"$f":"SUM(J22:AA22)","v":16},"Hits",4,4,4,4]
[null,null,null,null,null,"# of PA",null,{"$f":"SUM(J23:AA23)","v":18},"PA",5,4,4,5]
[null,null,null,"m",null,"Avg",null,{"$f":"IF(H21=0,\"\",H22/H21)","v":0.94117647058823528},"Avg",{"$f":"IF(J21=\"\",\"\",J22/J21)","v":1},1,1,0.8,"","","","","","","","","","","","","",""]
[4,{"$f":"$D$1","v":"Ghetto Bombers"},"L-Name","Brandi",null,"# of AB's",null,{"$f":"SUM(J25:AA25)","v":18},"AB's",5,4,4,5]
[null,null,"F-Name","Hall",null,"# of Hits",null,{"$f":"SUM(J26:AA26)","v":10},"Hits",3,3,1,3]
[null,null,null,null,null,"# of PA",null,{"$f":"SUM(J27:AA27)","v":18},"PA",5,4,4,5]
[null,null,null,"f",null,"Avg",null,{"$f":"IF(H25=0,\"\",H26/H25)","v":0.55555555555555558},"Avg",{"$f":"IF(J25=\"\",\"\",J26/J25)","v":0.6},0.75,0.25,0.6,"","","","","","","","","","","","","",""]
[5,{"$f":"$D$1","v":"Ghetto Bombers"},"L-Name","Mac",null,"# of AB's",null,{"$f":"SUM(J29:AA29)","v":17},"AB's",5,3,4,5]
[null,null,"F-Name","Estrada",null,"# of Hits",null,{"$f":"SUM(J30:AA30)","v":7},"Hits",2,0,1,4]
[null,null,null,null,null,"# of PA",null,{"$f":"SUM(J31:AA31)","v":18},"PA",5,4,4,5]
[null,null,null,"m",null,"Avg",null,{"$f":"IF(H29=0,\"\",H30/H29)","v":0.41176470588235292},"Avg",{"$f":"IF(J29=\"\",\"\",J30/J29)","v":0.4},0,0.25,0.8,"","","","","","","","","","","","","",""]
[6,{"$f":"$D$1","v":"Ghetto Bombers"},"L-Name","JoJo",null,"# of AB's",null,{"$f":"SUM(J33:AA33)","v":10},"AB's",4,3,3]
[null,null,"F-Name","Carlson",null,"# of Hits",null,{"$f":"SUM(J34:AA34)","v":5},"Hits",2,1,2]
[null,null,null,null,null,"# of PA",null,{"$f":"SUM(J35:AA35)","v":10},"PA",4,3,3]
[null,null,null,"f",null,"Avg",null,{"$f":"IF(H33=0,\"\",H34/H33)","v":0.5},"Avg",{"$f":"IF(J33=\"\",\"\",J34/J33)","v":0.5},0.33333333333333331,0.66666666666666663,"","","","","","","","","","","","","","",""]
[7,{"$f":"$D$1","v":"Ghetto Bombers"},"L-Name","Chet",null,"# of AB's",null,{"$f":"SUM(J37:AA37)","v":12},"AB's",4,4,4]
[null,null,"F-Name","Wanlass",null,"# of Hits",null,{"$f":"SUM(J38:AA38)","v":7},"Hits",2,2,3]
[null,null,null,null,null,"# of PA",null,{"$f":"SUM(J39:AA39)","v":12},"PA",4,4,4]
[null,null,null,"m",null,"Avg",null,{"$f":"IF(H37=0,\"\",H38/H37)","v":0.58333333333333337},"Avg",{"$f":"IF(J37=\"\",\"\",J38/J37)","v":0.5},0.5,0.75,"","","","","","","","","","","","","","",""]
[8,{"$f":"$D$1","v":"Ghetto Bombers"},"L-Name","Ali",null,"# of AB's",null,{"$f":"SUM(J41:AA41)","v":6},"AB's",4,null,2]
[null,null,"F-Name","Smith",null,"# of Hits",null,{"$f":"SUM(J42:AA42)","v":0},"Hits",0,null,0]
[null,null,null,null,null,"# of PA",null,{"$f":"SUM(J43:AA43)","v":7},"PA",4,null,3]
[null,null,null,"f",null,"Avg",null,{"$f":"IF(H41=0,\"\",H42/H41)","v":0},"Avg",{"$f":"IF(J41=\"\",\"\",J42/J41)","v":0},"",0,"","","","","","","","","","","","","","",""]
[9,{"$f":"$D$1","v":"Ghetto Bombers"},"L-Name","Derek",null,"# of AB's",null,{"$f":"SUM(J45:AA45)","v":12},"AB's",4,null,3,5]
[null,null,"F-Name","Smith",null,"# of Hits",null,{"$f":"SUM(J46:AA46)","v":4},"Hits",2,null,0,2]
[null,null,null,null,null,"# of PA",null,{"$f":"SUM(J47:AA47)","v":13},"PA",4,null,4,5]
[null,null,null,"m",null,"Avg",null,{"$f":"IF(H45=0,\"\",H46/H45)","v":0.33333333333333331},"Avg",{"$f":"IF(J45=\"\",\"\",J46/J45)","v":0.5},"",0,0.4,"","","","","","","","","","","","","",""]
[10,{"$f":"$D$1","v":"Ghetto Bombers"},"L-Name","Heidi",null,"# of AB's",null,{"$f":"SUM(J49:AA49)","v":15},"AB's",4,3,3,5]
[null,null,"F-Name","Taylor",null,"# of Hits",null,{"$f":"SUM(J50:AA50)","v":7},"Hits",2,1,1,3]
[null,null,null,null,null,"# of PA",null,{"$f":"SUM(J51:AA51)","v":16},"PA",4,3,4,5]
[null,null,null,"f",null,"Avg",null,{"$f":"IF(H49=0,\"\",H50/H49)","v":0.46666666666666667},"Avg",{"$f":"IF(J49=\"\",\"\",J50/J49)","v":0.5},0.33333333333333331,0.33333333333333331,0.6,null,"","","","","","","","","","","","",""]
[11,{"$f":"$D$1","v":"Ghetto Bombers"},"L-Name","Dave",null,"# of AB's",null,{"$f":"SUM(J53:AA53)","v":14},"AB's",4,3,3,4]
[null,null,"F-Name","Vu",null,"# of Hits",null,{"$f":"SUM(J54:AA54)","v":7},"Hits",2,1,3,1]
[null,null,null,null,null,"# of PA",null,{"$f":"SUM(J55:AA55)","v":14},"PA",4,3,3,4]
[null,null,null,"m",null,"Avg",null,{"$f":"IF(H53=0,\"\",H54/H53)","v":0.5},"Avg",{"$f":"IF(J53=\"\",\"\",J54/J53)","v":0.5},0.33333333333333331,1,0.25,"","","","","","","","","","","","","",""]
[12,{"$f":"$D$1","v":"Ghetto Bombers"},"L-Name","Ally",null,"# of AB's",null,{"$f":"SUM(J57:AA57)","v":3},"AB's",3]
[null,null,"F-Name","McAfee",null,"# of Hits",null,{"$f":"SUM(J58:AA58)","v":1},"Hits",1]
[null,null,null,null,null,"# of PA",null,{"$f":"SUM(J59:AA59)","v":4},"PA",4]
[null,null,null,"f",null,"Avg",null,{"$f":"IF(H57=0,\"\",H58/H57)","v":0.33333333333333331},"Avg",{"$f":"IF(J57=\"\",\"\",J58/J57)","v":0.33333333333333331},"","","","","","","","","","","","","","","","",""]
[13,{"$f":"$D$1","v":"Ghetto Bombers"},"L-Name","Jon",null,"# of AB's",null,{"$f":"SUM(J61:AA61)","v":10},"AB's",null,4,2,4]
[null,null,"F-Name","Staley",null,"# of Hits",null,{"$f":"SUM(J62:AA62)","v":7},"Hits",null,1,2,4]
[null,null,null,null,null,"# of PA",null,{"$f":"SUM(J63:AA63)","v":11},"PA",null,4,3,4]
[null,null,null,"m",null,"Avg",null,{"$f":"IF(H61=0,\"\",H62/H61)","v":0.7},"Avg",{"$f":"IF(J61=\"\",\"\",J62/J61)","v":""},0.25,1,1,"","","","","","","","","","","","","",""]
[14,{"$f":"$D$1","v":"Ghetto Bombers"},"L-Name","Danielle",null,"# of AB's",null,{"$f":"SUM(J65:AA65)","v":9},"AB's",null,4,null,5]
[null,null,"F-Name","Henesh",null,"# of Hits",null,{"$f":"SUM(J66:AA66)","v":7},"Hits",null,3,null,4]
[null,null,null,null,null,"# of PA",null,{"$f":"SUM(J67:AA67)","v":9},"PA",null,4,null,5]
[null,null,null,"f",null,"Avg",null,{"$f":"IF(H65=0,\"\",H66/H65)","v":0.77777777777777779},"Avg",{"$f":"IF(J65=\"\",\"\",J66/J65)","v":""},0.75,"",0.8,"","","","","","","","","","","","","",""]
[15,{"$f":"$D$1","v":"Ghetto Bombers"},"L-Name","Hope",null,"# of AB's",null,{"$f":"SUM(J69:AA69)","v":11},"AB's",null,4,3,4]
[null,null,"F-Name","Curtis",null,"# of Hits",null,{"$f":"SUM(J70:AA70)","v":6},"Hits",null,3,1,2]
[null,null,null,null,null,"# of PA",null,{"$f":"SUM(J71:AA71)","v":11},"PA",null,4,3,4]
[null,null,null,"f",null,"Avg",null,{"$f":"IF(H69=0,\"\",H70/H69)","v":0.54545454545454541},"Avg",{"$f":"IF(J69=\"\",\"\",J70/J69)","v":""},0.75,0.33333333333333331,0.5,"","","","","","","","","","","","","",""]
[16,{"$f":"$D$1","v":"Ghetto Bombers"},"L-Name","Britt",null,"# of AB's",null,{"$f":"SUM(J73:AA73)","v":4},"AB's",null,null,null,4]
[null,null,"F-Name","M",null,"# of Hits",null,{"$f":"SUM(J74:AA74)","v":3},"Hits",null,null,null,3]
[null,null,null,null,null,"# of PA",null,{"$f":"SUM(J75:AA75)","v":4},"PA",null,null,null,4]
[null,null,null,"f00",null,"Avg",null,{"$f":"IF(H73=0,\"\",H74/H73)","v":0.75},"Avg",{"$f":"IF(J73=\"\",\"\",J74/J73)","v":""},"","",0.75,"","","","","","","","","","","","","",""]
[17,{"$f":"$D$1","v":"Ghetto Bombers"},"L-Name",null,null,"# of AB's",null,{"$f":"SUM(J77:AA77)","v":0},"AB's"]
[null,null,"F-Name",null,null,"# of Hits",null,{"$f":"SUM(J78:AA78)","v":0},"Hits"]
[null,null,null,null,null,"# of PA",null,{"$f":"SUM(J79:AA79)","v":0},"PA"]
[null,null,null,"f",null,"Avg",null,{"$f":"IF(H77=0,\"\",H78/H77)","v":""},"Avg",{"$f":"IF(J77=\"\",\"\",J78/J77)","v":""},"","","","","","","","","","","","","","","","",""]
[18,{"$f":"$D$1","v":"Ghetto Bombers"},"L-Name",null,null,"# of AB's",null,{"$f":"SUM(J81:AA81)","v":0},"AB's"]
[null,null,"F-Name",null,null,"# of Hits",null,{"$f":"SUM(J82:AA82)","v":0},"Hits"]
[null,null,null,null,null,"# of PA",null,{"$f":"SUM(J83:AA83)","v":0},"PA"]
[null,null,null,"m",null,"Avg",null,{"$f":"IF(H81=0,\"\",H82/H81)","v":""},"Avg",{"$f":"IF(J81=\"\",\"\",J82/J81)","v":""},"","","","","","","","","","","","","","","","",""]
[19,{"$f":"$D$1","v":"Ghetto Bombers"},"L-Name",null,null,"# of AB's",null,{"$f":"SUM(J85:AA85)","v":0},"AB's"]
[null,null,"F-Name",null,null,"# of Hits",null,{"$f":"SUM(J86:AA86)","v":0},"Hits"]
[null,null,null,null,null,"# of PA",null,{"$f":"SUM(J87:AA87)","v":0},"PA"]
[null,null,null,"f",null,"Avg",null,{"$f":"IF(H85=0,\"\",H86/H85)","v":""},"Avg",{"$f":"IF(J85=\"\",\"\",J86/J85)","v":""},"","","","","","","","","","","","","","","","",""]
[20,{"$f":"$D$1","v":"Ghetto Bombers"},"L-Name",null,null,"# of AB's",null,{"$f":"SUM(J89:AA89)","v":0},"AB's"]
[null,null,"F-Name",null,null,"# of Hits",null,{"$f":"SUM(J90:AA90)","v":0},"Hits"]
[null,null,null,null,null,"# of PA",null,{"$f":"SUM(J91:AA91)","v":0},"PA"]
[null,null,null,"f",null,"Avg",null,{"$f":"IF(H89=0,\"\",H90/H89)","v":""},"Avg",{"$f":"IF(J89=\"\",\"\",J90/J89)","v":""},"","","","","","","","","","","","","","","","",""]
[21,{"$f":"$D$1","v":"Ghetto Bombers"},"L-Name",null,null,"# of AB's",null,{"$f":"SUM(J93:AA93)","v":0},"AB's"]
[null,null,"F-Name",null,null,"# of Hits",null,{"$f":"SUM(J94:AA94)","v":0},"Hits"]
[null,null,null,null,null,"# of PA",null,{"$f":"SUM(J95:AA95)","v":0},"PA"]
[null,null,null,"f",null,"Avg",null,{"$f":"IF(H93=0,\"\",H94/H93)","v":""},"Avg",{"$f":"IF(J93=\"\",\"\",J94/J93)","v":""},"","","","","","","","","","","","","","","","",""]
[22,{"$f":"$D$1","v":"Ghetto Bombers"},"L-Name",null,null,"# of AB's",null,{"$f":"SUM(J97:AA97)","v":0},"AB's"]
[null,null,"F-Name",null,null,"# of Hits",null,{"$f":"SUM(J98:AA98)","v":0},"Hits"]
[null,null,null,null,null,"# of PA",null,{"$f":"SUM(J99:AA99)","v":0},"PA"]
[null,null,null,"f",null,"Avg",null,{"$f":"IF(H97=0,\"\",H98/H97)","v":""},"Avg",{"$f":"IF(J97=\"\",\"\",J98/J97)","v":""},"","","","","","","","","","","","","","","","",""]
[23,{"$f":"$D$1","v":"Ghetto Bombers"},"L-Name",null,null,"# of AB's",null,{"$f":"SUM(J101:AA101)","v":0},"AB's"]
[null,null,"F-Name",null,null,"# of Hits",null,{"$f":"SUM(J102:AA102)","v":0},"Hits"]
[null,null,null,null,null,"# of PA",null,{"$f":"SUM(J103:AA103)","v":0},"PA"]
[null,null,null,"f",null,"Avg",null,{"$f":"IF(H101=0,\"\",H102/H101)","v":""},"Avg",{"$f":"IF(J101=\"\",\"\",J102/J101)","v":""},"","","","","","","","","","","","","","","","",""]
[24,{"$f":"$D$1","v":"Ghetto Bombers"},"L-Name",null,null,"# of AB's",null,{"$f":"SUM(J105:AA105)","v":0},"AB's"]
[null,null,"F-Name",null,null,"# of Hits",null,{"$f":"SUM(J106:AA106)","v":0},"Hits"]
[null,null,null,null,null,"# of PA",null,{"$f":"SUM(J107:AA107)","v":0},"PA"]
[null,null,null,"f",null,"Avg",null,{"$f":"IF(H105=0,\"\",H106/H105)","v":""},"Avg",{"$f":"IF(J105=\"\",\"\",J106/J105)","v":""},"","","","","","","","","","","","","","","","",""]
[25,{"$f":"$D$1","v":"Ghetto Bombers"},"L-Name",null,null,"# of AB's",null,{"$f":"SUM(J109:AA109)","v":0},"AB's"]
[null,null,"F-Name",null,null,"# of Hits",null,{"$f":"SUM(J110:AA110)","v":0},"Hits"]
[null,null,null,null,null,"# of PA",null,{"$f":"SUM(J111:AA111)","v":0},"PA"]
[null,null,null,"f",null,"Avg",null,{"$f":"IF(H109=0,\"\",H110/H109)","v":""},"Avg",{"$f":"IF(J109=\"\",\"\",J110/J109)","v":""},"","","","","","","","","","","","","","","","",""]
[null,{"$f":"$D$1","v":"Ghetto Bombers"},null,"TEAM",null,"# of AB's",null,{"$f":"SUM(J113:AA113)","v":187},"AB's",{"$f":"IF(SUM(J109,J105,J101,J97,J93,J89,J85,J81,J77,J73,J69,J65,J61,J57,J53,J49,J45,J41,J37,J33,J29,J25,J21,J17,J13)=0,\"\",SUM(J13,J17,J21,J25,J29,J33,J37,J41,J45,J49,J53,J57,J61,J65,J69,J73,J77,J81,J85,J89,J93,J97,J101,J105,J109))","v":50},44,39,54,"","","","","","","","","","","","","",""]
[null,null,null,"Summary",null,"# of Hits",null,{"$f":"SUM(J114:AA114)","v":110},"Hits",{"$f":"IF(SUM(J110,J106,J102,J98,J94,J90,J86,J82,J78,J74,J70,J66,J62,J58,J54,J50,J46,J42,J38,J34,J30,J26,J22,J18,J14)=0,\"\",SUM(J14,J18,J22,J26,J30,J34,J38,J42,J46,J50,J54,J58,J62,J66,J70,J74,J78,J82,J86,J90,J94,J98,J102,J106,J110))","v":27},25,21,37,"","","","","","","","","","","","","",""]
[null,null,null,null,null,"Avg",null,{"$f":"IF(H113=0,\"N/A\",H114/H113)","v":0.58823529411764708},"Avg",{"$f":"IF(J113=\"\",\"\",J114/J113)","v":0.54},0.56818181818181823,0.53846153846153844,0.68518518518518523,"","","","","","","","","","","","","",""]

{"sheet":"Thunder Ducks","index":4,"n_rows":115,"n_cols":27,"rows_kept":115,"cut":false,"hidden":false,"merged":[]}
[null,null,"Team Name","Thunder Ducks",null,null,null,null,"Score",22,10,21,0]
[null,null,null,null,null,null,null,null,"Opponents Score",21,16,8,7]
[null,null,null,"Wins",null,{"$f":"SUM(J6:AA6)","v":2},null,null,"W or L",{"$f":"IF(SUM(J1,J2)=0,\"\",IF(J1<J2,\"L\",\"W\"))","v":"W"},"L","W","L","","","",{"$f":"IF(SUM(Q1,Q2)=0,\"\",IF(Q1<Q2,\"L\",\"W\"))","v":""},"","","","","","","","","",""]
[null,null,null,"Losses",null,{"$f":"SUM(J7:AA7)","v":2},null,"Forfeit","FW or FL",null,null,null,"FL",null,null,null,null,"  "]
[null,null,null,null,"games played excluding Forfeit Wins",null,null,null,null,{"$f":"IF(J3=\"\",\"\",IF(J4=\"FW\",\"\",1))","v":1},1,1,1,"","","",{"$f":"IF(Q3=\"\",\"\",IF(Q4=\"FW\",\"\",1))","v":""},"","","","","","","","","",""]
[null,null,null,null,null,null,null,{"$f":"IF(H4=\"w\",1,\"\")","v":""},"win",{"$f":"IF(J3=\"w\",1,\"\")","v":1},"",1,"","","","",{"$f":"IF(Q3=\"w\",1,\"\")","v":""},"","","","","","","","","",""]
[null,null,null,null,null,null,null,{"$f":"IF(H4=\"l\",1,\"\")","v":""},"loss",{"$f":"IF(J3=\"l\",1,\"\")","v":""},1,"",1,"","","",{"$f":"IF(Q3=\"l\",1,\"\")","v":""},"","","","","","","","","",""]
[null,null,null,"Games Played Excluding Forfeit Wins",null,{"$f":"SUM(J5:AA5)","v":4},null,"Opponents Team Name",null,"Bad Pithes","Ghetto Bombers","BCBC","Bad Pitches"]
[null,null,null,"League Run Diff     ",null,{"$f":"SUM(J9:AA9)","v":0},null,null,"Game Run Diff",null,{"$f":"IF(K1=\"\",\"\",K1-K2)","v":-6},13,-7,"","","",null,{"$f":"IF(R1=\"\",\"\",R1-R2)","v":""},"","","","","","","","",""]
[null,null,null,"Team Batting Avg   ",null,{"$f":"$H$115","v":0.54135338345864659},null,null,"Game Date","2023-08-10","2023-08-17","2023-08-24","2023-08-31","2023-09-07"]
[]
[null,null,null,null,null,null,null,"STATS",null,1,2,3,4,5,6,7,8,9,10,11,12,13,14,15,16,17,18]
[1,{"$f":"$D$1","v":"Thunder Ducks"},"L-Name","Steve",null,"# of AB's",null,{"$f":"SUM(J13:AA13)","v":15},"AB's",6,4,5]
[null,null,"F-Name","Hart",null,"# of Hits",null,{"$f":"SUM(J14:AA14)","v":11},"Hits",3,4,4]
[null,null,null,null,null,"# of PA",null,{"$f":"SUM(J15:AA15)","v":16},"PA",7,4,5]
[null,null,null,"m",null,"Avg",null,{"$f":"IF(H13=0,\"\",(H14/H13))","v":0.73333333333333328},"Avg",{"$f":"IF(J13=\"\",\"\",J14/J13)","v":0.5},1,0.8,"","","","",{"$f":"IF(Q13=\"\",\"\",Q14/Q13)","v":""},"","","","","","","","","",""]
[2,{"$f":"$D$1","v":"Thunder Ducks"},"L-Name","Josie",null,"# of AB's",null,{"$f":"SUM(J17:AA17)","v":12},"AB's",5,4,3]
[null,null,"F-Name","Harris",null,"# of Hits",null,{"$f":"SUM(J18:AA18)","v":4},"Hits",1,1,2]
[null,null,null,null,null,"# of PA",null,{"$f":"SUM(J19:AA19)","v":14},"PA",6,4,4]
[null,null,null,"f",null,"Avg",null,{"$f":"IF(H17=0,\"\",H18/H17)","v":0.33333333333333331},"Avg",{"$f":"IF(J17=\"\",\"\",J18/J17)","v":0.2},0.25,0.66666666666666663,"","","","",{"$f":"IF(Q17=\"\",\"\",Q18/Q17)","v":""},"","","","","","","","","",""]
[3,{"$f":"$D$1","v":"Thunder Ducks"},"L-Name","Logan",null,"# of AB's",null,{"$f":"SUM(J21:AA21)","v":15},"AB's",6,4,5]
[null,null,"F-Name","Bateman",null,"# of Hits",null,{"$f":"SUM(J22:AA22)","v":9},"Hits",3,3,3]
[null,null,null,null,null,"# of PA",null,{"$f":"SUM(J23:AA23)","v":15},"PA",6,4,5]
[null,null,null,"m",null,"Avg",null,{"$f":"IF(H21=0,\"\",H22/H21)","v":0.6},"Avg",{"$f":"IF(J21=\"\",\"\",J22/J21)","v":0.5},0.75,0.6,"","","","",{"$f":"IF(Q21=\"\",\"\",Q22/Q21)","v":""},"","","","","","","","","",""]
[4,{"$f":"$D$1","v":"Thunder Ducks"},"L-Name","Jennie",null,"# of AB's",null,{"$f":"SUM(J25:AA25)","v":13},"AB's",5,4,4]
[null,null,"F-Name","Anderson",null,"# of Hits",null,{"$f":"SUM(J26:AA26)","v":6},"Hits",3,1,2]
[null,null,null,null,null,"# of PA",null,{"$f":"SUM(J27:AA27)","v":15},"PA",6,4,5]
[null,null,null,"f",null,"Avg",null,{"$f":"IF(H25=0,\"\",H26/H25)","v":0.46153846153846156},"Avg",{"$f":"IF(J25=\"\",\"\",J26/J25)","v":0.6},0.25,0.5,"","","","",{"$f":"IF(Q25=\"\",\"\",Q26/Q25)","v":""},"","","","","","","","","",""]
[5,{"$f":"$D$1","v":"Thunder Ducks"},"L-Name","Kyle",null,"# of AB's",null,{"$f":"SUM(J29:AA29)","v":9},"AB's",5,4]
[null,null,"F-Name","O'Bryant",null,"# of Hits",null,{"$f":"SUM(J30:AA30)","v":8},"Hits",5,3]
[null,null,null,null,null,"# of PA",null,{"$f":"SUM(J31:AA31)","v":10},"PA",6,4]
[null,null,null,"m",null,"Avg",null,{"$f":"IF(H29=0,\"\",H30/H29)","v":0.88888888888888884},"Avg",{"$f":"IF(J29=\"\",\"\",J30/J29)","v":1},0.75,"","","","","",{"$f":"IF(Q29=\"\",\"\",Q30/Q29)","v":""},"","","","","","","","","",""]
[6,{"$f":"$D$1","v":"Thunder Ducks"},"L-Name","Emily",null,"# of AB's",null,{"$f":"SUM(J33:AA33)","v":6},"AB's",6]
[null,null,"F-Name","Ross",null,"# of Hits",null,{"$f":"SUM(J34:AA34)","v":3},"Hits",3]
[null,null,null,null,null,"# of PA",null,{"$f":"SUM(J35:AA35)","v":6},"PA",6]
[null,null,null,"f",null,"Avg",null,{"$f":"IF(H33=0,\"\",H34/H33)","v":0.5},"Avg",{"$f":"IF(J33=\"\",\"\",J34/J33)","v":0.5},"","","","","","",{"$f":"IF(Q33=\"\",\"\",Q34/Q33)","v":""},"","","","","","","","","",""]
[7,{"$f":"$D$1","v":"Thunder Ducks"},"L-Name","Russ",null,"# of AB's",null,{"$f":"SUM(J37:AA37)","v":14},"AB's",5,4,5]
[null,null,"F-Name","Collins",null,"# of Hits",null,{"$f":"SUM(J38:AA38)","v":9},"Hits",4,3,2]
[null,null,null,null,null,"# of PA",null,{"$f":"SUM(J39:AA39)","v":15},"PA",6,4,5]
[null,null,null,"m",null,"Avg",null,{"$f":"IF(H37=0,\"\",H38/H37)","v":0.6428571428571429},"Avg",{"$f":"IF(J37=\"\",\"\",J38/J37)","v":0.8},0.75,0.4,"","","","",{"$f":"IF(Q37=\"\",\"\",Q38/Q37)","v":""},"","","","","","","","","",""]
[8,{"$f":"$D$1","v":"Thunder Ducks"},"L-Name","Annie",null,"# of AB's",null,{"$f":"SUM(J41:AA41)","v":11},"AB's",6,null,5]
[null,null,"B","Brady",null,"# of Hits",null,{"$f":"SUM(J42:AA42)","v":8},"Hits",4,null,4]
[null,null,null,null,null,"# of PA",null,{"$f":"SUM(J43:AA43)","v":11},"PA",6,null,5]
[null,null,null,"f",null,"Avg",null,{"$f":"IF(H41=0,\"\",H42/H41)","v":0.72727272727272729},"Avg",{"$f":"IF(J41=\"\",\"\",J42/J41)","v":0.66666666666666663},"",0.8,"","","","",{"$f":"IF(Q41=\"\",\"\",Q42/Q41)","v":""},"","","","","","","","","",""]
[9,{"$f":"$D$1","v":"Thunder Ducks"},"L-Name","Adam",null,"# of AB's",null,{"$f":"SUM(J45:AA45)","v":3},"AB's",3]
[null,null,"F-Name","Thorne",null,"# of Hits",null,{"$f":"SUM(J46:AA46)","v":1},"Hits",1]
[null,null,null,null,null,"# of PA",null,{"$f":"SUM(J47:AA47)","v":6},"PA",6]
[null,null,null,"m",null,"Avg",null,{"$f":"IF(H45=0,\"\",H46/H45)","v":0.33333333333333331},"Avg",{"$f":"IF(J45=\"\",\"\",J46/J45)","v":0.33333333333333331},"","","","","","",{"$f":"IF(Q45=\"\",\"\",Q46/Q45)","v":""},"","","","","","","","","",""]
[10,{"$f":"$D$1","v":"Thunder Ducks"},"L-Name","Ashley",null,"# of AB's",null,{"$f":"SUM(J49:AA49)","v":6},"AB's",6]
[null,null,"F-Name","Hall",null,"# of Hits",null,{"$f":"SUM(J50:AA50)","v":4},"Hits",4]
[null,null,null,null,null,"# of PA",null,{"$f":"SUM(J51:AA51)","v":6},"PA",6]
[null,null,null,"f",null,"Avg",null,{"$f":"IF(H49=0,\"\",H50/H49)","v":0.66666666666666663},"Avg",{"$f":"IF(J49=\"\",\"\",J50/J49)","v":0.66666666666666663},"","","","","","",{"$f":"IF(Q49=\"\",\"\",Q50/Q49)","v":""},"","","","","","","","","",""]
[11,{"$f":"$D$1","v":"Thunder Ducks"},"L-Name","Kat",null,"# of AB's",null,{"$f":"SUM(J53:AA53)","v":8},"AB's",null,4,4]
[null,null,"F-Name","Tiffany",null,"# of Hits",null,{"$f":"SUM(J54:AA54)","v":2},"Hits",null,1,1]
[null,null,null,null,null,"# of PA",null,{"$f":"SUM(J55:AA55)","v":8},"PA",null,4,4]
[null,null,null,"f",null,"Avg",null,{"$f":"IF(H53=0,\"\",H54/H53)","v":0.25},"Avg",{"$f":"IF(J53=\"\",\"\",J54/J53)","v":""},0.25,0.25,"","","","",{"$f":"IF(Q53=\"\",\"\",Q54/Q53)","v":""},"","","","","","","","","",""]
[12,{"$f":"$D$1","v":"Thunder Ducks"},"L-Name","Megan",null,"# of AB's",null,{"$f":"SUM(J57:AA57)","v":4},"AB's",null,4]
[null,null,"F-Name","Goodman",null,"# of Hits",null,{"$f":"SUM(J58:AA58)","v":0},"Hits",null,0]
[null,null,null,null,null,"# of PA",null,{"$f":"SUM(J59:AA59)","v":4},"PA",null,4]
[null,null,null,"f",null,"Avg",null,{"$f":"IF(H57=0,\"\",H58/H57)","v":0},"Avg",{"$f":"IF(J57=\"\",\"\",J58/J57)","v":""},0,"","","","","",{"$f":"IF(Q57=\"\",\"\",Q58/Q57)","v":""},"","","","","","","","","",""]
[13,{"$f":"$D$1","v":"Thunder Ducks"},"L-Name","Spencer",null,"# of AB's",null,{"$f":"SUM(J61:AA61)","v":7},"AB's",null,3,4]
[null,null,"F-Name","Hille",null,"# of Hits",null,{"$f":"SUM(J62:AA62)","v":4},"Hits",null,1,3]
[null,null,null,null,null,"# of PA",null,{"$f":"SUM(J63:AA63)","v":7},"PA",null,3,4]
[null,null,null,"m",null,"Avg",null,{"$f":"IF(H61=0,\"\",H62/H61)","v":0.5714285714285714},"Avg",{"$f":"IF(J61=\"\",\"\",J62/J61)","v":""},0.33333333333333331,0.75,"","","","",{"$f":"IF(Q61=\"\",\"\",Q62/Q61)","v":""},"","","","","","","","","",""]
[14,{"$f":"$D$1","v":"Thunder Ducks"},"L-Name","Lindsay",null,"# of AB's",null,{"$f":"SUM(J65:AA65)","v":2},"AB's",null,2]
[null,null,"F-Name","Pennington",null,"# of Hits",null,{"$f":"SUM(J66:AA66)","v":0},"Hits",null,0]
[null,null,null,null,null,"# of PA",null,{"$f":"SUM(J67:AA67)","v":3},"PA",null,3]
[null,null,null,"f",null,"Avg",null,{"$f":"IF(H65=0,\"\",H66/H65)","v":0},"Avg",{"$f":"IF(J65=\"\",\"\",J66/J65)","v":""},0,"","","","","",{"$f":"IF(Q65=\"\",\"\",Q66/Q65)","v":""},"","","","","","","","","",""]
[15,{"$f":"$D$1","v":"Thunder Ducks"},"L-Name","John",null,"# of AB's",null,{"$f":"SUM(J69:AA69)","v":4},"AB's",null,null,4]
[null,null,"F-Name","Campbell",null,"# of Hits",null,{"$f":"SUM(J70:AA70)","v":2},"Hits",null,null,2]
[null,null,null,null,null,"# of PA",null,{"$f":"SUM(J71:AA71)","v":4},"PA",null,null,4]
[null,null,null,"m",null,"Avg",null,{"$f":"IF(H69=0,\"\",H70/H69)","v":0.5},"Avg",{"$f":"IF(J69=\"\",\"\",J70/J69)","v":""},"",0.5,"","","","",{"$f":"IF(Q69=\"\",\"\",Q70/Q69)","v":""},"","","","","","","","","",""]
[16,{"$f":"$D$1","v":"Thunder Ducks"},"L-Name","Paige",null,"# of AB's",null,{"$f":"SUM(J73:AA73)","v":4},"AB's",null,null,4]
[null,null,"F-Name","Jackman",null,"# of Hits",null,{"$f":"SUM(J74:AA74)","v":1},"Hits",null,null,1]
[null,null,null,null,null,"# of PA",null,{"$f":"SUM(J75:AA75)","v":4},"PA",null,null,4]
[null,null,null,"f",null,"Avg",null,{"$f":"IF(H73=0,\"\",H74/H73)","v":0.25},"Avg",{"$f":"IF(J73=\"\",\"\",J74/J73)","v":""},"",0.25,"","","","",{"$f":"IF(Q73=\"\",\"\",Q74/Q73)","v":""},"","","","","",null,{"$f":"IF(X73=\"\",\"\",X74/X73)","v":""},{"$f":"IF(Y73=\"\",\"\",Y74/Y73)","v":""},{"$f":"IF(Z73=\"\",\"\",Z74/Z73)","v":""},{"$f":"IF(AA73=\"\",\"\",AA74/AA73)","v":""}]
[17,{"$f":"$D$1","v":"Thunder Ducks"},"L-Name",null,null,"# of AB's",null,{"$f":"SUM(J77:AA77)","v":0},"AB's"]
[null,null,"F-Name",null,null,"# of Hits",null,{"$f":"SUM(J78:AA78)","v":0},"Hits"]
[null,null,null,null,null,"# of PA",null,{"$f":"SUM(J79:AA79)","v":0},"PA"]
[null,null,null,"m",null,"Avg",null,{"$f":"IF(H77=0,\"\",H78/H77)","v":""},"Avg",{"$f":"IF(J77=\"\",\"\",J78/J77)","v":""},"","","","","","",{"$f":"IF(Q77=\"\",\"\",Q78/Q77)","v":""},"","","","","","","","","",""]
[18,{"$f":"$D$1","v":"Thunder Ducks"},"L-Name",null,null,"# of AB's",null,{"$f":"SUM(J81:AA81)","v":0},"AB's"]
[null,null,"F-Name",null,null,"# of Hits",null,{"$f":"SUM(J82:AA82)","v":0},"Hits"]
[null,null,null,null,null,"# of PA",null,{"$f":"SUM(J83:AA83)","v":0},"PA"]
[null,null,null,"f",null,"Avg",null,{"$f":"IF(H81=0,\"\",H82/H81)","v":""},"Avg",{"$f":"IF(J81=\"\",\"\",J82/J81)","v":""},"","","","","","",{"$f":"IF(Q81=\"\",\"\",Q82/Q81)","v":""},"","","","","","","","","",""]
[19,{"$f":"$D$1","v":"Thunder Ducks"},"L-Name",null,null,"# of AB's",null,{"$f":"SUM(J85:AA85)","v":0},"AB's"]
[null,null,"F-Name",null,null,"# of Hits",null,{"$f":"SUM(J86:AA86)","v":0},"Hits"]
[null,null,null,null,null,"# of PA",null,{"$f":"SUM(J87:AA87)","v":0},"PA"]
[null,null,null,"f",null,"Avg",null,{"$f":"IF(H85=0,\"\",H86/H85)","v":""},"Avg",{"$f":"IF(J85=\"\",\"\",J86/J85)","v":""},"","","","","","",{"$f":"IF(Q85=\"\",\"\",Q86/Q85)","v":""},"","","","","","","","","",""]
[20,{"$f":"$D$1","v":"Thunder Ducks"},"L-Name",null,null,"# of AB's",null,{"$f":"SUM(J89:AA89)","v":0},"AB's"]
[null,null,"F-Name",null,null,"# of Hits",null,{"$f":"SUM(J90:AA90)","v":0},"Hits"]
[null,null,null,null,null,"# of PA",null,{"$f":"SUM(J91:AA91)","v":0},"PA"]
[null,null,null,"f",null,"Avg",null,{"$f":"IF(H89=0,\"\",H90/H89)","v":""},"Avg",{"$f":"IF(J89=\"\",\"\",J90/J89)","v":""},"","","","","","",{"$f":"IF(Q89=\"\",\"\",Q90/Q89)","v":""},"","","","","","","","","",""]
[21,{"$f":"$D$1","v":"Thunder Ducks"},"L-Name",null,null,"# of AB's",null,{"$f":"SUM(J93:AA93)","v":0},"AB's"]
[null,null,"F-Name",null,null,"# of Hits",null,{"$f":"SUM(J94:AA94)","v":0},"Hits"]
[null,null,null,null,null,"# of PA",null,{"$f":"SUM(J95:AA95)","v":0},"PA"]
[null,null,null,"f",null,"Avg",null,{"$f":"IF(H93=0,\"\",H94/H93)","v":""},"Avg",{"$f":"IF(J93=\"\",\"\",J94/J93)","v":""},"","","","","","",{"$f":"IF(Q93=\"\",\"\",Q94/Q93)","v":""},"","","","","","","","","",""]
[22,{"$f":"$D$1","v":"Thunder Ducks"},"L-Name",null,null,"# of AB's",null,{"$f":"SUM(J97:AA97)","v":0},"AB's"]
[null,null,"F-Name",null,null,"# of Hits",null,{"$f":"SUM(J98:AA98)","v":0},"Hits"]
[null,null,null,null,null,"# of PA",null,{"$f":"SUM(J99:AA99)","v":0},"PA"]
[null,null,null,"f",null,"Avg",null,{"$f":"IF(H97=0,\"\",H98/H97)","v":""},"Avg",{"$f":"IF(J97=\"\",\"\",J98/J97)","v":""},"","","","","","",{"$f":"IF(Q97=\"\",\"\",Q98/Q97)","v":""},"","","","","","","","","",""]
[23,{"$f":"$D$1","v":"Thunder Ducks"},"L-Name",null,null,"# of AB's",null,{"$f":"SUM(J101:AA101)","v":0},"AB's"]
[null,null,"F-Name",null,null,"# of Hits",null,{"$f":"SUM(J102:AA102)","v":0},"Hits"]
[null,null,null,null,null,"# of PA",null,{"$f":"SUM(J103:AA103)","v":0},"PA"]
[null,null,null,"f",null,"Avg",null,{"$f":"IF(H101=0,\"\",H102/H101)","v":""},"Avg",{"$f":"IF(J101=\"\",\"\",J102/J101)","v":""},"","","","","","",{"$f":"IF(Q101=\"\",\"\",Q102/Q101)","v":""},"","","","","","","","","",""]
[24,{"$f":"$D$1","v":"Thunder Ducks"},"L-Name",null,null,"# of AB's",null,{"$f":"SUM(J105:AA105)","v":0},"AB's"]
[null,null,"F-Name",null,null,"# of Hits",null,{"$f":"SUM(J106:AA106)","v":0},"Hits"]
[null,null,null,null,null,"# of PA",null,{"$f":"SUM(J107:AA107)","v":0},"PA"]
[null,null,null,"f",null,"Avg",null,{"$f":"IF(H105=0,\"\",H106/H105)","v":""},"Avg",{"$f":"IF(J105=\"\",\"\",J106/J105)","v":""},"","","","","","",{"$f":"IF(Q105=\"\",\"\",Q106/Q105)","v":""},"","","","","","","","","",""]
[25,{"$f":"$D$1","v":"Thunder Ducks"},"L-Name",null,null,"# of AB's",null,{"$f":"SUM(J109:AA109)","v":0},"AB's"]
[null,null,"F-Name",null,null,"# of Hits",null,{"$f":"SUM(J110:AA110)","v":0},"Hits"]
[null,null,null,null,null,"# of PA",null,{"$f":"SUM(J111:AA111)","v":0},"PA"]
[null,null,null,"f",null,"Avg",null,{"$f":"IF(H109=0,\"\",H110/H109)","v":""},"Avg",{"$f":"IF(J109=\"\",\"\",J110/J109)","v":""},"","","","","","",{"$f":"IF(Q109=\"\",\"\",Q110/Q109)","v":""},"","","","","","","","","",""]
[null,{"$f":"$D$1","v":"Thunder Ducks"},null,"TEAM",null,"# of AB's",null,{"$f":"SUM(J113:AA113)","v":133},"AB's",{"$f":"IF(SUM(J109,J105,J101,J97,J93,J89,J85,J81,J77,J73,J69,J65,J61,J57,J53,J49,J45,J41,J37,J33,J29,J25,J21,J17,J13)=0,\"\",SUM(J13,J17,J21,J25,J29,J33,J37,J41,J45,J49,J53,J57,J61,J65,J69,J73,J77,J81,J85,J89,J93,J97,J101,J105,J109))","v":53},37,43,"","","","",{"$f":"IF(SUM(Q109,Q105,Q101,Q97,Q93,Q89,Q85,Q81,Q77,Q73,Q69,Q65,Q61,Q57,Q53,Q49,Q45,Q41,Q37,Q33,Q29,Q25,Q21,Q17,Q13)=0,\"\",SUM(Q13,Q17,Q21,Q25,Q29,Q33,Q37,Q41,Q45,Q49,Q53,Q57,Q61,Q65,Q69,Q73,Q77,Q81,Q85,Q89,Q93,Q97,Q101,Q105,Q109))","v":""},"","","","","","","","","",""]
[null,null,null,"Summary",null,"# of Hits",null,{"$f":"SUM(J114:AA114)","v":72},"Hits",{"$f":"IF(SUM(J110,J106,J102,J98,J94,J90,J86,J82,J78,J74,J70,J66,J62,J58,J54,J50,J46,J42,J38,J34,J30,J26,J22,J18,J14)=0,\"\",SUM(J14,J18,J22,J26,J30,J34,J38,J42,J46,J50,J54,J58,J62,J66,J70,J74,J78,J82,J86,J90,J94,J98,J102,J106,J110))","v":31},17,24,"","","","",{"$f":"IF(SUM(Q110,Q106,Q102,Q98,Q94,Q90,Q86,Q82,Q78,Q74,Q70,Q66,Q62,Q58,Q54,Q50,Q46,Q42,Q38,Q34,Q30,Q26,Q22,Q18,Q14)=0,\"\",SUM(Q14,Q18,Q22,Q26,Q30,Q34,Q38,Q42,Q46,Q50,Q54,Q58,Q62,Q66,Q70,Q74,Q78,Q82,Q86,Q90,Q94,Q98,Q102,Q106,Q110))","v":""},"","","","","","","","","",""]
[null,null,null,null,null,"Avg",null,{"$f":"IF(H113=0,\"N/A\",H114/H113)","v":0.54135338345864659},"Avg",{"$f":"IF(J113=\"\",\"\",J114/J113)","v":0.58490566037735847},0.45945945945945948,0.55813953488372092,"","","","",{"$f":"IF(Q113=\"\",\"\",Q114/Q113)","v":""},"","","","","","","","","",""]

{"sheet":"X Team","index":5,"n_rows":115,"n_cols":27,"rows_kept":115,"cut":false,"hidden":false,"merged":[]}
[null,null,"Team Name","X Team",null,null,null,null,"Score",0,0,0,0,0,0,0]
[null,null,null,null,null,null,null,null,"Opponents Score",8,8,8,8,8,8,8]
[null,null,null,"Wins",null,{"$f":"SUM(J6:AA6)","v":0},null,null,"W or L",{"$f":"IF(SUM(J1,J2)=0,\"\",IF(J1<J2,\"L\",\"W\"))","v":"L"},"L","L","L","L","L","L","","","","","","","","","","",""]
[null,null,null,"Losses",null,{"$f":"SUM(J7:AA7)","v":7},null,"Forfeit","FW or FL"]
[null,null,null,null,"games played excluding Forfeit Wins",null,null,null,null,{"$f":"IF(J3=\"\",\"\",IF(J4=\"FW\",\"\",1))","v":1},1,1,1,1,1,1,"","","","","","","","","","",""]
[null,null,null,null,null,null,null,{"$f":"IF(H4=\"w\",1,\"\")","v":""},"win",{"$f":"IF(J3=\"w\",1,\"\")","v":""},"","","","","","","","","","","","","","","","",""]
[null,null,null,null,null,null,null,{"$f":"IF(H4=\"l\",1,\"\")","v":""},"loss",{"$f":"IF(J3=\"l\",1,\"\")","v":1},1,1,1,1,1,1,"","","","","","","","","","",""]
[null,null,null,"Games Played Excluding Forfeit Wins",null,{"$f":"SUM(J5:AA5)","v":7},null,"Opponents Team Name"]
[null,null,null,"League Run Diff     ",null,{"$f":"SUM(J9:AA9)","v":-56},null,null,"Game Run Diff",{"$f":"IF(J1=\"\",\"\",J1-J2)","v":-8},-8,-8,-8,-8,-8,-8,"","","","","","","","","","",""]
[null,null,null,"Team Batting Avg   ",null,{"$f":"$H$115","v":0},null,null,"Game Date","2023-08-10"]
[]
[null,null,null,null,null,null,null,"STATS",null,1,2,3,4,5,6,7,8,9,10,11,12,13,14,15,16,17,18]
[1,{"$f":"$D$1","v":"X Team"},"L-Name","Jake",null,"# of AB's",null,{"$f":"SUM(J13:AA13)","v":63},"AB's",9,9,9,9,9,9,9]
[null,null,"F-Name","Reeves",null,"# of Hits",null,{"$f":"SUM(J14:AA14)","v":0},"Hits",0,0,0,0,0,0,0]
[null,null,null,null,null,"# of PA",null,{"$f":"SUM(J15:AA15)","v":63},"PA",9,9,9,9,9,9,9]
[null,null,null,"m",null,"Avg",null,{"$f":"IF(H13=0,\"\",(H14/H13))","v":0},"Avg",{"$f":"IF(J13=\"\",\"\",J14/J13)","v":0},0,0,0,0,0,0,"","","","","","","","","","",""]
[2,{"$f":"$D$1","v":"X Team"},"L-Name","Paige",null,"# of AB's",null,{"$f":"SUM(J17:AA17)","v":63},"AB's",9,9,9,9,9,9,9]
[null,null,"F-Name","Jackman",null,"# of Hits",null,{"$f":"SUM(J18:AA18)","v":0},"Hits",0,0,0,0,0,0,0]
[null,null,null,null,null,"# of PA",null,{"$f":"SUM(J19:AA19)","v":63},"PA",9,9,9,9,9,9,9]
[null,null,null,"f",null,"Avg",null,{"$f":"IF(H17=0,\"\",H18/H17)","v":0},"Avg",{"$f":"IF(J17=\"\",\"\",J18/J17)","v":0},0,0,0,0,0,0,"","","","","","","","","","",""]
[3,{"$f":"$D$1","v":"X Team"},"L-Name","Jason",null,"# of AB's",null,{"$f":"SUM(J21:AA21)","v":63},"AB's",9,9,9,9,9,9,9]
[null,null,"F-Name","Reed",null,"# of Hits",null,{"$f":"SUM(J22:AA22)","v":0},"Hits",0,0,0,0,0,0,0]
[null,null,null,null,null,"# of PA",null,{"$f":"SUM(J23:AA23)","v":63},"Avg",9,9,9,9,9,9,9]
[null,null,null,"m",null,"Avg",null,{"$f":"IF(H21=0,\"\",H22/H21)","v":0},"Avg",{"$f":"IF(J21=\"\",\"\",J22/J21)","v":0},0,0,0,0,0,0,"","","","","","","","","","",""]
[4,{"$f":"$D$1","v":"X Team"},"L-Name","Chelsea",null,"# of AB's",null,{"$f":"SUM(J25:AA25)","v":63},"AB's",9,9,9,9,9,9,9]
[null,null,"F-Name","LdBaron",null,"# of Hits",null,{"$f":"SUM(J26:AA26)","v":0},"Hits",0,0,0,0,0,0,0]
[null,null,null,null,null,"# of PA",null,{"$f":"SUM(J27:AA27)","v":63},"PA",9,9,9,9,9,9,9]
[null,null,null,"f",null,"Avg",null,{"$f":"IF(H25=0,\"\",H26/H25)","v":0},"Avg",{"$f":"IF(J25=\"\",\"\",J26/J25)","v":0},0,0,0,0,0,0,"","","","","","","","","","",""]
[5,{"$f":"$D$1","v":"X Team"},"L-Name","Jeff",null,"# of AB's",null,{"$f":"SUM(J29:AA29)","v":63},"AB's",9,9,9,9,9,9,9]
[null,null,"F-Name","Peacock",null,"# of Hits",null,{"$f":"SUM(J30:AA30)","v":0},"Hits",0,0,0,0,0,0,0]
[null,null,null,null,null,"# of PA",null,{"$f":"SUM(J31:AA31)","v":63},"PA",9,9,9,9,9,9,9]
[null,null,null,"m",null,"Avg",null,{"$f":"IF(H29=0,\"\",H30/H29)","v":0},"Avg",{"$f":"IF(J29=\"\",\"\",J30/J29)","v":0},0,0,0,0,0,0,"","","","","","","","","","",""]
[6,{"$f":"$D$1","v":"X Team"},"L-Name","Jo",null,"# of AB's",null,{"$f":"SUM(J33:AA33)","v":63},"AB's",9,9,9,9,9,9,9]
[null,null,"F-Name","Cruz",null,"# of Hits",null,{"$f":"SUM(J34:AA34)","v":0},"Hits",0,0,0,0,0,0,0]
[null,null,null,null,null,"# of PA",null,{"$f":"SUM(J35:AA35)","v":63},"PA",9,9,9,9,9,9,9]
[null,null,null,"f",null,"Avg",null,{"$f":"IF(H33=0,\"\",H34/H33)","v":0},"Avg",{"$f":"IF(J33=\"\",\"\",J34/J33)","v":0},0,0,0,0,0,0,"","","","","","","","","","",""]
[7,{"$f":"$D$1","v":"X Team"},"L-Name","Chris",null,"# of AB's",null,{"$f":"SUM(J37:AA37)","v":63},"AB's",9,9,9,9,9,9,9]
[null,null,"F-Name","Teerlink",null,"# of Hits",null,{"$f":"SUM(J38:AA38)","v":0},"Hits",0,0,0,0,0,0,0]
[null,null,null,null,null,"# of PA",null,{"$f":"SUM(J39:AA39)","v":63},"PA",9,9,9,9,9,9,9]
[null,null,null,"m",null,"Avg",null,{"$f":"IF(H37=0,\"\",H38/H37)","v":0},"Avg",{"$f":"IF(J37=\"\",\"\",J38/J37)","v":0},0,0,0,0,0,0,"","","","","","","","","","",""]
[8,{"$f":"$D$1","v":"X Team"},"L-Name","Cassi",null,"# of AB's",null,{"$f":"SUM(J41:AA41)","v":63},"AB's",9,9,9,9,9,9,9]
[null,null,"F-Name","Kendzior",null,"# of Hits",null,{"$f":"SUM(J42:AA42)","v":0},"Hits",0,0,0,0,0,0,0]
[null,null,null,null,null,"# of PA",null,{"$f":"SUM(J43:AA43)","v":63},"PA",9,9,9,9,9,9,9]
[null,null,null,"f",null,"Avg",null,{"$f":"IF(H41=0,\"\",H42/H41)","v":0},"Avg",{"$f":"IF(J41=\"\",\"\",J42/J41)","v":0},0,0,0,0,0,0,"","","","","","","","","","",""]
[9,{"$f":"$D$1","v":"X Team"},"L-Name","Tyler (TJ)",null,"# of AB's",null,{"$f":"SUM(J45:AA45)","v":63},"AB's",9,9,9,9,9,9,9]
[null,null,"F-Name","Gossard",null,"# of Hits",null,{"$f":"SUM(J46:AA46)","v":0},"Hits",0,0,0,0,0,0,0]
[null,null,null,null,null,"# of PA",null,{"$f":"SUM(J47:AA47)","v":63},"PA",9,9,9,9,9,9,9]
[null,null,null,"m",null,"Avg",null,{"$f":"IF(H45=0,\"\",H46/H45)","v":0},"Avg",{"$f":"IF(J45=\"\",\"\",J46/J45)","v":0},0,0,0,0,0,0,"","","","","","","","","","",""]
[10,{"$f":"$D$1","v":"X Team"},"L-Name","Shae Lee",null,"# of AB's",null,{"$f":"SUM(J49:AA49)","v":63},"AB's",9,9,9,9,9,9,9]
[null,null,"F-Name","Pearson",null,"# of Hits",null,{"$f":"SUM(J50:AA50)","v":0},"Hits",0,0,0,0,0,0,0]
[null,null,null,null,null,"# of PA",null,{"$f":"SUM(J51:AA51)","v":63},"PA",9,9,9,9,9,9,9]
[null,null,null,"f",null,"Avg",null,{"$f":"IF(H49=0,\"\",H50/H49)","v":0},"Avg",{"$f":"IF(J49=\"\",\"\",J50/J49)","v":0},0,0,0,0,0,0,"","","","","","","","","","",""]
[11,{"$f":"$D$1","v":"X Team"},"L-Name","Jo",null,"# of AB's",null,{"$f":"SUM(J53:AA53)","v":63},"AB's",9,9,9,9,9,9,9]
[null,null,"F-Name","Blake",null,"# of Hits",null,{"$f":"SUM(J54:AA54)","v":0},"Hits",0,0,0,0,0,0,0]
[null,null,null,null,null,"# of PA",null,{"$f":"SUM(J55:AA55)","v":63},"PA",9,9,9,9,9,9,9]
[null,null,null,"f",null,"Avg",null,{"$f":"IF(H53=0,\"\",H54/H53)","v":0},"Avg",{"$f":"IF(J53=\"\",\"\",J54/J53)","v":0},null,0,0,0,0,0,"","","","","","","","","","",""]
[12,{"$f":"$D$1","v":"X Team"},"L-Name","Kenyon",null,"# of AB's",null,{"$f":"SUM(J57:AA57)","v":63},"AB's",9,9,9,9,9,9,9]
[null,null,"F-Name","Kawa",null,"# of Hits",null,{"$f":"SUM(J58:AA58)","v":0},"Hits",0,0,0,0,0,0,0]
[null,null,null,null,null,"# of PA",null,{"$f":"SUM(J59:AA59)","v":63},"PA",9,9,9,9,9,9,9]
[null,null,null,"m",null,"Avg",null,{"$f":"IF(H57=0,\"\",H58/H57)","v":0},"Avg",{"$f":"IF(J57=\"\",\"\",J58/J57)","v":0},0,0,0,0,0,0,"","","","","","","","","","",""]
[13,{"$f":"$D$1","v":"X Team"},"L-Name","Amanda ",null,"# of AB's",null,{"$f":"SUM(J61:AA61)","v":63},"AB's",9,9,9,9,9,9,9]
[null,null,"F-Name","Kenzior",null,"# of Hits",null,{"$f":"SUM(J62:AA62)","v":0},"Hits",0,0,0,0,0,0,0]
[null,null,null,null,null,"# of PA",null,{"$f":"SUM(J63:AA63)","v":63},"PA",9,9,9,9,9,9,9]
[null,null,null,"f",null,"Avg",null,{"$f":"IF(H61=0,\"\",H62/H61)","v":0},"Avg",{"$f":"IF(J61=\"\",\"\",J62/J61)","v":0},0,0,0,0,0,0,"","","","","","","","","","",""]
[14,{"$f":"$D$1","v":"X Team"},"L-Name",null,null,"# of AB's",null,{"$f":"SUM(J65:AA65)","v":0},"AB's"]
[null,null,"F-Name",null,null,"# of Hits",null,{"$f":"SUM(J66:AA66)","v":0},"Hits"]
[null,null,null,null,null,"# of PA",null,{"$f":"SUM(J67:AA67)","v":0},"PA"]
[null,null,null,"f",null,"Avg",null,{"$f":"IF(H65=0,\"\",H66/H65)","v":""},"Avg",{"$f":"IF(J65=\"\",\"\",J66/J65)","v":""},"","","","","","","","","","","","","","","","",""]
[15,{"$f":"$D$1","v":"X Team"},"L-Name",null,null,"# of AB's",null,{"$f":"SUM(J69:AA69)","v":0},"AB's"]
[null,null,"F-Name",null,null,"# of Hits",null,{"$f":"SUM(J70:AA70)","v":0},"Hits"]
[null,null,null,null,null,"# of PA",null,{"$f":"SUM(J71:AA71)","v":0},"PA"]
[null,null,null,"f",null,"Avg",null,{"$f":"IF(H69=0,\"\",H70/H69)","v":""},"Avg",{"$f":"IF(J69=\"\",\"\",J70/J69)","v":""},"","","","","","","","","","","","","","","","",""]
[16,{"$f":"$D$1","v":"X Team"},"L-Name",null,null,"# of AB's",null,{"$f":"SUM(J73:AA73)","v":0},"AB's"]
[null,null,"F-Name",null,null,"# of Hits",null,{"$f":"SUM(J74:AA74)","v":0},"Hits"]
[null,null,null,null,null,"# of PA",null,{"$f":"SUM(J75:AA75)","v":0},"PA"]
[null,null,null,"f",null,"Avg",null,{"$f":"IF(H73=0,\"\",H74/H73)","v":""},"Avg",{"$f":"IF(J73=\"\",\"\",J74/J73)","v":""},"","","","","","","","","","","","","","","","",""]
[17,{"$f":"$D$1","v":"X Team"},"L-Name",null,null,"# of AB's",null,{"$f":"SUM(J77:AA77)","v":0},"AB's"]
[null,null,"F-Name",null,null,"# of Hits",null,{"$f":"SUM(J78:AA78)","v":0},"Hits"]
[null,null,null,null,null,"# of PA",null,{"$f":"SUM(J79:AA79)","v":0},"PA"]
[null,null,null,"f",null,"Avg",null,{"$f":"IF(H77=0,\"\",H78/H77)","v":""},"Avg",{"$f":"IF(J77=\"\",\"\",J78/J77)","v":""},"","","","","","","","","","","","","","","","",""]
[18,{"$f":"$D$1","v":"X Team"},"L-Name",null,null,"# of AB's",null,{"$f":"SUM(J81:AA81)","v":0},"AB's"]
[null,null,"F-Name",null,null,"# of Hits",null,{"$f":"SUM(J82:AA82)","v":0},"Hits"]
[null,null,null,null,null,"# of PA",null,{"$f":"SUM(J83:AA83)","v":0},"PA"]
[null,null,null,"f",null,"Avg",null,{"$f":"IF(H81=0,\"\",H82/H81)","v":""},"Avg",{"$f":"IF(J81=\"\",\"\",J82/J81)","v":""},"","","","","","","","","","","","","","","","",""]
[19,{"$f":"$D$1","v":"X Team"},"L-Name",null,null,"# of AB's",null,{"$f":"SUM(J85:AA85)","v":0},"AB's"]
[null,null,"F-Name",null,null,"# of Hits",null,{"$f":"SUM(J86:AA86)","v":0},"Hits"]
[null,null,null,null,null,"# of PA",null,{"$f":"SUM(J87:AA87)","v":0},"PA"]
[null,null,null,"m",null,"Avg",null,{"$f":"IF(H85=0,\"\",H86/H85)","v":""},"Avg",{"$f":"IF(J85=\"\",\"\",J86/J85)","v":""},"","","","","","","","","","","","","","","","",""]
[20,{"$f":"$D$1","v":"X Team"},"L-Name",null,null,"# of AB's",null,{"$f":"SUM(J89:AA89)","v":0},"AB's"]
[null,null,"F-Name",null,null,"# of Hits",null,{"$f":"SUM(J90:AA90)","v":0},"Hits"]
[null,null,null,null,null,"# of PA",null,{"$f":"SUM(J91:AA91)","v":0},"PA"]
[null,null,null,"f",null,"Avg",null,{"$f":"IF(H89=0,\"\",H90/H89)","v":""},"Avg",{"$f":"IF(J89=\"\",\"\",J90/J89)","v":""},"","","","","","","","","","","","","","","","",""]
[21,{"$f":"$D$1","v":"X Team"},"L-Name",null,null,"# of AB's",null,{"$f":"SUM(J93:AA93)","v":0},"AB's"]
[null,null,"F-Name",null,null,"# of Hits",null,{"$f":"SUM(J94:AA94)","v":0},"Hits"]
[null,null,null,null,null,"# of PA",null,{"$f":"SUM(J95:AA95)","v":0},"PA"]
[null,null,null,"m",null,"Avg",null,{"$f":"IF(H93=0,\"\",H94/H93)","v":""},"Avg",{"$f":"IF(J93=\"\",\"\",J94/J93)","v":""},"","","","","","","","","","","","","","","","",""]
[22,{"$f":"$D$1","v":"X Team"},"L-Name",null,null,"# of AB's",null,{"$f":"SUM(J97:AA97)","v":0},"AB's"]
[null,null,"F-Name",null,null,"# of Hits",null,{"$f":"SUM(J98:AA98)","v":0},"Hits"]
[null,null,null,null,null,"# of PA",null,{"$f":"SUM(J99:AA99)","v":0},"PA"]
[null,null,null,"f",null,"Avg",null,{"$f":"IF(H97=0,\"\",H98/H97)","v":""},"Avg",{"$f":"IF(J97=\"\",\"\",J98/J97)","v":""},"","","","","","","","","","","","","","","","",""]
[23,{"$f":"$D$1","v":"X Team"},"L-Name",null,null,"# of AB's",null,{"$f":"SUM(J101:AA101)","v":0},"AB's"]
[null,null,"F-Name",null,null,"# of Hits",null,{"$f":"SUM(J102:AA102)","v":0},"Hits"]
[null,null,null,null,null,"# of PA",null,{"$f":"SUM(J103:AA103)","v":0},"PA"]
[null,null,null,"f",null,"Avg",null,{"$f":"IF(H101=0,\"\",H102/H101)","v":""},"Avg",{"$f":"IF(J101=\"\",\"\",J102/J101)","v":""},"","","","","","","","","","","","","","","","",""]
[24,{"$f":"$D$1","v":"X Team"},"L-Name",null,null,"# of AB's",null,{"$f":"SUM(J105:AA105)","v":0},"AB's"]
[null,null,"F-Name",null,null,"# of Hits",null,{"$f":"SUM(J106:AA106)","v":0},"Hits"]
[null,null,null,null,null,"# of PA",null,{"$f":"SUM(J107:AA107)","v":0},"PA"]
[null,null,null,"f",null,"Avg",null,{"$f":"IF(H105=0,\"\",H106/H105)","v":""},"Avg",{"$f":"IF(J105=\"\",\"\",J106/J105)","v":""},"","","","","","","","","","","","","","","","",""]
[25,{"$f":"$D$1","v":"X Team"},"L-Name",null,null,"# of AB's",null,{"$f":"SUM(J109:AA109)","v":0},"AB's"]
[null,null,"F-Name",null,null,"# of Hits",null,{"$f":"SUM(J110:AA110)","v":0},"Hits"]
[null,null,null,null,null,"# of PA",null,{"$f":"SUM(J111:AA111)","v":0},"PA"]
[null,null,null,"f",null,"Avg",null,{"$f":"IF(H109=0,\"\",H110/H109)","v":""},"Avg",{"$f":"IF(J109=\"\",\"\",J110/J109)","v":""},"","","","","","","","","","","","","","","","",""]
[null,{"$f":"$D$1","v":"X Team"},null,"TEAM",null,"# of AB's",null,{"$f":"SUM(J113:AA113)","v":819},"AB's",{"$f":"IF(SUM(J109,J105,J101,J97,J93,J89,J85,J81,J77,J73,J69,J65,J61,J57,J53,J49,J45,J41,J37,J33,J29,J25,J21,J17,J13)=0,\"\",SUM(J13,J17,J21,J25,J29,J33,J37,J41,J45,J49,J53,J57,J61,J65,J69,J73,J77,J81,J85,J89,J93,J97,J101,J105,J109))","v":117},117,117,117,117,117,117,"","","","","","","","","","",""]
[null,null,null,"Summary",null,"# of Hits",null,{"$f":"SUM(J114:AA114)","v":0},"Hits",{"$f":"IF(SUM(J110,J106,J102,J98,J94,J90,J86,J82,J78,J74,J70,J66,J62,J58,J54,J50,J46,J42,J38,J34,J30,J26,J22,J18,J14)=0,\"\",SUM(J14,J18,J22,J26,J30,J34,J38,J42,J46,J50,J54,J58,J62,J66,J70,J74,J78,J82,J86,J90,J94,J98,J102,J106,J110))","v":""},"","","","","","","","","","","","","","","","",""]
[null,null,null,null,null,"Avg",null,{"$f":"IF(H113=0,\"N/A\",H114/H113)","v":0},"Avg",{"$f":"IF(J113=\"\",\"\",J114/J113)","v":{"$error":"#VALUE!"}},{"$error":"#VALUE!"},{"$error":"#VALUE!"},{"$error":"#VALUE!"},{"$error":"#VALUE!"},{"$error":"#VALUE!"},{"$error":"#VALUE!"},"","","","","","","","","","",""]

{"sheet":"XXX Team","index":6,"n_rows":115,"n_cols":27,"rows_kept":115,"cut":false,"hidden":false,"merged":[]}
[null,null,"Team Name","XXX Team",null,null,null,null,"Score",0,0,0,0,0,0,0]
[null,null,null," ",null,null,null,null,"Opponents Score",8,8,8,8,8,8,8]
[null,null,null,"Wins",null,{"$f":"SUM(J6:AA6)","v":0},null,null,"W or L",{"$f":"IF(SUM(J1,J2)=0,\"\",IF(J1<J2,\"L\",\"W\"))","v":"L"},"L","L","L","L","L","L","","","","","","","","","","",""]
[null,null,null,"Losses",null,{"$f":"SUM(J7:AA7)","v":7},null,"Forfeit","FW or FL"]
[null,null,null,null,"games played excluding Forfeit Wins",null,null,null,null,{"$f":"IF(J3=\"\",\"\",IF(J4=\"FW\",\"\",1))","v":1},1,1,1,1,1,1,"","","","","","","","","","",""]
[null,null,null,null,null,null,null,{"$f":"IF(H4=\"w\",1,\"\")","v":""},"win",{"$f":"IF(J3=\"w\",1,\"\")","v":""},"","","","","","","","","","","","","","","","",""]
[null,null,null,null,null,null,null,{"$f":"IF(H4=\"l\",1,\"\")","v":""},"loss",{"$f":"IF(J3=\"l\",1,\"\")","v":1},1,1,1,1,1,1,"","","","","","","","","","",""]
[null,null,null,"Games Played Excluding Forfeit Wins",null,{"$f":"SUM(J5:AA5)","v":7},null,"Opponents Team Name"]
[null,null,null,"League Run Diff     ",null,{"$f":"SUM(J9:AA9)","v":-56},null,null,"Game Run Diff",{"$f":"IF(J1=\"\",\"\",J1-J2)","v":-8},-8,-8,-8,-8,-8,-8,"","","","","","","","","","",""]
[null,null,null,"Team Batting Avg   ",null,{"$f":"$H$115","v":0},null,null,"Game Date","2023-08-10"]
[]
[null,null,null,null,null,null,null,"STATS",null,1,2,3,4,5,6,7,8,9,10,11,12,13,14,15,16,17,18]
[1,{"$f":"$D$1","v":"XXX Team"},"L-Name","Jordan",null,"# of AB's",null,{"$f":"SUM(J13:AA13)","v":63},"AB's",9,9,9,9,9,9,9]
[null,null,"F-Name","Hall",null,"# of Hits",null,{"$f":"SUM(J14:AA14)","v":0},"Hits",0,0,0,0,0,0,0]
[null,null,null,null,null,"# of PA",null,{"$f":"SUM(J15:AA15)","v":63},"PA",9,9,9,9,9,9,9]
[null,null,null,"m",null,"Avg",null,{"$f":"IF(H13=0,\"\",(H14/H13))","v":0},"Avg",{"$f":"IF(J13=\"\",\"\",J14/J13)","v":0},0,0,0,0,0,0,"","","","","","","","","","",""]
[2,{"$f":"$D$1","v":"XXX Team"},"L-Name","Jenn",null,"# of AB's",null,{"$f":"SUM(J17:AA17)","v":63},"AB's",9,9,9,9,9,9,9]
[null,null,"F-Name","Hall",null,"# of Hits",null,{"$f":"SUM(J18:AA18)","v":0},"Hits",0,0,0,0,0,0,0]
[null,null,null,null,null,"# of PA",null,{"$f":"SUM(J19:AA19)","v":63},"PA",9,9,9,9,9,9,9]
[null,null,null,"f",null,"Avg",null,{"$f":"IF(H17=0,\"\",H18/H17)","v":0},"Avg",{"$f":"IF(J17=\"\",\"\",J18/J17)","v":0},0,0,0,0,0,0,"","","","","","","","","","",""]
[3,{"$f":"$D$1","v":"XXX Team"},"L-Name","Corey",null,"# of AB's",null,{"$f":"SUM(J21:AA21)","v":63},"AB's",9,9,9,9,9,9,9]
[null,null,"F-Name","Murphy",null,"# of Hits",null,{"$f":"SUM(J22:AA22)","v":0},"Hits",0,0,0,0,0,0,0]
[null,null,null,null,null,"# of PA",null,{"$f":"SUM(J23:AA23)","v":63},"PA",9,9,9,9,9,9,9]
[null,null,null,"m",null,"Avg",null,{"$f":"IF(H21=0,\"\",H22/H21)","v":0},"Avg",{"$f":"IF(J21=\"\",\"\",J22/J21)","v":0},0,0,0,0,0,0,"","","","","","","","","","",""]
[4,{"$f":"$D$1","v":"XXX Team"},"L-Name","Gimmie",null,"# of AB's",null,{"$f":"SUM(J25:AA25)","v":63},"AB's",9,9,9,9,9,9,9]
[null,null,"F-Name","Murphy",null,"# of Hits",null,{"$f":"SUM(J26:AA26)","v":0},"Hits",0,0,0,0,0,0,0]
[null,null,null,null,null,"# of PA",null,{"$f":"SUM(J27:AA27)","v":63},"PA",9,9,9,9,9,9,9]
[null,null,null,"f",null,"Avg",null,{"$f":"IF(H25=0,\"\",H26/H25)","v":0},"Avg",{"$f":"IF(J25=\"\",\"\",J26/J25)","v":0},{"$f":"IF(K25=\"\",\"\",K26/K25)","v":0},0,0,0,0,0,"","","","","","","","","","",""]
[5,{"$f":"$D$1","v":"XXX Team"},"L-Name","Sam",null,"# of AB's",null,{"$f":"SUM(J29:AA29)","v":63},"AB's",9,9,9,9,9,9,9]
[null,null,"F-Name","Cook",null,"# of Hits",null,{"$f":"SUM(J30:AA30)","v":0},"Hits",0,0,0,0,0,0,0]
[null,null,null,null,null,"# of PA",null,{"$f":"SUM(J31:AA31)","v":63},"PA",9,9,9,9,9,9,9]
[null,null,null,"m",null,"Avg",null,{"$f":"IF(H29=0,\"\",H30/H29)","v":0},"Avg",{"$f":"IF(J29=\"\",\"\",J30/J29)","v":0},{"$f":"IF(K29=\"\",\"\",K30/K29)","v":0},0,0,0,0,0,"","","","","","","","","","",""]
[6,{"$f":"$D$1","v":"XXX Team"},"L-Name","Deanndra",null,"# of AB's",null,{"$f":"SUM(J33:AA33)","v":63},"AB's",9,9,9,9,9,9,9]
[null,null,"F-Name","Billie",null,"# of Hits",null,{"$f":"SUM(J34:AA34)","v":0},"Hits",0,0,0,0,0,0,0]
[null,null,null,null,null,"# of PA",null,{"$f":"SUM(J35:AA35)","v":63},"PA",9,9,9,9,9,9,9]
[null,null,null,"f",null,"Avg",null,{"$f":"IF(H33=0,\"\",H34/H33)","v":0},"Avg",{"$f":"IF(J33=\"\",\"\",J34/J33)","v":0},{"$f":"IF(K33=\"\",\"\",K34/K33)","v":0},0,0,0,0,0,"","","","","","","","","","",""]
[7,{"$f":"$D$1","v":"XXX Team"},"L-Name","Ike",null,"# of AB's",null,{"$f":"SUM(J37:AA37)","v":63},"AB's",9,9,9,9,9,9,9]
[null,null,"F-Name","Whiting",null,"# of Hits",null,{"$f":"SUM(J38:AA38)","v":0},"Hits",0,0,0,0,0,0,0]
[null,null,null,null,null,"# of PA",null,{"$f":"SUM(J39:AA39)","v":63},"PA",9,9,9,9,9,9,9]
[null,null,null,"m",null,"Avg",null,{"$f":"IF(H37=0,\"\",H38/H37)","v":0},"Avg",{"$f":"IF(J37=\"\",\"\",J38/J37)","v":0},{"$f":"IF(K37=\"\",\"\",K38/K37)","v":0},0,0,0,0,0,"","","","","","","","","","",""]
[8,{"$f":"$D$1","v":"XXX Team"},"L-Name","Emma",null,"# of AB's",null,{"$f":"SUM(J41:AA41)","v":63},"AB's",9,9,9,9,9,9,9]
[null,null,"F-Name","Hall",null,"# of Hits",null,{"$f":"SUM(J42:AA42)","v":0},"Hits",0,0,0,0,0,0,0]
[null,null,null,null,null,"# of PA",null,{"$f":"SUM(J43:AA43)","v":63},"PA",9,9,9,9,9,9,9]
[null,null,null,"f",null,"Avg",null,{"$f":"IF(H41=0,\"\",H42/H41)","v":0},"Avg",{"$f":"IF(J41=\"\",\"\",J42/J41)","v":0},{"$f":"IF(K41=\"\",\"\",K42/K41)","v":0},0,0,0,0,0,"","","","","","","","","","",""]
[9,{"$f":"$D$1","v":"XXX Team"},"L-Name","Josh",null,"# of AB's",null,{"$f":"SUM(J45:AA45)","v":63},"AB's",9,9,9,9,9,9,9]
[null,null,"F-Name","Schmidt",null,"# of Hits",null,{"$f":"SUM(J46:AA46)","v":0},"Hits",0,0,0,0,0,0,0]
[null,null,null,null,null,"# of PA",null,{"$f":"SUM(J47:AA47)","v":63},"PA",9,9,9,9,9,9,9]
[null,null,null,"m",null,"Avg",null,{"$f":"IF(H45=0,\"\",H46/H45)","v":0},"Avg",{"$f":"IF(J45=\"\",\"\",J46/J45)","v":0},{"$f":"IF(K45=\"\",\"\",K46/K45)","v":0},0,0,0,0,0,"","","","","","","","","","",""]
[10,{"$f":"$D$1","v":"XXX Team"},"L-Name","Chandra",null,"# of AB's",null,{"$f":"SUM(J49:AA49)","v":63},"AB's",9,9,9,9,9,9,9]
[null,null,"F-Name","Cruz",null,"# of Hits",null,{"$f":"SUM(J50:AA50)","v":0},"Hits",0,0,0,0,0,0,0]
[null,null,null,null,null,"# of PA",null,{"$f":"SUM(J51:AA51)","v":63},"PA",9,9,9,9,9,9,9]
[null,null,null,"f",null,"Avg",null,{"$f":"IF(H49=0,\"\",H50/H49)","v":0},"Avg",{"$f":"IF(J49=\"\",\"\",J50/J49)","v":0},0,0,0,0,0,0,"","","","","","","","","","",""]
[11,{"$f":"$D$1","v":"XXX Team"},"L-Name","Josh",null,"# of AB's",null,{"$f":"SUM(J53:AA53)","v":63},"AB's",9,9,9,9,9,9,9]
[null,null,"F-Name","Anderson",null,"# of Hits",null,{"$f":"SUM(J54:AA54)","v":0},"Hits",0,0,0,0,0,0,0]
[null,null,null,null,null,"# of PA",null,{"$f":"SUM(J55:AA55)","v":63},"PA",9,9,9,9,9,9,9]
[null,null,null,"m",null,"Avg",null,{"$f":"IF(H53=0,\"\",H54/H53)","v":0},"Avg",{"$f":"IF(J53=\"\",\"\",J54/J53)","v":0},0,0,0,0,0,0,"","","","","","","","","","",""]
[12,{"$f":"$D$1","v":"XXX Team"},"L-Name","Anna",null,"# of AB's",null,{"$f":"SUM(J57:AA57)","v":63},"AB's",9,9,9,9,9,9,9]
[null,null,"F-Name","Hall",null,"# of Hits",null,{"$f":"SUM(J58:AA58)","v":0},"Hits",0,0,0,0,0,0,0]
[null,null,null,null,null,"# of PA",null,{"$f":"SUM(J59:AA59)","v":63},"PA",9,9,9,9,9,9,9]
[null,null,null,"f",null,"Avg",null,{"$f":"IF(H57=0,\"\",H58/H57)","v":0},"Avg",{"$f":"IF(J57=\"\",\"\",J58/J57)","v":0},null,0,0,0,0,0,"","","","","","","","","","",""]
[13,{"$f":"$D$1","v":"XXX Team"},"L-Name","Dan",null,"# of AB's",null,{"$f":"SUM(J61:AA61)","v":63},"AB's",9,9,9,9,9,9,9]
[null,null,"F-Name","Flynn",null,"# of Hits",null,{"$f":"SUM(J62:AA62)","v":0},"Hits",0,0,0,0,0,0,0]
[null,null,null,null,null,"# of PA",null,{"$f":"SUM(J63:AA63)","v":63},"PA",9,9,9,9,9,9,9]
[null,null,null,"m",null,"Avg",null,{"$f":"IF(H61=0,\"\",H62/H61)","v":0},"Avg",{"$f":"IF(J61=\"\",\"\",J62/J61)","v":0},0,0,0,0,0,0,"","","","","","","","","","",""]
[14,{"$f":"$D$1","v":"XXX Team"},"L-Name","J C",null,"# of AB's",null,{"$f":"SUM(J65:AA65)","v":63},"AB's",9,9,9,9,9,9,9]
[null,null,"F-Name","Garcia",null,"# of Hits",null,{"$f":"SUM(J66:AA66)","v":0},"Hits",0,0,0,0,0,0,0]
[null,null,null,null,null,"# of PA",null,{"$f":"SUM(J67:AA67)","v":63},"PA",9,9,9,9,9,9,9]
[null,null,null,"m",null,"Avg",null,{"$f":"IF(H65=0,\"\",H66/H65)","v":0},"Avg",{"$f":"IF(J65=\"\",\"\",J66/J65)","v":0},0,0,0,0,0,0,"","","","","","","","","","",""]
[15,{"$f":"$D$1","v":"XXX Team"},"L-Name",null,null,"# of AB's",null,{"$f":"SUM(J69:AA69)","v":0},"AB's"]
[null,null,"F-Name",null,null,"# of Hits",null,{"$f":"SUM(J70:AA70)","v":0},"Hits"]
[null,null,null,null,null,"# of PA",null,{"$f":"SUM(J71:AA71)","v":0},"PA"]
[null,null,null,"m",null,"Avg",null,{"$f":"IF(H69=0,\"\",H70/H69)","v":""},"Avg",{"$f":"IF(J69=\"\",\"\",J70/J69)","v":""},"","","","","","","","","","","","","","","","",""]
[16,{"$f":"$D$1","v":"XXX Team"},"L-Name",null,null,"# of AB's",null,{"$f":"SUM(J73:AA73)","v":0},"AB's"]
[null,null,"F-Name",null,null,"# of Hits",null,{"$f":"SUM(J74:AA74)","v":0},"Hits"]
[null,null,null,null,null,"# of PA",null,{"$f":"SUM(J75:AA75)","v":0},"PA"]
[null,null,null,"f",null,"Avg",null,{"$f":"IF(H73=0,\"\",H74/H73)","v":""},"Avg",{"$f":"IF(J73=\"\",\"\",J74/J73)","v":""},"","","","","","","","","","","","","","","","",""]
[17,{"$f":"$D$1","v":"XXX Team"},"L-Name",null,null,"# of AB's",null,{"$f":"SUM(J77:AA77)","v":0},"AB's"]
[null,null,"F-Name",null,null,"# of Hits",null,{"$f":"SUM(J78:AA78)","v":0},"Hits"]
[null,null,null,null,null,"# of PA",null,{"$f":"SUM(J79:AA79)","v":0},"PA"]
[null,null,null,"f",null,"Avg",null,{"$f":"IF(H77=0,\"\",H78/H77)","v":""},"Avg",{"$f":"IF(J77=\"\",\"\",J78/J77)","v":""},"","","","","","","","","","","","","","","","",""]
[18,{"$f":"$D$1","v":"XXX Team"},"L-Name",null,null,"# of AB's",null,{"$f":"SUM(J81:AA81)","v":0},"AB's"]
[null,null,"F-Name",null,null,"# of Hits",null,{"$f":"SUM(J82:AA82)","v":0},"Hits"]
[null,null,null,null,null,"# of PA",null,{"$f":"SUM(J83:AA83)","v":0},"PA"]
[null,null,null,"f",null,"Avg",null,{"$f":"IF(H81=0,\"\",H82/H81)","v":""},"Avg",{"$f":"IF(J81=\"\",\"\",J82/J81)","v":""},"","","","","","","","","","","","","","","","",""]
[19,{"$f":"$D$1","v":"XXX Team"},"L-Name",null,null,"# of AB's",null,{"$f":"SUM(J85:AA85)","v":0},"AB's"]
[null,null,"F-Name",null,null,"# of Hits",null,{"$f":"SUM(J86:AA86)","v":0},"Hits"]
[null,null,null,null,null,"# of PA",null,{"$f":"SUM(J87:AA87)","v":0},"PA"]
[null,null,null,"f",null,"Avg",null,{"$f":"IF(H85=0,\"\",H86/H85)","v":""},"Avg",{"$f":"IF(J85=\"\",\"\",J86/J85)","v":""},"","","","","","","","","","","","","","","","",""]
[20,{"$f":"$D$1","v":"XXX Team"},"L-Name",null,null,"# of AB's",null,{"$f":"SUM(J89:AA89)","v":0},"AB's"]
[null,null,"F-Name",null,null,"# of Hits",null,{"$f":"SUM(J90:AA90)","v":0},"Hits"]
[null,null,null,null,null,"# of PA",null,{"$f":"SUM(J91:AA91)","v":0},"PA"]
[null,null,null,"f",null,"Avg",null,{"$f":"IF(H89=0,\"\",H90/H89)","v":""},"Avg",{"$f":"IF(J89=\"\",\"\",J90/J89)","v":""},"","","","","","","","","","","","","","","","",""]
[21,{"$f":"$D$1","v":"XXX Team"},"L-Name",null,null,"# of AB's",null,{"$f":"SUM(J93:AA93)","v":0},"AB's"]
[null,null,"F-Name",null,null,"# of Hits",null,{"$f":"SUM(J94:AA94)","v":0},"Hits"]
[null,null,null,null,null,"# of PA",null,{"$f":"SUM(J95:AA95)","v":0},"PA"]
[null,null,null,"f",null,"Avg",null,{"$f":"IF(H93=0,\"\",H94/H93)","v":""},"Avg",{"$f":"IF(J93=\"\",\"\",J94/J93)","v":""},"","","","","","","","","","","","","","","","",""]
[22,{"$f":"$D$1","v":"XXX Team"},"L-Name",null,null,"# of AB's",null,{"$f":"SUM(J97:AA97)","v":0},"AB's"]
[null,null,"F-Name",null,null,"# of Hits",null,{"$f":"SUM(J98:AA98)","v":0},"Hits"]
[null,null,null,null,null,"# of PA",null,{"$f":"SUM(J99:AA99)","v":0},"PA"]
[null,null,null,"f",null,"Avg",null,{"$f":"IF(H97=0,\"\",H98/H97)","v":""},"Avg",{"$f":"IF(J97=\"\",\"\",J98/J97)","v":""},"","","","","","","","","","","","","","","","",""]
[23,{"$f":"$D$1","v":"XXX Team"},"L-Name",null,null,"# of AB's",null,{"$f":"SUM(J101:AA101)","v":0},"AB's"]
[null,null,"F-Name",null,null,"# of Hits",null,{"$f":"SUM(J102:AA102)","v":0},"Hits"]
[null,null,null,null,null,"# of PA",null,{"$f":"SUM(J103:AA103)","v":0},"PA"]
[null,null,null,"f",null,"Avg",null,{"$f":"IF(H101=0,\"\",H102/H101)","v":""},"Avg",{"$f":"IF(J101=\"\",\"\",J102/J101)","v":""},"","","","","","","","","","","","","","","","",""]
[24,{"$f":"$D$1","v":"XXX Team"},"L-Name",null,null,"# of AB's",null,{"$f":"SUM(J105:AA105)","v":0},"AB's"]
[null,null,"F-Name",null,null,"# of Hits",null,{"$f":"SUM(J106:AA106)","v":0},"Hits"]
[null,null,null,null,null,"# of PA",null,{"$f":"SUM(J107:AA107)","v":0},"PA"]
[null,null,null,"f",null,"Avg",null,{"$f":"IF(H105=0,\"\",H106/H105)","v":""},"Avg",{"$f":"IF(J105=\"\",\"\",J106/J105)","v":""},"","","","","","","","","","","","","","","","",""]
[25,{"$f":"$D$1","v":"XXX Team"},"L-Name",null,null,"# of AB's",null,{"$f":"SUM(J109:AA109)","v":0},"AB's"]
[null,null,"F-Name",null,null,"# of Hits",null,{"$f":"SUM(J110:AA110)","v":0},"Hits"]
[null,null,null,null,null,"# of PA",null,{"$f":"SUM(J111:AA111)","v":0},"PA"]
[null,null,null,"f",null,"Avg",null,{"$f":"IF(H109=0,\"\",H110/H109)","v":""},"Avg",{"$f":"IF(J109=\"\",\"\",J110/J109)","v":""},"","","","","","","","","","","","","","","","",""]
[null,{"$f":"$D$1","v":"XXX Team"},null,"TEAM",null,"# of AB's",null,{"$f":"SUM(J113:AA113)","v":882},"AB's",{"$f":"IF(SUM(J109,J105,J101,J97,J93,J89,J85,J81,J77,J73,J69,J65,J61,J57,J53,J49,J45,J41,J37,J33,J29,J25,J21,J17,J13)=0,\"\",SUM(J13,J17,J21,J25,J29,J33,J37,J41,J45,J49,J53,J57,J61,J65,J69,J73,J77,J81,J85,J89,J93,J97,J101,J105,J109))","v":126},126,126,126,126,126,126,"","","","","","","","","","",""]
[null,null,null,"Summary",null,"# of Hits",null,{"$f":"SUM(J114:AA114)","v":0},"Hits",{"$f":"IF(SUM(J110,J106,J102,J98,J94,J90,J86,J82,J78,J74,J70,J66,J62,J58,J54,J50,J46,J42,J38,J34,J30,J26,J22,J18,J14)=0,\"\",SUM(J14,J18,J22,J26,J30,J34,J38,J42,J46,J50,J54,J58,J62,J66,J70,J74,J78,J82,J86,J90,J94,J98,J102,J106,J110))","v":""},"","","","","","","","","","","","","","","","",""]
[null,null,null,null,null,"Avg",null,{"$f":"IF(H113=0,\"N/A\",H114/H113)","v":0},"Avg",{"$f":"IF(J113=\"\",\"\",J114/J113)","v":{"$error":"#VALUE!"}},{"$error":"#VALUE!"},{"$error":"#VALUE!"},{"$error":"#VALUE!"},{"$error":"#VALUE!"},{"$error":"#VALUE!"},{"$error":"#VALUE!"},"","","","","","","","","","",""]

{"sheet":"YY Team","index":7,"n_rows":115,"n_cols":27,"rows_kept":115,"cut":false,"hidden":false,"merged":[]}
[null,null,"Team Name","YY Team",null,null,null,null,"Score",0,0,0,0,0,0,0]
[null,null,null,null,null,null,null,null,"Opponents Score",8,8,8,8,8,8,8]
[null,null,null,"Wins",null,{"$f":"SUM(J6:AA6)","v":0},null,null,"W or L",{"$f":"IF(SUM(J1,J2)=0,\"\",IF(J1<J2,\"L\",\"W\"))","v":"L"},"L","L","L","L","L","L","","","","","","","","","","",""]
[null,null,null,"Losses",null,{"$f":"SUM(J7:AA7)","v":7},null,"Forfeit","FW or FL"]
[null,null,null,null,"games played excluding Forfeit Wins",null,null,null,null,{"$f":"IF(J3=\"\",\"\",IF(J4=\"FW\",\"\",1))","v":1},1,1,1,1,1,1,"","","","","","","","","","",""]
[null,null,null,null,null,null,null,{"$f":"IF(H4=\"w\",1,\"\")","v":""},"win",{"$f":"IF(J3=\"w\",1,\"\")","v":""},"","","","","","","","","","","","","","","","",""]
[null,null,null,null,null,null,null,{"$f":"IF(H4=\"l\",1,\"\")","v":""},"loss",{"$f":"IF(J3=\"l\",1,\"\")","v":1},1,1,1,1,1,1,"","","","","","","","","","",""]
[null,null,null,"Games Played Excluding Forfeit Wins",null,{"$f":"SUM(J5:AA5)","v":7},null,"Opponents Team Name"]
[null,null,null,"League Run Diff     ",null,{"$f":"SUM(J9:AA9)","v":-56},null,null,"Game Run Diff",{"$f":"IF(J1=\"\",\"\",J1-J2)","v":-8},-8,-8,-8,-8,-8,-8,"","","","","","","","","","",""]
[null,null,null,"Team Batting Avg   ",null,{"$f":"$H$115","v":0},null,null,"Game Date","2023-08-10"]
[]
[null,null,null,null,null,null,null,"STATS",null,1,2,3,4,5,6,7,8,9,10,11,12,13,14,15,16,17,18]
[1,{"$f":"$D$1","v":"YY Team"},"L-Name","Kyle",null,"# of AB's",null,{"$f":"SUM(J13:AA13)","v":63},"AB's",9,9,9,9,9,9,9]
[null,null,"F-Name","O'Bryant ",null,"# of Hits",null,{"$f":"SUM(J14:AA14)","v":0},"Hits",0,0,0,0,0,0,0]
[null,null,null,null,null,"# of PA",null,{"$f":"SUM(J15:AA15)","v":63},"PA",9,9,9,9,9,9,9]
[null,null,null,"m",null,"Avg",null,{"$f":"IF(H13=0,\"\",(H14/H13))","v":0},"Avg",{"$f":"IF(J13=\"\",\"\",J14/J13)","v":0},0,0,0,0,0,0,"","","","","","","","","","",""]
[2,{"$f":"$D$1","v":"YY Team"},"L-Name","Tasha",null,"# of AB's",null,{"$f":"SUM(J17:AA17)","v":63},"AB's",9,9,9,9,9,9,9]
[null,null,"F-Name","Arnold",null,"# of Hits",null,{"$f":"SUM(J18:AA18)","v":0},"Hits",0,0,0,0,0,0,0]
[null,null,null,null,null,"# of PA",null,{"$f":"SUM(J19:AA19)","v":63},"PA",9,9,9,9,9,9,9]
[null,null,null,"f",null,"Avg",null,{"$f":"IF(H17=0,\"\",H18/H17)","v":0},"Avg",{"$f":"IF(J17=\"\",\"\",J18/J17)","v":0},0,0,0,0,0,0,"","","","","","","","","","",""]
[3,{"$f":"$D$1","v":"YY Team"},"L-Name","Stephen ",null,"# of AB's",null,{"$f":"SUM(J21:AA21)","v":63},"AB's",9,9,9,9,9,9,9]
[null,null,"F-Name","Hart",null,"# of Hits",null,{"$f":"SUM(J22:AA22)","v":0},"Hits",0,0,0,0,0,0,0]
[null,null,null,null,null,"# of PA",null,{"$f":"SUM(J23:AA23)","v":63},"PA",9,9,9,9,9,9,9]
[null,null,null,"m",null,"Avg",null,{"$f":"IF(H21=0,\"\",H22/H21)","v":0},"Avg",{"$f":"IF(J21=\"\",\"\",J22/J21)","v":0},0,0,0,0,0,0,"","","","","","","","","","",""]
[4,{"$f":"$D$1","v":"YY Team"},"L-Name","Josie",null,"# of AB's",null,{"$f":"SUM(J25:AA25)","v":63},"AB's",9,9,9,9,9,9,9]
[null,null,"F-Name","Harris",null,"# of Hits",null,{"$f":"SUM(J26:AA26)","v":0},"Hits",0,0,0,0,0,0,0]
[null,null,null,null,null,"# of PA",null,{"$f":"SUM(J27:AA27)","v":63},"PA",9,9,9,9,9,9,9]
[null,null,null,"f",null,"Avg",null,{"$f":"IF(H25=0,\"\",H26/H25)","v":0},"Avg",{"$f":"IF(J25=\"\",\"\",J26/J25)","v":0},0,0,0,0,0,0,"","","","","","","","","","",""]
[5,{"$f":"$D$1","v":"YY Team"},"L-Name","Logan",null,"# of AB's",null,{"$f":"SUM(J29:AA29)","v":63},"AB's",9,9,9,9,9,9,9]
[null,null,"F-Name","Bateman",null,"# of Hits",null,{"$f":"SUM(J30:AA30)","v":0},"Hits",0,0,0,0,0,0,0]
[null,null,null,null,null,"# of PA",null,{"$f":"SUM(J31:AA31)","v":63},"PA",9,9,9,9,9,9,9]
[null,null,null,"m",null,"Avg",null,{"$f":"IF(H29=0,\"\",H30/H29)","v":0},"Avg",{"$f":"IF(J29=\"\",\"\",J30/J29)","v":0},0,0,0,0,0,0,"","","","","","","","","","",""]
[6,{"$f":"$D$1","v":"YY Team"},"L-Name","Britt",null,"# of AB's",null,{"$f":"SUM(J33:AA33)","v":63},"AB's",9,9,9,9,9,9,9]
[null,null,"F-Name","Call",null,"# of Hits",null,{"$f":"SUM(J34:AA34)","v":0},"Hits",0,0,0,0,0,0,0]
[null,null,null,null,null,"# of PA",null,{"$f":"SUM(J35:AA35)","v":63},"PA",9,9,9,9,9,9,9]
[null,null,null,"f",null,"Avg",null,{"$f":"IF(H33=0,\"\",H34/H33)","v":0},"Avg",{"$f":"IF(J33=\"\",\"\",J34/J33)","v":0},0,0,0,0,0,0,"","","","","","","","","","",""]
[7,{"$f":"$D$1","v":"YY Team"},"L-Name","Russ",null,"# of AB's",null,{"$f":"SUM(J37:AA37)","v":63},"AB's",9,9,9,9,9,9,9]
[null,null,"F-Name","Collins",null,"# of Hits",null,{"$f":"SUM(J38:AA38)","v":0},"Hits",0,0,0,0,0,0,0]
[null,null,null,null,null,"# of PA",null,{"$f":"SUM(J39:AA39)","v":63},"PA",9,9,9,9,9,9,9]
[null,null,null,"m",null,"Avg",null,{"$f":"IF(H37=0,\"\",H38/H37)","v":0},"Avg",{"$f":"IF(J37=\"\",\"\",J38/J37)","v":0},0,0,0,0,0,0,"","","","","","","","","","",""]
[8,{"$f":"$D$1","v":"YY Team"},"L-Name","Lindsay",null,"# of AB's",null,{"$f":"SUM(J41:AA41)","v":63},"AB's",9,9,9,9,9,9,9]
[null,null,"F-Name","Pennington",null,"# of Hits",null,{"$f":"SUM(J42:AA42)","v":0},"Hits",0,0,0,0,0,0,0]
[null,null,null,null,null,"# of PA",null,{"$f":"SUM(J43:AA43)","v":63},"PA",9,9,9,9,9,9,9]
[null,null,null,"f",null,"Avg",null,{"$f":"IF(H41=0,\"\",H42/H41)","v":0},"Avg",{"$f":"IF(J41=\"\",\"\",J42/J41)","v":0},0,0,0,0,0,0,"","","","","","","","","","",""]
[9,{"$f":"$D$1","v":"YY Team"},"L-Name","John",null,"# of AB's",null,{"$f":"SUM(J45:AA45)","v":63},"AB's",9,9,9,9,9,9,9]
[null,null,"F-Name","Campbell",null,"# of Hits",null,{"$f":"SUM(J46:AA46)","v":0},"Hits",0,0,0,0,0,0,0]
[null,null,null,null,null,"# of PA",null,{"$f":"SUM(J47:AA47)","v":63},"PA",9,9,9,9,9,9,9]
[null,null,null,"m",null,"Avg",null,{"$f":"IF(H45=0,\"\",H46/H45)","v":0},"Avg",{"$f":"IF(J45=\"\",\"\",J46/J45)","v":0},0,0,0,0,0,0,"","","","","","","","","","",""]
[10,{"$f":"$D$1","v":"YY Team"},"L-Name","Taylor",null,"# of AB's",null,{"$f":"SUM(J49:AA49)","v":63},"AB's",9,9,9,9,9,9,9]
[null,null,"F-Name","McCallum",null,"# of Hits",null,{"$f":"SUM(J50:AA50)","v":0},"Hits",0,0,0,0,0,0,0]
[null,null,null,null,null,"# of PA",null,{"$f":"SUM(J51:AA51)","v":63},"PA",9,9,9,9,9,9,9]
[null,null,null,"f",null,"Avg",null,{"$f":"IF(H49=0,\"\",H50/H49)","v":0},"Avg",{"$f":"IF(J49=\"\",\"\",J50/J49)","v":0},0,0,0,0,0,0,"","","","","","","","","","",""]
[11,{"$f":"$D$1","v":"YY Team"},"L-Name","Jennie",null,"# of AB's",null,{"$f":"SUM(J53:AA53)","v":63},"AB's",9,9,9,9,9,9,9]
[null,null,"F-Name","Anderson",null,"# of Hits",null,{"$f":"SUM(J54:AA54)","v":0},"Hits",0,0,0,0,0,0,0]
[null,null,null,null,null,"# of PA",null,{"$f":"SUM(J55:AA55)","v":63},"PA",9,9,9,9,9,9,9]
[null,null,null,"f",null,"Avg",null,{"$f":"IF(H53=0,\"\",H54/H53)","v":0},"Avg",{"$f":"IF(J53=\"\",\"\",J54/J53)","v":0},null,0,0,0,0,0,"","","","","","","","","","",""]
[12,{"$f":"$D$1","v":"YY Team"},"L-Name",null,null,"# of AB's",null,{"$f":"SUM(J57:AA57)","v":0},"AB's"]
[null,null,"F-Name",null,null,"# of Hits",null,{"$f":"SUM(J58:AA58)","v":0},"Hits"]
[null,null,null,null,null,"# of PA",null,{"$f":"SUM(J59:AA59)","v":0},"PA"]
[null,null,null,"f",null,"Avg",null,{"$f":"IF(H57=0,\"\",H58/H57)","v":""},"Avg",{"$f":"IF(J57=\"\",\"\",J58/J57)","v":""},"","","","","",null,{"$f":"IF(Q57=\"\",\"\",Q58/Q57)","v":""},"","","","","","","","","",""]
[13,{"$f":"$D$1","v":"YY Team"},"B",null,null,"# of AB's",null,{"$f":"SUM(J61:AA61)","v":0},"AB's"]
[null,null,"F-Name",null,null,"# of Hits",null,{"$f":"SUM(J62:AA62)","v":0},"Hits"]
[null,null,null,null,null,"# of PA",null,{"$f":"SUM(J63:AA63)","v":0},"PA"]
[null,null,null,"f",null,"Avg",null,{"$f":"IF(H61=0,\"\",H62/H61)","v":""},"Avg",{"$f":"IF(J61=\"\",\"\",J62/J61)","v":""},"","","","","","","","","","","","","","","","",""]
[14,{"$f":"$D$1","v":"YY Team"},"L-Name",null,null,"# of AB's",null,{"$f":"SUM(J65:AA65)","v":0},"AB's"]
[null,null,"F-Name",null,null,"# of Hits",null,{"$f":"SUM(J66:AA66)","v":0},"Hits"]
[null,null,null,null,null,"# of PA",null,{"$f":"SUM(J67:AA67)","v":0},"PA"]
[null,null,null,"f",null,"Avg",null,{"$f":"IF(H65=0,\"\",H66/H65)","v":""},"Avg",{"$f":"IF(J65=\"\",\"\",J66/J65)","v":""},"","","","","","","","","","","","","","","","",""]
[15,{"$f":"$D$1","v":"YY Team"},"L-Name",null,null,"# of AB's",null,{"$f":"SUM(J69:AA69)","v":0},"AB's"]
[null,null,"F-Name",null,null,"# of Hits",null,{"$f":"SUM(J70:AA70)","v":0},"Hits"]
[null,null,null,null,null,"# of PA",null,{"$f":"SUM(J71:AA71)","v":0},"PA"]
[null,null,null,"f",null,"Avg",null,{"$f":"IF(H69=0,\"\",H70/H69)","v":""},"Avg",{"$f":"IF(J69=\"\",\"\",J70/J69)","v":""},"","","","","","","","",null,{"$f":"IF(T69=\"\",\"\",T70/T69)","v":""},"","","","","","",""]
[16,{"$f":"$D$1","v":"YY Team"},"R",null,null,"# of AB's",null,{"$f":"SUM(J73:AA73)","v":0},"AB's"]
[null,null,"F-Name",null,null,"# of Hits",null,{"$f":"SUM(J74:AA74)","v":0},"Hits"]
[null,null,null,null,null,"# of PA",null,{"$f":"SUM(J75:AA75)","v":0},"PA"]
[null,null,null,"f",null,"Avg",null,{"$f":"IF(H73=0,\"\",H74/H73)","v":""},"Avg",{"$f":"IF(J73=\"\",\"\",J74/J73)","v":""},"","","","","","","","","","","","","","","","",""]
[17,{"$f":"$D$1","v":"YY Team"},"L-Name",null,null,"# of AB's",null,{"$f":"SUM(J77:AA77)","v":0},"AB's"]
[null,null,"F-Name",null,null,"# of Hits",null,{"$f":"SUM(J78:AA78)","v":0},"Hits"]
[null,null,null,null,null,"# of PA",null,{"$f":"SUM(J79:AA79)","v":0},"PA"]
[null,null,null,"f",null,"Avg",null,{"$f":"IF(H77=0,\"\",H78/H77)","v":""},"Avg",{"$f":"IF(J77=\"\",\"\",J78/J77)","v":""},"","","","","","","","","","","","","","","","",""]
[18,{"$f":"$D$1","v":"YY Team"},"L-Name",null,null,"# of AB's",null,{"$f":"SUM(J81:AA81)","v":0},"AB's"]
[null,null,"F-Name",null,null,"# of Hits",null,{"$f":"SUM(J82:AA82)","v":0},"Hits"]
[null,null,null,null,null,"# of PA",null,{"$f":"SUM(J83:AA83)","v":0},"PA"]
[null,null,null,"f",null,"Avg",null,{"$f":"IF(H81=0,\"\",H82/H81)","v":""},"Avg",{"$f":"IF(J81=\"\",\"\",J82/J81)","v":""},"","","","","","","","","","","","","","","","",""]
[19,{"$f":"$D$1","v":"YY Team"},"L-Name",null,null,"# of AB's",null,{"$f":"SUM(J85:AA85)","v":0},"AB's"]
[null,null,"F-Name",null,null,"# of Hits",null,{"$f":"SUM(J86:AA86)","v":0},"Hits"]
[null,null,null,null,null,"# of PA",null,{"$f":"SUM(J87:AA87)","v":0},"PA"]
[null,null,null,"f",null,"Avg",null,{"$f":"IF(H85=0,\"\",H86/H85)","v":""},"Avg",{"$f":"IF(J85=\"\",\"\",J86/J85)","v":""},"","","","","","","","","","","","","","","","",""]
[20,{"$f":"$D$1","v":"YY Team"},"L-Name",null,null,"# of AB's",null,{"$f":"SUM(J89:AA89)","v":0},"AB's"]
[null,null,"F-Name",null,null,"# of Hits",null,{"$f":"SUM(J90:AA90)","v":0},"Hits"]
[null,null,null,null,null,"# of PA",null,{"$f":"SUM(J91:AA91)","v":0},"PA"]
[null,null,null,"f",null,"Avg",null,{"$f":"IF(H89=0,\"\",H90/H89)","v":""},"Avg",{"$f":"IF(J89=\"\",\"\",J90/J89)","v":""},"","","","","","","","","","","","","","","","",""]
[21,{"$f":"$D$1","v":"YY Team"},"L-Name",null,null,"# of AB's",null,{"$f":"SUM(J93:AA93)","v":0},"AB's"]
[null,null,"F-Name",null,null,"# of Hits",null,{"$f":"SUM(J94:AA94)","v":0},"Hits"]
[null,null,null,null,null,"# of PA",null,{"$f":"SUM(J95:AA95)","v":0},"PA"]
[null,null,null,"f",null,"Avg",null,{"$f":"IF(H93=0,\"\",H94/H93)","v":""},"Avg",{"$f":"IF(J93=\"\",\"\",J94/J93)","v":""},"","","","","","","","","","","","","","","","",""]
[22,{"$f":"$D$1","v":"YY Team"},"L-Name",null,null,"# of AB's",null,{"$f":"SUM(J97:AA97)","v":0},"AB's"]
[null,null,"F-Name",null,null,"# of Hits",null,{"$f":"SUM(J98:AA98)","v":0},"Hits"]
[null,null,null,null,null,"# of PA",null,{"$f":"SUM(J99:AA99)","v":0},"PA"]
[null,null,null,"f",null,"Avg",null,{"$f":"IF(H97=0,\"\",H98/H97)","v":""},"Avg",{"$f":"IF(J97=\"\",\"\",J98/J97)","v":""},"","","","","","","","","","","","","","","","",""]
[23,{"$f":"$D$1","v":"YY Team"},"L-Name",null,null,"# of AB's",null,{"$f":"SUM(J101:AA101)","v":0},"AB's"]
[null,null,"F-Name",null,null,"# of Hits",null,{"$f":"SUM(J102:AA102)","v":0},"Hits"]
[null,null,null,null,null,"# of PA",null,{"$f":"SUM(J103:AA103)","v":0},"PA"]
[null,null,null,"f",null,"Avg",null,{"$f":"IF(H101=0,\"\",H102/H101)","v":""},"Avg",{"$f":"IF(J101=\"\",\"\",J102/J101)","v":""},"","","","","","","","","","","","","","","","",""]
[24,{"$f":"$D$1","v":"YY Team"},"L-Name",null,null,"# of AB's",null,{"$f":"SUM(J105:AA105)","v":0},"AB's"]
[null,null,"F-Name",null,null,"# of Hits",null,{"$f":"SUM(J106:AA106)","v":0},"Hits"]
[null,null,null,null,null,"# of PA",null,{"$f":"SUM(J107:AA107)","v":0},"PA"]
[null,null,null,"f",null,"Avg",null,{"$f":"IF(H105=0,\"\",H106/H105)","v":""},"Avg",{"$f":"IF(J105=\"\",\"\",J106/J105)","v":""},"","","","","","","","","","","","","","","","",""]
[25,{"$f":"$D$1","v":"YY Team"},"L-Name",null,null,"# of AB's",null,{"$f":"SUM(J109:AA109)","v":0},"AB's"]
[null,null,"F-Name",null,null,"# of Hits",null,{"$f":"SUM(J110:AA110)","v":0},"Hits"]
[null,null,null,null,null,"# of PA",null,{"$f":"SUM(J111:AA111)","v":0},"PA"]
[null,null,null,"f",null,"Avg",null,{"$f":"IF(H109=0,\"\",H110/H109)","v":""},"Avg",{"$f":"IF(J109=\"\",\"\",J110/J109)","v":""},"","","","","","","","","","","","","","","","",""]
[null,{"$f":"$D$1","v":"YY Team"},null,"TEAM",null,"# of AB's",null,{"$f":"SUM(J113:AA113)","v":693},"AB's",{"$f":"IF(SUM(J109,J105,J101,J97,J93,J89,J85,J81,J77,J73,J69,J65,J61,J57,J53,J49,J45,J41,J37,J33,J29,J25,J21,J17,J13)=0,\"\",SUM(J13,J17,J21,J25,J29,J33,J37,J41,J45,J49,J53,J57,J61,J65,J69,J73,J77,J81,J85,J89,J93,J97,J101,J105,J109))","v":99},99,99,99,99,99,99,"","","","","","","","","","",""]
[null,null,null,"Summary",null,"# of Hits",null,{"$f":"SUM(J114:AA114)","v":0},"Hits",{"$f":"IF(SUM(J110,J106,J102,J98,J94,J90,J86,J82,J78,J74,J70,J66,J62,J58,J54,J50,J46,J42,J38,J34,J30,J26,J22,J18,J14)=0,\"\",SUM(J14,J18,J22,J26,J30,J34,J38,J42,J46,J50,J54,J58,J62,J66,J70,J74,J78,J82,J86,J90,J94,J98,J102,J106,J110))","v":""},"","","","","","","","","","","","","","","","",""]
[null,null,null,null,null,"Avg",null,{"$f":"IF(H113=0,\"N/A\",H114/H113)","v":0},"Avg",{"$f":"IF(J113=\"\",\"\",J114/J113)","v":{"$error":"#VALUE!"}},{"$error":"#VALUE!"},{"$error":"#VALUE!"},{"$error":"#VALUE!"},{"$error":"#VALUE!"},{"$error":"#VALUE!"},{"$error":"#VALUE!"},"","","","","","","","","","",""]

{"sheet":"XX Team","index":8,"n_rows":115,"n_cols":27,"rows_kept":115,"cut":false,"hidden":false,"merged":[]}
[null,null,"Team Name","XX Team",null,null,null,null,"Score",0,0,0,0,0,0]
[null,null,null,null,null,null,null,null,"Opponents Score",14,14,14,14,14,14]
[null,null,null,"Wins",null,{"$f":"SUM(J6:AA6)","v":0},null,null,"W or L",{"$f":"IF(SUM(J1,J2)=0,\"\",IF(J1<J2,\"L\",\"W\"))","v":"L"},"L","L","L","L","L","","","","","","","","","","","",""]
[null,null,null,"Losses",null,{"$f":"SUM(J7:AA7)","v":6},null,"Forfeit","FW or FL",null,null,null,null,null,null," "]
[null,null,null,null,"games played excluding Forfeit Wins",null,null,null,null,{"$f":"IF(J3=\"\",\"\",IF(J4=\"FW\",\"\",1))","v":1},1,1,1,1,1,"","","","","","","","","","","",""]
[null,null,null,null,null,null,null,{"$f":"IF(H4=\"w\",1,\"\")","v":""},"win",{"$f":"IF(J3=\"w\",1,\"\")","v":""},"","","","","","","","","","","","","","","","",""]
[null,null,null,null,null,null,null,{"$f":"IF(H4=\"l\",1,\"\")","v":""},"loss",{"$f":"IF(J3=\"l\",1,\"\")","v":1},1,1,1,1,1,"","","","","","","","","","","",""]
[null,null,null,"Games Played Excluding Forfeit Wins",null,{"$f":"SUM(J5:AA5)","v":6},null,"Opponents Team Name"]
[null,null,null,"League Run Diff     ",null,{"$f":"SUM(J9:AA9)","v":-84},null,null,"Game Run Diff",{"$f":"IF(J1=\"\",\"\",J1-J2)","v":-14},-14,-14,-14,-14,-14,"","","","","","","","","","","",""]
[null,null,null,"Team Batting Avg   ",null,{"$f":"$H$115","v":0},null,null,"Game Date"]
[]
[null,null,null,null,null,null,null,"STATS",null,1,2,3,4,5,6,7,8,9,10,11,12,13,14,15,16,17,18]
[1,{"$f":"$D$1","v":"XX Team"},"L-Name","Francis",null,"# of AB's",null,{"$f":"SUM(J13:AA13)","v":63},"AB's",9,9,9,9,9,9,9]
[null,null,"F-Name","Brown",null,"# of Hits",null,{"$f":"SUM(J14:AA14)","v":0},"Hits",0,0,0,0,0,0,0]
[null,null,null,null,null,"# of PA",null,{"$f":"SUM(J15:AA15)","v":63},"PA",9,9,9,9,9,9,9]
[null,null,null,"f",null,"Avg",null,{"$f":"IF(H13=0,\"\",(H14/H13))","v":0},"Avg",{"$f":"IF(J13=\"\",\"\",J14/J13)","v":0},0,0,0,0,0,0,"","","","","","","","","","",""]
[2,{"$f":"$D$1","v":"XX Team"},"L-Name","Josh",null,"# of AB's",null,{"$f":"SUM(J17:AA17)","v":63},"AB's",9,9,9,9,9,9,9]
[null,null,"F-Name","Wright",null,"# of Hits",null,{"$f":"SUM(J18:AA18)","v":0},"Hits",0,0,0,0,0,0,0]
[null,null,null,null,null,"# of PA",null,{"$f":"SUM(J19:AA19)","v":63},"PA",9,9,9,9,9,9,9]
[null,null,null,"m",null,"Avg",null,{"$f":"IF(H17=0,\"\",H18/H17)","v":0},"Avg",{"$f":"IF(J17=\"\",\"\",J18/J17)","v":0},0,0,0,0,0,0,"","","","","","","","","","",""]
[3,{"$f":"$D$1","v":"XX Team"},"L-Name","Mary",null,"# of AB's",null,{"$f":"SUM(J21:AA21)","v":63},"AB's",9,9,9,9,9,9,9]
[null,null,"F-Name","Childs",null,"# of Hits",null,{"$f":"SUM(J22:AA22)","v":0},"Hits",0,0,0,0,0,0,0]
[null,null,null,null,null,"# of PA",null,{"$f":"SUM(J23:AA23)","v":63},"PA",9,9,9,9,9,9,9]
[null,null,null,"f",null,"Avg",null,{"$f":"IF(H21=0,\"\",H22/H21)","v":0},"Avg",{"$f":"IF(J21=\"\",\"\",J22/J21)","v":0},0,0,0,0,0,0,"","","","","","","","","","",""]
[4,{"$f":"$D$1","v":"XX Team"},"L-Name","Thomas",null,"# of AB's",null,{"$f":"SUM(J25:AA25)","v":63},"AB's",9,9,9,9,9,9,9]
[null,null,"F-Name","Rich",null,"# of Hits",null,{"$f":"SUM(J26:AA26)","v":0},"Hits",0,0,0,0,0,0,0]
[null,null,null,null,null,"# of PA",null,{"$f":"SUM(J27:AA27)","v":63},"PA",9,9,9,9,9,9,9]
[null,null,null,"m",null,"Avg",null,{"$f":"IF(H25=0,\"\",H26/H25)","v":0},"Avg",{"$f":"IF(J25=\"\",\"\",J26/J25)","v":0},0,0,0,0,0,0,"","","","","","","","","","",""]
[5,{"$f":"$D$1","v":"XX Team"},"L-Name","Toni",null,"# of AB's",null,{"$f":"SUM(J29:AA29)","v":63},"AB's",9,9,9,9,9,9,9]
[null,null,"F-Name","Wall",null,"# of Hits",null,{"$f":"SUM(J30:AA30)","v":0},"Hits",0,0,0,0,0,0,0]
[null,null,null,null,null,"# of PA",null,{"$f":"SUM(J31:AA31)","v":63},"PA",9,9,9,9,9,9,9]
[null,null,null,"f",null,"Avg",null,{"$f":"IF(H29=0,\"\",H30/H29)","v":0},"Avg",{"$f":"IF(J29=\"\",\"\",J30/J29)","v":0},0,0,0,0,0,0,"","","","","","","","","","",""]
[6,{"$f":"$D$1","v":"XX Team"},"L-Name","Ken",null,"# of AB's",null,{"$f":"SUM(J33:AA33)","v":63},"AB's",9,9,9,9,9,9,9]
[null,null,"F-Name","Hansen",null,"# of Hits",null,{"$f":"SUM(J34:AA34)","v":0},"Hits",0,0,0,0,0,0,0]
[null,null,null,null,null,"# of PA",null,{"$f":"SUM(J35:AA35)","v":63},"PA",9,9,9,9,9,9,9]
[null,null,null,"m",null,"Avg",null,{"$f":"IF(H33=0,\"\",H34/H33)","v":0},"Avg",{"$f":"IF(J33=\"\",\"\",J34/J33)","v":0},0,0,0,0,0,0,"","","","","","","","","","",""]
[7,{"$f":"$D$1","v":"XX Team"},"L-Name","Shela",null,"# of AB's",null,{"$f":"SUM(J37:AA37)","v":63},"AB's",9,9,9,9,9,9,9]
[null,null,"F-Name","Anderson",null,"# of Hits",null,{"$f":"SUM(J38:AA38)","v":0},"Hits",0,0,0,0,0,0,0]
[null,null,null,null,null,"# of PA",null,{"$f":"SUM(J39:AA39)","v":63},"PA",9,9,9,9,9,9,9]
[null,null,null,"f",null,"Avg",null,{"$f":"IF(H37=0,\"\",H38/H37)","v":0},"Avg",{"$f":"IF(J37=\"\",\"\",J38/J37)","v":0},0,0,0,0,0,0,"","","","","","","","","","",""]
[8,{"$f":"$D$1","v":"XX Team"},"L-Name","Brandon",null,"# of AB's",null,{"$f":"SUM(J41:AA41)","v":63},"AB's",9,9,9,9,9,9,9]
[null,null,"F-Name","Blake",null,"# of Hits",null,{"$f":"SUM(J42:AA42)","v":0},"Hits",0,0,0,0,0,0,0]
[null,null,null,null,null,"# of PA",null,{"$f":"SUM(J43:AA43)","v":63},"PA",9,9,9,9,9,9,9]
[null,null,null,"m",null,"Avg",null,{"$f":"IF(H41=0,\"\",H42/H41)","v":0},"Avg",{"$f":"IF(J41=\"\",\"\",J42/J41)","v":0},0,0,0,0,0,0,"","","","","","","","","","",""]
[9,{"$f":"$D$1","v":"XX Team"},"L-Name","Nancy",null,"# of AB's",null,{"$f":"SUM(J45:AA45)","v":63},"AB's",9,9,9,9,9,9,9]
[null,null,"F-Name","Lowe",null,"# of Hits",null,{"$f":"SUM(J46:AA46)","v":0},"Hits",0,0,0,0,0,0,0]
[null,null,null,null,null,"# of PA",null,{"$f":"SUM(J47:AA47)","v":63},"PA",9,9,9,9,9,9,9]
[null,null,null,"f",null,"Avg",null,{"$f":"IF(H45=0,\"\",H46/H45)","v":0},"Avg",{"$f":"IF(J45=\"\",\"\",J46/J45)","v":0},0,0,0,0,0,0,"","","","","","","","","","",""]
[10,{"$f":"$D$1","v":"XX Team"},"L-Name","Alex",null,"# of AB's",null,{"$f":"SUM(J49:AA49)","v":63},"AB's",9,9,9,9,9,9,9]
[null,null,"F-Name","Johnson",null,"# of Hits",null,{"$f":"SUM(J50:AA50)","v":0},"Hits",0,0,0,0,0,0,0]
[null,null,null,null,null,"# of PA",null,{"$f":"SUM(J51:AA51)","v":63},"PA",9,9,9,9,9,9,9]
[null,null,null,"m",null,"Avg",null,{"$f":"IF(H49=0,\"\",H50/H49)","v":0},"Avg",{"$f":"IF(J49=\"\",\"\",J50/J49)","v":0},0,0,0,0,0,0,"","","","","","","","","","",""]
[11,{"$f":"$D$1","v":"XX Team"},"L-Name",null,null,"# of AB's",null,{"$f":"SUM(J53:AA53)","v":0},"AB's"]
[null,null,"F-Name",null,null,"# of Hits",null,{"$f":"SUM(J54:AA54)","v":0},"Hits"]
[null,null,null,null,null,"# of PA",null,{"$f":"SUM(J55:AA55)","v":0},"PA"]
[null,null,null,"f",null,"Avg",null,{"$f":"IF(H53=0,\"\",H54/H53)","v":""},"Avg",{"$f":"IF(J53=\"\",\"\",J54/J53)","v":""},"","","","","","","","","","","","","","","","",""]
[12,{"$f":"$D$1","v":"XX Team"},"L-Name",null,null,"# of AB's",null,{"$f":"SUM(J57:AA57)","v":0},"AB's"]
[null,null,"F-Name",null,null,"# of Hits",null,{"$f":"SUM(J58:AA58)","v":0},"Hits"]
[null,null,null,null,null,"# of PA",null,{"$f":"SUM(J59:AA59)","v":0},"PA"]
[null,null,null,"f",null,"Avg",null,{"$f":"IF(H57=0,\"\",H58/H57)","v":""},"Avg",{"$f":"IF(J57=\"\",\"\",J58/J57)","v":""},"","","","","","","","","","","","","","","","",""]
[13,{"$f":"$D$1","v":"XX Team"},"L-Name",null,null,"# of AB's",null,{"$f":"SUM(J61:AA61)","v":0},"AB's"]
[null,null,"F-Name",null,null,"# of Hits",null,{"$f":"SUM(J62:AA62)","v":0},"Hits"]
[null,null,null,null,null,"# of PA",null,{"$f":"SUM(J63:AA63)","v":0},"PA"]
[null,null,null,"f",null,"Avg",null,{"$f":"IF(H61=0,\"\",H62/H61)","v":""},"Avg",{"$f":"IF(J61=\"\",\"\",J62/J61)","v":""},"","","","","","","","","","","","","","","","",""]
[14,{"$f":"$D$1","v":"XX Team"},"L-Name",null,null,"# of AB's",null,{"$f":"SUM(J65:AA65)","v":0},"AB's"]
[null,null,"F-Name",null,null,"# of Hits",null,{"$f":"SUM(J66:AA66)","v":0},"Hits"]
[null,null,null,null,null,"# of PA",null,{"$f":"SUM(J67:AA67)","v":0},"PA"]
[null,null,null,"f",null,"Avg",null,{"$f":"IF(H65=0,\"\",H66/H65)","v":""},"Avg",{"$f":"IF(J65=\"\",\"\",J66/J65)","v":""},"","","","","","","","","","","","","","","","",""]
[15,{"$f":"$D$1","v":"XX Team"},"L-Name",null,null,"# of AB's",null,{"$f":"SUM(J69:AA69)","v":0},"AB's"]
[null,null,"F-Name",null,null,"# of Hits",null,{"$f":"SUM(J70:AA70)","v":0},"Hits"]
[null,null,null,null,null,"# of PA",null,{"$f":"SUM(J71:AA71)","v":0},"PA"]
[null,null,null,"f",null,"Avg",null,{"$f":"IF(H69=0,\"\",H70/H69)","v":""},"Avg",{"$f":"IF(J69=\"\",\"\",J70/J69)","v":""},"","","","","","","","","","","","","","","","",""]
[16,{"$f":"$D$1","v":"XX Team"},"L-Name",null,null,"# of AB's",null,{"$f":"SUM(J73:AA73)","v":0},"AB's"]
[null,null,"F-Name",null,null,"# of Hits",null,{"$f":"SUM(J74:AA74)","v":0},"Hits"]
[null,null,null,null,null,"# of PA",null,{"$f":"SUM(J75:AA75)","v":0},"PA"]
[null,null,null,"f",null,"Avg",null,{"$f":"IF(H73=0,\"\",H74/H73)","v":""},"Avg",{"$f":"IF(J73=\"\",\"\",J74/J73)","v":""},"","","","","","","","","","","","","","","","",""]
[17,{"$f":"$D$1","v":"XX Team"},"L-Name",null,null,"# of AB's",null,{"$f":"SUM(J77:AA77)","v":0},"AB's"]
[null,null,"F-Name",null,null,"# of Hits",null,{"$f":"SUM(J78:AA78)","v":0},"Hits"]
[null,null,null,null,null,"# of PA",null,{"$f":"SUM(J79:AA79)","v":0},"PA"]
[null,null,null,"f",null,"Avg",null,{"$f":"IF(H77=0,\"\",H78/H77)","v":""},"Avg",{"$f":"IF(J77=\"\",\"\",J78/J77)","v":""},"","","","","","","","","","","","","","","","",""]
[18,{"$f":"$D$1","v":"XX Team"},"L-Name",null,null,"# of AB's",null,{"$f":"SUM(J81:AA81)","v":0},"AB's"]
[null,null,"F-Name",null,null,"# of Hits",null,{"$f":"SUM(J82:AA82)","v":0},"Hits"]
[null,null,null,null,null,"# of PA",null,{"$f":"SUM(J83:AA83)","v":0},"PA"]
[null,null,null,"f",null,"Avg",null,{"$f":"IF(H81=0,\"\",H82/H81)","v":""},"Avg",{"$f":"IF(J81=\"\",\"\",J82/J81)","v":""},"","","","","","","","","","","","","","","","",""]
[19,{"$f":"$D$1","v":"XX Team"},"L-Name",null,null,"# of AB's",null,{"$f":"SUM(J85:AA85)","v":0},"AB's"]
[null,null,"F-Name",null,null,"# of Hits",null,{"$f":"SUM(J86:AA86)","v":0},"Hits"]
[null,null,null,null,null,"# of PA",null,{"$f":"SUM(J87:AA87)","v":0},"PA"]
[null,null,null,"f",null,"Avg",null,{"$f":"IF(H85=0,\"\",H86/H85)","v":""},"Avg",{"$f":"IF(J85=\"\",\"\",J86/J85)","v":""},"","","","","","","","","","","","","","","","",""]
[20,{"$f":"$D$1","v":"XX Team"},"L-Name",null,null,"# of AB's",null,{"$f":"SUM(J89:AA89)","v":0},"AB's"]
[null,null,"F-Name",null,null,"# of Hits",null,{"$f":"SUM(J90:AA90)","v":0},"Hits"]
[null,null,null,null,null,"# of PA",null,{"$f":"SUM(J91:AA91)","v":0},"PA"]
[null,null,null,"f",null,"Avg",null,{"$f":"IF(H89=0,\"\",H90/H89)","v":""},"Avg",{"$f":"IF(J89=\"\",\"\",J90/J89)","v":""},"","","","","","","","","","","","","","","","",""]
[21,{"$f":"$D$1","v":"XX Team"},"L-Name",null,null,"# of AB's",null,{"$f":"SUM(J93:AA93)","v":0},"AB's"]
[null,null,"F-Name",null,null,"# of Hits",null,{"$f":"SUM(J94:AA94)","v":0},"Hits"]
[null,null,null,null,null,"# of PA",null,{"$f":"SUM(J95:AA95)","v":0},"PA"]
[null,null,null,"f",null,"Avg",null,{"$f":"IF(H93=0,\"\",H94/H93)","v":""},"Avg",{"$f":"IF(J93=\"\",\"\",J94/J93)","v":""},"","","","","","","","","","","","","","","","",""]
[22,{"$f":"$D$1","v":"XX Team"},"L-Name",null,null,"# of AB's",null,{"$f":"SUM(J97:AA97)","v":0},"AB's"]
[null,null,"F-Name",null,null,"# of Hits",null,{"$f":"SUM(J98:AA98)","v":0},"Hits"]
[null,null,null,null,null,"# of PA",null,{"$f":"SUM(J99:AA99)","v":0},"PA"]
[null,null,null,"f",null,"Avg",null,{"$f":"IF(H97=0,\"\",H98/H97)","v":""},"Avg",{"$f":"IF(J97=\"\",\"\",J98/J97)","v":""},"","","","","","","","","","","","","","","","",""]
[23,{"$f":"$D$1","v":"XX Team"},"L-Name",null,null,"# of AB's",null,{"$f":"SUM(J101:AA101)","v":0},"AB's"]
[null,null,"F-Name",null,null,"# of Hits",null,{"$f":"SUM(J102:AA102)","v":0},"Hits"]
[null,null,null,null,null,"# of PA",null,{"$f":"SUM(J103:AA103)","v":0},"PA"]
[null,null,null,"f",null,"Avg",null,{"$f":"IF(H101=0,\"\",H102/H101)","v":""},"Avg",{"$f":"IF(J101=\"\",\"\",J102/J101)","v":""},"","","","","","","","","","","","","","","","",""]
[24,{"$f":"$D$1","v":"XX Team"},"L-Name",null,null,"# of AB's",null,{"$f":"SUM(J105:AA105)","v":0},"AB's"]
[null,null,"F-Name",null,null,"# of Hits",null,{"$f":"SUM(J106:AA106)","v":0},"Hits"]
[null,null,null,null,null,"# of PA",null,{"$f":"SUM(J107:AA107)","v":0},"PA"]
[null,null,null,"f",null,"Avg",null,{"$f":"IF(H105=0,\"\",H106/H105)","v":""},"Avg",{"$f":"IF(J105=\"\",\"\",J106/J105)","v":""},"","","","","","","","","","","","","","","","",""]
[25,{"$f":"$D$1","v":"XX Team"},"L-Name",null,null,"# of AB's",null,{"$f":"SUM(J109:AA109)","v":0},"AB's"]
[null,null,"F-Name",null,null,"# of Hits",null,{"$f":"SUM(J110:AA110)","v":0},"Hits"]
[null,null,null,null,null,"# of PA",null,{"$f":"SUM(J111:AA111)","v":0},"PA"]
[null,null,null,"f",null,"Avg",null,{"$f":"IF(H109=0,\"\",H110/H109)","v":""},"Avg",{"$f":"IF(J109=\"\",\"\",J110/J109)","v":""},"","","","","","","","","","","","","","","","",""]
[null,{"$f":"$D$1","v":"XX Team"},null,"TEAM",null,"# of AB's",null,{"$f":"SUM(J113:AA113)","v":630},"AB's",{"$f":"IF(SUM(J109,J105,J101,J97,J93,J89,J85,J81,J77,J73,J69,J65,J61,J57,J53,J49,J45,J41,J37,J33,J29,J25,J21,J17,J13)=0,\"\",SUM(J13,J17,J21,J25,J29,J33,J37,J41,J45,J49,J53,J57,J61,J65,J69,J73,J77,J81,J85,J89,J93,J97,J101,J105,J109))","v":90},90,90,90,90,90,90,"","","","","","","","","","",""]
[null,null,null,"Summary",null,"# of Hits",null,{"$f":"SUM(J114:AA114)","v":0},"Hits",{"$f":"IF(SUM(J110,J106,J102,J98,J94,J90,J86,J82,J78,J74,J70,J66,J62,J58,J54,J50,J46,J42,J38,J34,J30,J26,J22,J18,J14)=0,\"\",SUM(J14,J18,J22,J26,J30,J34,J38,J42,J46,J50,J54,J58,J62,J66,J70,J74,J78,J82,J86,J90,J94,J98,J102,J106,J110))","v":""},"","","","","","","","","","","","","","","","",""]
[null,null,null,null,null,"Avg",null,{"$f":"IF(H113=0,\"N/A\",H114/H113)","v":0},"Avg",{"$f":"IF(J113=\"\",\"\",J114/J113)","v":{"$error":"#VALUE!"}},{"$error":"#VALUE!"},{"$error":"#VALUE!"},{"$error":"#VALUE!"},{"$error":"#VALUE!"},{"$error":"#VALUE!"},{"$error":"#VALUE!"},"","","","","","","","","","",""]

{"sheet":"Female","index":9,"n_rows":201,"n_cols":12,"rows_kept":201,"cut":false,"hidden":false,"merged":[]}
["counter","roster #","Team Name","L-Name","F-Name","Batting Avg","# of AB's","# of Games","Enough pa's","HITS","# of PA","Male/Female"]
[83,{"$f":"'Thunder Ducks'!$A$41","v":8},{"$f":"'Thunder Ducks'!$D$1","v":"Thunder Ducks"},{"$f":"'Thunder Ducks'!$D$41","v":"Annie"},{"$f":"'Thunder Ducks'!$D$42","v":"Brady"},{"$f":"'Thunder Ducks'!$H$44","v":0.72727272727272729},{"$f":"'Thunder Ducks'!$H$41","v":11},{"$f":"'Thunder Ducks'!$F$8","v":4},{"$f":"IF(K2<(H2*2.5),\"N\",\"Y\")","v":"Y"},{"$f":"'Thunder Ducks'!$H$42","v":8},{"$f":"'Thunder Ducks'!$H$43","v":11},{"$f":"'Thunder Ducks'!$D$44","v":"f"}]
[52,{"$f":"'Ghetto Bombers'!$A$17","v":2},{"$f":"'Ghetto Bombers'!$D$1","v":"Ghetto Bombers"},{"$f":"'Ghetto Bombers'!$D$17","v":"Calleigh"},{"$f":"'Ghetto Bombers'!$D$18","v":"DeYoung"},{"$f":"'Ghetto Bombers'!$H$20","v":0.6875},{"$f":"'Ghetto Bombers'!$H$17","v":16},{"$f":"'Ghetto Bombers'!$F$8","v":4},"Y",{"$f":"'Ghetto Bombers'!$H$18","v":11},{"$f":"'Ghetto Bombers'!$H$19","v":18},{"$f":"'Ghetto Bombers'!$D$20","v":"f"}]
[54,{"$f":"'Ghetto Bombers'!$A$25","v":4},{"$f":"'Ghetto Bombers'!$D$1","v":"Ghetto Bombers"},{"$f":"'Ghetto Bombers'!$D$25","v":"Brandi"},{"$f":"'Ghetto Bombers'!$D$26","v":"Hall"},{"$f":"'Ghetto Bombers'!$H$28","v":0.55555555555555558},{"$f":"'Ghetto Bombers'!$H$25","v":18},{"$f":"'Ghetto Bombers'!$F$8","v":4},"Y",{"$f":"'Ghetto Bombers'!$H$26","v":10},{"$f":"'Ghetto Bombers'!$H$27","v":18},{"$f":"'Ghetto Bombers'!$D$28","v":"f"}]
[65,{"$f":"'Ghetto Bombers'!$A$69","v":15},{"$f":"'Ghetto Bombers'!$D$1","v":"Ghetto Bombers"},{"$f":"'Ghetto Bombers'!$D$69","v":"Hope"},{"$f":"'Ghetto Bombers'!$D$70","v":"Curtis"},{"$f":"'Ghetto Bombers'!$H$72","v":0.54545454545454541},{"$f":"'Ghetto Bombers'!$H$69","v":11},{"$f":"'Ghetto Bombers'!$F$8","v":4},"Y",{"$f":"'Ghetto Bombers'!$H$70","v":6},{"$f":"'Ghetto Bombers'!$H$71","v":11},{"$f":"'Ghetto Bombers'!$D$72","v":"f"}]
[4,{"$f":"'Bad Pitches'!$A$25","v":4},{"$f":"'Bad Pitches'!$D$1","v":"Bad Pitches"},{"$f":"'Bad Pitches'!$D$25","v":"Tanzie"},{"$f":"'Bad Pitches'!$D$26","v":"Gasu"},{"$f":"'Bad Pitches'!$H$28","v":0.5},{"$f":"'Bad Pitches'!$H$25","v":14},{"$f":"'Bad Pitches'!$F$8","v":3},"Y",{"$f":"'Bad Pitches'!$H$26","v":7},{"$f":"'Bad Pitches'!$H$27","v":14},{"$f":"'Bad Pitches'!$D$28","v":"f"}]
[56,{"$f":"'Ghetto Bombers'!$A$33","v":6},{"$f":"'Ghetto Bombers'!$D$1","v":"Ghetto Bombers"},{"$f":"'Ghetto Bombers'!$D$33","v":"JoJo"},{"$f":"'Ghetto Bombers'!$D$34","v":"Carlson"},{"$f":"'Ghetto Bombers'!$H$36","v":0.5},{"$f":"'Ghetto Bombers'!$H$33","v":10},{"$f":"'Ghetto Bombers'!$F$8","v":4},"Y",{"$f":"'Ghetto Bombers'!$H$34","v":5},{"$f":"'Ghetto Bombers'!$H$35","v":10},{"$f":"'Ghetto Bombers'!$D$36","v":"f"}]
[60,{"$f":"'Ghetto Bombers'!$A$49","v":10},{"$f":"'Ghetto Bombers'!$D$1","v":"Ghetto Bombers"},{"$f":"'Ghetto Bombers'!$D$49","v":"Heidi"},{"$f":"'Ghetto Bombers'!$D$50","v":"Taylor"},{"$f":"'Ghetto Bombers'!$H$52","v":0.46666666666666667},{"$f":"'Ghetto Bombers'!$H$49","v":15},{"$f":"'Ghetto Bombers'!$F$8","v":4},"Y",{"$f":"'Ghetto Bombers'!$H$50","v":7},{"$f":"'Ghetto Bombers'!$H$51","v":16},{"$f":"'Ghetto Bombers'!$D$52","v":"f"}]
[79,{"$f":"'Thunder Ducks'!$A$25","v":4},{"$f":"'Thunder Ducks'!$D$1","v":"Thunder Ducks"},{"$f":"'Thunder Ducks'!$D$25","v":"Jennie"},{"$f":"'Thunder Ducks'!$D$26","v":"Anderson"},{"$f":"'Thunder Ducks'!$H$28","v":0.46153846153846156},{"$f":"'Thunder Ducks'!$H$25","v":13},{"$f":"'Thunder Ducks'!$F$8","v":4},"Y",{"$f":"'Thunder Ducks'!$H$26","v":6},{"$f":"'Thunder Ducks'!$H$27","v":15},{"$f":"'Thunder Ducks'!$D$28","v":"f"}]
[27,{"$f":"BCBC!$A$17","v":2},{"$f":"BCBC!$D$1","v":"BCBC"},{"$f":"BCBC!$D$17","v":"Alex"},{"$f":"BCBC!$D$18","v":"Ferrel"},{"$f":"BCBC!$H$20","v":0.45454545454545453},{"$f":"BCBC!$H$17","v":11},{"$f":"BCBC!$F$8","v":4},"Y",{"$f":"BCBC!$H$18","v":5},{"$f":"BCBC!$H$19","v":11},{"$f":"BCBC!$D$20","v":"f"}]
[31,{"$f":"BCBC!$A$33","v":6},{"$f":"BCBC!$D$1","v":"BCBC"},{"$f":"BCBC!$D$33","v":"Tiff"},{"$f":"BCBC!$D$34","v":"Morton"},{"$f":"BCBC!$H$36","v":0.4},{"$f":"BCBC!$H$33","v":10},{"$f":"BCBC!$F$8","v":4},"Y",{"$f":"BCBC!$H$34","v":4},{"$f":"BCBC!$H$35","v":11},{"$f":"BCBC!$D$36","v":"f"}]
[29,{"$f":"BCBC!$A$25","v":4},{"$f":"BCBC!$D$1","v":"BCBC"},{"$f":"BCBC!$D$25","v":"Casey"},{"$f":"BCBC!$D$26","v":"Velarde"},{"$f":"BCBC!$H$28","v":0.36363636363636365},{"$f":"BCBC!$H$25","v":11},{"$f":"BCBC!$F$8","v":4},"Y",{"$f":"BCBC!$H$26","v":4},{"$f":"BCBC!$H$27","v":12},{"$f":"BCBC!$D$28","v":"f"}]
[77,{"$f":"'Thunder Ducks'!$A$17","v":2},{"$f":"'Thunder Ducks'!$D$1","v":"Thunder Ducks"},{"$f":"'Thunder Ducks'!$D$17","v":"Josie"},{"$f":"'Thunder Ducks'!$D$18","v":"Harris"},{"$f":"'Thunder Ducks'!$H$20","v":0.33333333333333331},{"$f":"'Thunder Ducks'!$H$17","v":12},{"$f":"'Thunder Ducks'!$F$8","v":4},"Y",{"$f":"'Thunder Ducks'!$H$18","v":4},{"$f":"'Thunder Ducks'!$H$19","v":14},{"$f":"'Thunder Ducks'!$D$20","v":"f"}]
[2,{"$f":"'Bad Pitches'!$A$17","v":2},{"$f":"'Bad Pitches'!$D$1","v":"Bad Pitches"},{"$f":"'Bad Pitches'!$D$17","v":"Paige"},{"$f":"'Bad Pitches'!$D$18","v":"Reynolds"},{"$f":"'Bad Pitches'!$H$20","v":0.3},{"$f":"'Bad Pitches'!$H$17","v":10},{"$f":"'Bad Pitches'!$F$8","v":3},"Y",{"$f":"'Bad Pitches'!$H$18","v":3},{"$f":"'Bad Pitches'!$H$19","v":10},{"$f":"'Bad Pitches'!$D$20","v":"f"}]
[33,{"$f":"BCBC!$A$41","v":8},{"$f":"BCBC!$D$1","v":"BCBC"},{"$f":"BCBC!$D$41","v":"Maree"},{"$f":"BCBC!$D$42","v":"Achermann"},{"$f":"BCBC!$H$44","v":0.15384615384615385},{"$f":"BCBC!$H$41","v":13},{"$f":"BCBC!$F$8","v":4},"Y",{"$f":"BCBC!$H$42","v":2},{"$f":"BCBC!$H$43","v":13},{"$f":"BCBC!$D$44","v":"f"}]
[37,{"$f":"BCBC!$A$57","v":12},{"$f":"BCBC!$D$1","v":"BCBC"},{"$f":"BCBC!$D$57","v":"Mel"},{"$f":"BCBC!$D$58","v":"Maile"},{"$f":"BCBC!$H$60","v":9.0909090909090912E-2},{"$f":"BCBC!$H$57","v":11},{"$f":"BCBC!$F$8","v":4},"Y",{"$f":"BCBC!$H$58","v":1},{"$f":"BCBC!$H$59","v":12},{"$f":"BCBC!$D$60","v":"f"}]
[206,{"$f":"'YY Team'!$A$33","v":6},{"$f":"'YY Team'!$D$1","v":"YY Team"},{"$f":"'YY Team'!$D$33","v":"Britt"},{"$f":"'YY Team'!$D$34","v":"Call"},{"$f":"'YY Team'!$H$36","v":0},{"$f":"'YY Team'!$H$33","v":63},{"$f":"'YY Team'!$F$8","v":7},"Y",{"$f":"'YY Team'!$H$34","v":0},{"$f":"'YY Team'!$H$35","v":63},{"$f":"'YY Team'!$D$36","v":"f"}]
[137,{"$f":"'XXX Team'!$A$57","v":12},{"$f":"'XXX Team'!$D$1","v":"XXX Team"},{"$f":"'XXX Team'!$D$57","v":"Anna"},{"$f":"'XXX Team'!$D$58","v":"Hall"},{"$f":"'XXX Team'!$H$60","v":0},{"$f":"'XXX Team'!$H$57","v":63},{"$f":"'XXX Team'!$F$8","v":7},"Y",{"$f":"'XXX Team'!$H$58","v":0},{"$f":"'XXX Team'!$H$59","v":63},{"$f":"'XXX Team'!$D$60","v":"f"}]
[135,{"$f":"'XXX Team'!$A$49","v":10},{"$f":"'XXX Team'!$D$1","v":"XXX Team"},{"$f":"'XXX Team'!$D$49","v":"Chandra"},{"$f":"'XXX Team'!$D$50","v":"Cruz"},{"$f":"'XXX Team'!$H$52","v":0},{"$f":"'XXX Team'!$H$49","v":63},{"$f":"'XXX Team'!$F$8","v":7},"Y",{"$f":"'XXX Team'!$H$50","v":0},{"$f":"'XXX Team'!$H$51","v":63},{"$f":"'XXX Team'!$D$52","v":"f"}]
[104,{"$f":"'X Team'!$A$25","v":4},{"$f":"'X Team'!$D$1","v":"X Team"},{"$f":"'X Team'!$D$25","v":"Chelsea"},{"$f":"'X Team'!$D$26","v":"LdBaron"},{"$f":"'X Team'!$H$28","v":0},{"$f":"'X Team'!$H$25","v":63},{"$f":"'X Team'!$F$8","v":7},"Y",{"$f":"'X Team'!$H$26","v":0},{"$f":"'X Team'!$H$27","v":63},{"$f":"'X Team'!$D$28","v":"f"}]
[102,{"$f":"'X Team'!$A$17","v":2},{"$f":"'X Team'!$D$1","v":"X Team"},{"$f":"'X Team'!$D$17","v":"Paige"},{"$f":"'X Team'!$D$18","v":"Jackman"},{"$f":"'X Team'!$H$20","v":0},{"$f":"'X Team'!$H$17","v":63},{"$f":"'X Team'!$F$8","v":7},"Y",{"$f":"'X Team'!$H$18","v":0},{"$f":"'X Team'!$H$19","v":63},{"$f":"'X Team'!$D$20","v":"f"}]
[202,{"$f":"'YY Team'!$A$17","v":2},{"$f":"'YY Team'!$D$1","v":"YY Team"},{"$f":"'YY Team'!$D$17","v":"Tasha"},{"$f":"'YY Team'!$D$18","v":"Arnold"},{"$f":"'YY Team'!$H$20","v":0},{"$f":"'YY Team'!$H$17","v":63},{"$f":"'YY Team'!$F$8","v":7},"Y",{"$f":"'YY Team'!$H$18","v":0},{"$f":"'YY Team'!$H$19","v":63},{"$f":"'YY Team'!$D$20","v":"f"}]
[129,{"$f":"'XXX Team'!$A$25","v":4},{"$f":"'XXX Team'!$D$1","v":"XXX Team"},{"$f":"'XXX Team'!$D$25","v":"Gimmie"},{"$f":"'XXX Team'!$D$26","v":"Murphy"},{"$f":"'XXX Team'!$H$28","v":0},{"$f":"'XXX Team'!$H$25","v":63},{"$f":"'XXX Team'!$F$8","v":7},"Y",{"$f":"'XXX Team'!$H$26","v":0},{"$f":"'XXX Team'!$H$27","v":63},{"$f":"'XXX Team'!$D$28","v":"f"}]
[127,{"$f":"'XXX Team'!$A$17","v":2},{"$f":"'XXX Team'!$D$1","v":"XXX Team"},{"$f":"'XXX Team'!$D$17","v":"Jenn"},{"$f":"'XXX Team'!$D$18","v":"Hall"},{"$f":"'XXX Team'!$H$20","v":0},{"$f":"'XXX Team'!$H$17","v":63},{"$f":"'XXX Team'!$F$8","v":7},"Y",{"$f":"'XXX Team'!$H$18","v":0},{"$f":"'XXX Team'!$H$19","v":63},{"$f":"'XXX Team'!$D$20","v":"f"}]
[204,{"$f":"'YY Team'!$A$25","v":4},{"$f":"'YY Team'!$D$1","v":"YY Team"},{"$f":"'YY Team'!$D$25","v":"Josie"},{"$f":"'YY Team'!$D$26","v":"Harris"},{"$f":"'YY Team'!$H$28","v":0},{"$f":"'YY Team'!$H$25","v":63},{"$f":"'YY Team'!$F$8","v":7},"Y",{"$f":"'YY Team'!$H$26","v":0},{"$f":"'YY Team'!$H$27","v":63},{"$f":"'YY Team'!$D$28","v":"f"}]
[108,{"$f":"'X Team'!$A$41","v":8},{"$f":"'X Team'!$D$1","v":"X Team"},{"$f":"'X Team'!$D$41","v":"Cassi"},{"$f":"'X Team'!$D$42","v":"Kendzior"},{"$f":"'X Team'!$H$44","v":0},{"$f":"'X Team'!$H$41","v":63},{"$f":"'X Team'!$F$8","v":7},"Y",{"$f":"'X Team'!$H$42","v":0},{"$f":"'X Team'!$H$43","v":63},{"$f":"'X Team'!$D$44","v":"f"}]
[131,{"$f":"'XXX Team'!$A$33","v":6},{"$f":"'XXX Team'!$D$1","v":"XXX Team"},{"$f":"'XXX Team'!$D$33","v":"Deanndra"},{"$f":"'XXX Team'!$D$34","v":"Billie"},{"$f":"'XXX Team'!$H$36","v":0},{"$f":"'XXX Team'!$H$33","v":63},{"$f":"'XXX Team'!$F$8","v":7},"Y",{"$f":"'XXX Team'!$H$34","v":0},{"$f":"'XXX Team'!$H$35","v":63},{"$f":"'XXX Team'!$D$36","v":"f"}]
[208,{"$f":"'YY Team'!$A$41","v":8},{"$f":"'YY Team'!$D$1","v":"YY Team"},{"$f":"'YY Team'!$D$41","v":"Lindsay"},{"$f":"'YY Team'!$D$42","v":"Pennington"},{"$f":"'YY Team'!$H$44","v":0},{"$f":"'YY Team'!$H$41","v":63},{"$f":"'YY Team'!$F$8","v":7},"Y",{"$f":"'YY Team'!$H$42","v":0},{"$f":"'YY Team'!$H$43","v":63},{"$f":"'YY Team'!$D$44","v":"f"}]
[133,{"$f":"'XXX Team'!$A$41","v":8},{"$f":"'XXX Team'!$D$1","v":"XXX Team"},{"$f":"'XXX Team'!$D$41","v":"Emma"},{"$f":"'XXX Team'!$D$42","v":"Hall"},{"$f":"'XXX Team'!$H$44","v":0},{"$f":"'XXX Team'!$H$41","v":63},{"$f":"'XXX Team'!$F$8","v":7},"Y",{"$f":"'XXX Team'!$H$42","v":0},{"$f":"'XXX Team'!$H$43","v":63},{"$f":"'XXX Team'!$D$44","v":"f"}]
[106,{"$f":"'X Team'!$A$33","v":6},{"$f":"'X Team'!$D$1","v":"X Team"},{"$f":"'X Team'!$D$33","v":"Jo"},{"$f":"'X Team'!$D$34","v":"Cruz"},{"$f":"'X Team'!$H$36","v":0},{"$f":"'X Team'!$H$33","v":63},{"$f":"'X Team'!$F$8","v":7},"Y",{"$f":"'X Team'!$H$34","v":0},{"$f":"'X Team'!$H$35","v":63},{"$f":"'X Team'!$D$36","v":"f"}]
[184,{"$f":"'XX Team'!$A$45","v":9},{"$f":"'XX Team'!$D$1","v":"XX Team"},{"$f":"'XX Team'!$D$45","v":"Nancy"},{"$f":"'XX Team'!$D$46","v":"Lowe"},{"$f":"'XX Team'!$H$48","v":0},{"$f":"'XX Team'!$H$45","v":63},{"$f":"'XX Team'!$F$8","v":6},"Y",{"$f":"'XX Team'!$H$46","v":0},{"$f":"'XX Team'!$H$47","v":63},{"$f":"'XX Team'!$D$48","v":"f"}]
[180,{"$f":"'XX Team'!$A$29","v":5},{"$f":"'XX Team'!$D$1","v":"XX Team"},{"$f":"'XX Team'!$D$29","v":"Toni"},{"$f":"'XX Team'!$D$30","v":"Wall"},{"$f":"'XX Team'!$H$32","v":0},{"$f":"'XX Team'!$H$29","v":63},{"$f":"'XX Team'!$F$8","v":6},"Y",{"$f":"'XX Team'!$H$30","v":0},{"$f":"'XX Team'!$H$31","v":63},{"$f":"'XX Team'!$D$32","v":"f"}]
[178,{"$f":"'XX Team'!$A$21","v":3},{"$f":"'XX Team'!$D$1","v":"XX Team"},{"$f":"'XX Team'!$D$21","v":"Mary"},{"$f":"'XX Team'!$D$22","v":"Childs"},{"$f":"'XX Team'!$H$24","v":0},{"$f":"'XX Team'!$H$21","v":63},{"$f":"'XX Team'!$F$8","v":6},"Y",{"$f":"'XX Team'!$H$22","v":0},{"$f":"'XX Team'!$H$23","v":63},{"$f":"'XX Team'!$D$24","v":"f"}]
[176,{"$f":"'XX Team'!$A$13","v":1},{"$f":"'XX Team'!$D$1","v":"XX Team"},{"$f":"'XX Team'!$D$13","v":"Francis"},{"$f":"'XX Team'!$D$14","v":"Brown"},{"$f":"'XX Team'!$H$16","v":0},{"$f":"'XX Team'!$H$13","v":63},{"$f":"'XX Team'!$F$8","v":6},{"$f":"IF(K34<(H34*2.5),\"N\",\"Y\")","v":"Y"},{"$f":"'XX Team'!$H$14","v":0},{"$f":"'XX Team'!$H$15","v":63},{"$f":"'XX Team'!$D$16","v":"f"}]
[182,{"$f":"'XX Team'!$A$37","v":7},{"$f":"'XX Team'!$D$1","v":"XX Team"},{"$f":"'XX Team'!$D$37","v":"Shela"},{"$f":"'XX Team'!$D$38","v":"Anderson"},{"$f":"'XX Team'!$H$40","v":0},{"$f":"'XX Team'!$H$37","v":63},{"$f":"'XX Team'!$F$8","v":6},"Y",{"$f":"'XX Team'!$H$38","v":0},{"$f":"'XX Team'!$H$39","v":63},{"$f":"'XX Team'!$D$40","v":"f"}]
[110,{"$f":"'X Team'!$A$49","v":10},{"$f":"'X Team'!$D$1","v":"X Team"},{"$f":"'X Team'!$D$49","v":"Shae Lee"},{"$f":"'X Team'!$D$50","v":"Pearson"},{"$f":"'X Team'!$H$52","v":0},{"$f":"'X Team'!$H$49","v":63},{"$f":"'X Team'!$F$8","v":7},"Y",{"$f":"'X Team'!$H$50","v":0},{"$f":"'X Team'!$H$51","v":63},{"$f":"'X Team'!$D$52","v":"f"}]
[211,{"$f":"'YY Team'!$A$53","v":11},{"$f":"'YY Team'!$D$1","v":"YY Team"},{"$f":"'YY Team'!$D$53","v":"Jennie"},{"$f":"'YY Team'!$D$54","v":"Anderson"},{"$f":"'YY Team'!$H$56","v":0},{"$f":"'YY Team'!$H$53","v":63},{"$f":"'YY Team'!$F$8","v":7},"Y",{"$f":"'YY Team'!$H$54","v":0},{"$f":"'YY Team'!$H$55","v":63},{"$f":"'YY Team'!$D$56","v":"f"}]
[210,{"$f":"'YY Team'!$A$49","v":10},{"$f":"'YY Team'!$D$1","v":"YY Team"},{"$f":"'YY Team'!$D$49","v":"Taylor"},{"$f":"'YY Team'!$D$50","v":"McCallum"},{"$f":"'YY Team'!$H$52","v":0},{"$f":"'YY Team'!$H$49","v":63},{"$f":"'YY Team'!$F$8","v":7},"Y",{"$f":"'YY Team'!$H$50","v":0},{"$f":"'YY Team'!$H$51","v":63},{"$f":"'YY Team'!$D$52","v":"f"}]
[111,{"$f":"'X Team'!$A$53","v":11},{"$f":"'X Team'!$D$1","v":"X Team"},{"$f":"'X Team'!$D$53","v":"Jo"},{"$f":"'X Team'!$D$54","v":"Blake"},{"$f":"'X Team'!$H$56","v":0},{"$f":"'X Team'!$H$53","v":63},{"$f":"'X Team'!$F$8","v":7},"Y",{"$f":"'X Team'!$H$54","v":0},{"$f":"'X Team'!$H$55","v":63},{"$f":"'X Team'!$D$56","v":"f"}]
[113,{"$f":"'X Team'!$A$61","v":13},{"$f":"'X Team'!$D$1","v":"X Team"},{"$f":"'X Team'!$D$61","v":"Amanda "},{"$f":"'X Team'!$D$62","v":"Kenzior"},{"$f":"'X Team'!$H$64","v":0},{"$f":"'X Team'!$H$61","v":63},{"$f":"'X Team'!$F$8","v":7},"Y",{"$f":"'X Team'!$H$62","v":0},{"$f":"'X Team'!$H$63","v":63},{"$f":"'X Team'!$D$64","v":"f"}]
[93,{"$f":"'Thunder Ducks'!$A$81","v":18},{"$f":"'Thunder Ducks'!$D$1","v":"Thunder Ducks"},{"$f":"'Thunder Ducks'!$D$81","v":0},{"$f":"'Thunder Ducks'!$D$82","v":0},{"$f":"'Thunder Ducks'!$H$84","v":""},{"$f":"'Thunder Ducks'!$H$81","v":0},{"$f":"'Thunder Ducks'!$F$8","v":4},"N",{"$f":"'Thunder Ducks'!$H$82","v":0},{"$f":"'Thunder Ducks'!$H$83","v":0},{"$f":"'Thunder Ducks'!$D$84","v":"f"}]
[212,{"$f":"'YY Team'!$A$57","v":12},{"$f":"'YY Team'!$D$1","v":"YY Team"},{"$f":"'YY Team'!$D$57","v":0},{"$f":"'YY Team'!$D$58","v":0},{"$f":"'YY Team'!$H$60","v":""},{"$f":"'YY Team'!$H$57","v":0},{"$f":"'YY Team'!$F$8","v":7},"N",{"$f":"'YY Team'!$H$58","v":0},{"$f":"'YY Team'!$H$59","v":0},{"$f":"'YY Team'!$D$60","v":"f"}]
[21,{"$f":"'Bad Pitches'!$A$93","v":21},{"$f":"'Bad Pitches'!$D$1","v":"Bad Pitches"},{"$f":"'Bad Pitches'!$D$93","v":0},{"$f":"'Bad Pitches'!$D$94","v":0},{"$f":"'Bad Pitches'!$H$96","v":""},{"$f":"'Bad Pitches'!$H$93","v":0},{"$f":"'Bad Pitches'!$F$8","v":3},"N",{"$f":"'Bad Pitches'!$H$94","v":0},{"$f":"'Bad Pitches'!$H$95","v":0},{"$f":"'Bad Pitches'!$D$96","v":"f"}]
[22,{"$f":"'Bad Pitches'!$A$97","v":22},{"$f":"'Bad Pitches'!$D$1","v":"Bad Pitches"},{"$f":"'Bad Pitches'!$D$97","v":0},{"$f":"'Bad Pitches'!$D$98","v":0},{"$f":"'Bad Pitches'!$H$100","v":""},{"$f":"'Bad Pitches'!$H$97","v":0},{"$f":"'Bad Pitches'!$F$8","v":3},"N",{"$f":"'Bad Pitches'!$H$98","v":0},{"$f":"'Bad Pitches'!$H$99","v":0},{"$f":"'Bad Pitches'!$D$100","v":"f"}]
[23,{"$f":"'Bad Pitches'!$A$101","v":23},{"$f":"'Bad Pitches'!$D$1","v":"Bad Pitches"},{"$f":"'Bad Pitches'!$D$101","v":0},{"$f":"'Bad Pitches'!$D$102","v":0},{"$f":"'Bad Pitches'!$H$104","v":""},{"$f":"'Bad Pitches'!$H$101","v":0},{"$f":"'Bad Pitches'!$F$8","v":3},"N",{"$f":"'Bad Pitches'!$H$102","v":0},{"$f":"'Bad Pitches'!$H$103","v":0},{"$f":"'Bad Pitches'!$D$104","v":"f"}]
[24,{"$f":"'Bad Pitches'!$A$105","v":24},{"$f":"'Bad Pitches'!$D$1","v":"Bad Pitches"},{"$f":"'Bad Pitches'!$D$105","v":0},{"$f":"'Bad Pitches'!$D$106","v":0},{"$f":"'Bad Pitches'!$H$108","v":""},{"$f":"'Bad Pitches'!$H$105","v":0},{"$f":"'Bad Pitches'!$F$8","v":3},"N",{"$f":"'Bad Pitches'!$H$106","v":0},{"$f":"'Bad Pitches'!$H$107","v":0},{"$f":"'Bad Pitches'!$D$108","v":"f"}]
[25,{"$f":"'Bad Pitches'!$A$109","v":25},{"$f":"'Bad Pitches'!$D$1","v":"Bad Pitches"},{"$f":"'Bad Pitches'!$D$109","v":0},{"$f":"'Bad Pitches'!$D$110","v":0},{"$f":"'Bad Pitches'!$H$112","v":""},{"$f":"'Bad Pitches'!$H$109","v":0},{"$f":"'Bad Pitches'!$F$8","v":3},"N",{"$f":"'Bad Pitches'!$H$110","v":0},{"$f":"'Bad Pitches'!$H$111","v":0},{"$f":"'Bad Pitches'!$D$112","v":"f"}]
[45,{"$f":"BCBC!$A$89","v":20},{"$f":"BCBC!$D$1","v":"BCBC"},{"$f":"BCBC!$D$89","v":0},{"$f":"BCBC!$D$90","v":0},{"$f":"BCBC!$H$92","v":""},{"$f":"BCBC!$H$89","v":0},{"$f":"BCBC!$F$8","v":4},"N",{"$f":"BCBC!$H$90","v":0},{"$f":"BCBC!$H$91","v":0},{"$f":"BCBC!$D$92","v":"f"}]
[46,{"$f":"BCBC!$A$93","v":21},{"$f":"BCBC!$D$1","v":"BCBC"},{"$f":"BCBC!$D$93","v":0},{"$f":"BCBC!$D$94","v":0},{"$f":"BCBC!$H$96","v":""},{"$f":"BCBC!$H$93","v":0},{"$f":"BCBC!$F$8","v":4},"N",{"$f":"BCBC!$H$94","v":0},{"$f":"BCBC!$H$95","v":0},{"$f":"BCBC!$D$96","v":"f"}]
[47,{"$f":"BCBC!$A$97","v":22},{"$f":"BCBC!$D$1","v":"BCBC"},{"$f":"BCBC!$D$97","v":0},{"$f":"BCBC!$D$98","v":0},{"$f":"BCBC!$H$100","v":""},{"$f":"BCBC!$H$97","v":0},{"$f":"BCBC!$F$8","v":4},"N",{"$f":"BCBC!$H$98","v":0},{"$f":"BCBC!$H$99","v":0},{"$f":"BCBC!$D$100","v":"f"}]
[48,{"$f":"BCBC!$A$101","v":23},{"$f":"BCBC!$D$1","v":"BCBC"},{"$f":"BCBC!$D$101","v":0},{"$f":"BCBC!$D$102","v":0},{"$f":"BCBC!$H$104","v":""},{"$f":"BCBC!$H$101","v":0},{"$f":"BCBC!$F$8","v":4},"N",{"$f":"BCBC!$H$102","v":0},{"$f":"BCBC!$H$103","v":0},{"$f":"BCBC!$D$104","v":"f"}]
[49,{"$f":"BCBC!$A$105","v":24},{"$f":"BCBC!$D$1","v":"BCBC"},{"$f":"BCBC!$D$105","v":0},{"$f":"BCBC!$D$106","v":0},{"$f":"BCBC!$H$108","v":""},{"$f":"BCBC!$H$105","v":0},{"$f":"BCBC!$F$8","v":4},"N",{"$f":"BCBC!$H$106","v":0},{"$f":"BCBC!$H$107","v":0},{"$f":"BCBC!$D$108","v":"f"}]
[50,{"$f":"BCBC!$A$109","v":25},{"$f":"BCBC!$D$1","v":"BCBC"},{"$f":"BCBC!$D$109","v":0},{"$f":"BCBC!$D$110","v":0},{"$f":"BCBC!$H$112","v":""},{"$f":"BCBC!$H$109","v":0},{"$f":"BCBC!$F$8","v":4},"N",{"$f":"BCBC!$H$110","v":0},{"$f":"BCBC!$H$111","v":0},{"$f":"BCBC!$D$112","v":"f"}]
[69,{"$f":"'Ghetto Bombers'!$A$85","v":19},{"$f":"'Ghetto Bombers'!$D$1","v":"Ghetto Bombers"},{"$f":"'Ghetto Bombers'!$D$85","v":0},{"$f":"'Ghetto Bombers'!$D$86","v":0},{"$f":"'Ghetto Bombers'!$H$88","v":""},{"$f":"'Ghetto Bombers'!$H$85","v":0},{"$f":"'Ghetto Bombers'!$F$8","v":4},"N",{"$f":"'Ghetto Bombers'!$H$86","v":0},{"$f":"'Ghetto Bombers'!$H$87","v":0},{"$f":"'Ghetto Bombers'!$D$88","v":"f"}]
[70,{"$f":"'Ghetto Bombers'!$A$89","v":20},{"$f":"'Ghetto Bombers'!$D$1","v":"Ghetto Bombers"},{"$f":"'Ghetto Bombers'!$D$89","v":0},{"$f":"'Ghetto Bombers'!$D$90","v":0},{"$f":"'Ghetto Bombers'!$H$92","v":""},{"$f":"'Ghetto Bombers'!$H$89","v":0},{"$f":"'Ghetto Bombers'!$F$8","v":4},"N",{"$f":"'Ghetto Bombers'!$H$90","v":0},{"$f":"'Ghetto Bombers'!$H$91","v":0},{"$f":"'Ghetto Bombers'!$D$92","v":"f"}]
[71,{"$f":"'Ghetto Bombers'!$A$93","v":21},{"$f":"'Ghetto Bombers'!$D$1","v":"Ghetto Bombers"},{"$f":"'Ghetto Bombers'!$D$93","v":0},{"$f":"'Ghetto Bombers'!$D$94","v":0},{"$f":"'Ghetto Bombers'!$H$96","v":""},{"$f":"'Ghetto Bombers'!$H$93","v":0},{"$f":"'Ghetto Bombers'!$F$8","v":4},"N",{"$f":"'Ghetto Bombers'!$H$94","v":0},{"$f":"'Ghetto Bombers'!$H$95","v":0},{"$f":"'Ghetto Bombers'!$D$96","v":"f"}]
[72,{"$f":"'Ghetto Bombers'!$A$97","v":22},{"$f":"'Ghetto Bombers'!$D$1","v":"Ghetto Bombers"},{"$f":"'Ghetto Bombers'!$D$97","v":0},{"$f":"'Ghetto Bombers'!$D$98","v":0},{"$f":"'Ghetto Bombers'!$H$100","v":""},{"$f":"'Ghetto Bombers'!$H$97","v":0},{"$f":"'Ghetto Bombers'!$F$8","v":4},"N",{"$f":"'Ghetto Bombers'!$H$98","v":0},{"$f":"'Ghetto Bombers'!$H$99","v":0},{"$f":"'Ghetto Bombers'!$D$100","v":"f"}]
[73,{"$f":"'Ghetto Bombers'!$A$101","v":23},{"$f":"'Ghetto Bombers'!$D$1","v":"Ghetto Bombers"},{"$f":"'Ghetto Bombers'!$D$101","v":0},{"$f":"'Ghetto Bombers'!$D$102","v":0},{"$f":"'Ghetto Bombers'!$H$104","v":""},{"$f":"'Ghetto Bombers'!$H$101","v":0},{"$f":"'Ghetto Bombers'!$F$8","v":4},"N",{"$f":"'Ghetto Bombers'!$H$102","v":0},{"$f":"'Ghetto Bombers'!$H$103","v":0},{"$f":"'Ghetto Bombers'!$D$104","v":"f"}]
[74,{"$f":"'Ghetto Bombers'!$A$105","v":24},{"$f":"'Ghetto Bombers'!$D$1","v":"Ghetto Bombers"},{"$f":"'Ghetto Bombers'!$D$105","v":0},{"$f":"'Ghetto Bombers'!$D$106","v":0},{"$f":"'Ghetto Bombers'!$H$108","v":""},{"$f":"'Ghetto Bombers'!$H$105","v":0},{"$f":"'Ghetto Bombers'!$F$8","v":4},"N",{"$f":"'Ghetto Bombers'!$H$106","v":0},{"$f":"'Ghetto Bombers'!$H$107","v":0},{"$f":"'Ghetto Bombers'!$D$108","v":"f"}]
[75,{"$f":"'Ghetto Bombers'!$A$109","v":25},{"$f":"'Ghetto Bombers'!$D$1","v":"Ghetto Bombers"},{"$f":"'Ghetto Bombers'!$D$109","v":0},{"$f":"'Ghetto Bombers'!$D$110","v":0},{"$f":"'Ghetto Bombers'!$H$112","v":""},{"$f":"'Ghetto Bombers'!$H$109","v":0},{"$f":"'Ghetto Bombers'!$F$8","v":4},"N",{"$f":"'Ghetto Bombers'!$H$110","v":0},{"$f":"'Ghetto Bombers'!$H$111","v":0},{"$f":"'Ghetto Bombers'!$D$112","v":"f"}]
[94,{"$f":"'Thunder Ducks'!$A$85","v":19},{"$f":"'Thunder Ducks'!$D$1","v":"Thunder Ducks"},{"$f":"'Thunder Ducks'!$D$85","v":0},{"$f":"'Thunder Ducks'!$D$86","v":0},{"$f":"'Thunder Ducks'!$H$88","v":""},{"$f":"'Thunder Ducks'!$H$85","v":0},{"$f":"'Thunder Ducks'!$F$8","v":4},"N",{"$f":"'Thunder Ducks'!$H$86","v":0},{"$f":"'Thunder Ducks'!$H$87","v":0},{"$f":"'Thunder Ducks'!$D$88","v":"f"}]
[95,{"$f":"'Thunder Ducks'!$A$89","v":20},{"$f":"'Thunder Ducks'!$D$1","v":"Thunder Ducks"},{"$f":"'Thunder Ducks'!$D$89","v":0},{"$f":"'Thunder Ducks'!$D$90","v":0},{"$f":"'Thunder Ducks'!$H$92","v":""},{"$f":"'Thunder Ducks'!$H$89","v":0},{"$f":"'Thunder Ducks'!$F$8","v":4},"N",{"$f":"'Thunder Ducks'!$H$90","v":0},{"$f":"'Thunder Ducks'!$H$91","v":0},{"$f":"'Thunder Ducks'!$D$92","v":"f"}]
[96,{"$f":"'Thunder Ducks'!$A$93","v":21},{"$f":"'Thunder Ducks'!$D$1","v":"Thunder Ducks"},{"$f":"'Thunder Ducks'!$D$93","v":0},{"$f":"'Thunder Ducks'!$D$94","v":0},{"$f":"'Thunder Ducks'!$H$96","v":""},{"$f":"'Thunder Ducks'!$H$93","v":0},{"$f":"'Thunder Ducks'!$F$8","v":4},"N",{"$f":"'Thunder Ducks'!$H$94","v":0},{"$f":"'Thunder Ducks'!$H$95","v":0},{"$f":"'Thunder Ducks'!$D$96","v":"f"}]
[97,{"$f":"'Thunder Ducks'!$A$97","v":22},{"$f":"'Thunder Ducks'!$D$1","v":"Thunder Ducks"},{"$f":"'Thunder Ducks'!$D$97","v":0},{"$f":"'Thunder Ducks'!$D$98","v":0},{"$f":"'Thunder Ducks'!$H$100","v":""},{"$f":"'Thunder Ducks'!$H$97","v":0},{"$f":"'Thunder Ducks'!$F$8","v":4},"N",{"$f":"'Thunder Ducks'!$H$98","v":0},{"$f":"'Thunder Ducks'!$H$99","v":0},{"$f":"'Thunder Ducks'!$D$100","v":"f"}]
[98,{"$f":"'Thunder Ducks'!$A$101","v":23},{"$f":"'Thunder Ducks'!$D$1","v":"Thunder Ducks"},{"$f":"'Thunder Ducks'!$D$101","v":0},{"$f":"'Thunder Ducks'!$D$102","v":0},{"$f":"'Thunder Ducks'!$H$104","v":""},{"$f":"'Thunder Ducks'!$H$101","v":0},{"$f":"'Thunder Ducks'!$F$8","v":4},"N",{"$f":"'Thunder Ducks'!$H$102","v":0},{"$f":"'Thunder Ducks'!$H$103","v":0},{"$f":"'Thunder Ducks'!$D$104","v":"f"}]
[99,{"$f":"'Thunder Ducks'!$A$105","v":24},{"$f":"'Thunder Ducks'!$D$1","v":"Thunder Ducks"},{"$f":"'Thunder Ducks'!$D$105","v":0},{"$f":"'Thunder Ducks'!$D$106","v":0},{"$f":"'Thunder Ducks'!$H$108","v":""},{"$f":"'Thunder Ducks'!$H$105","v":0},{"$f":"'Thunder Ducks'!$F$8","v":4},{"$f":"IF(K66<(H66*2.5),\"N\",\"Y\")","v":"N"},{"$f":"'Thunder Ducks'!$H$106","v":0},{"$f":"'Thunder Ducks'!$H$107","v":0},{"$f":"'Thunder Ducks'!$D$108","v":"f"}]
[100,{"$f":"'Thunder Ducks'!$A$109","v":25},{"$f":"'Thunder Ducks'!$D$1","v":"Thunder Ducks"},{"$f":"'Thunder Ducks'!$D$109","v":0},{"$f":"'Thunder Ducks'!$D$110","v":0},{"$f":"'Thunder Ducks'!$H$112","v":""},{"$f":"'Thunder Ducks'!$H$109","v":0},{"$f":"'Thunder Ducks'!$F$8","v":4},"N",{"$f":"'Thunder Ducks'!$H$110","v":0},{"$f":"'Thunder Ducks'!$H$111","v":0},{"$f":"'Thunder Ducks'!$D$112","v":"f"}]
[122,{"$f":"'X Team'!$A$97","v":22},{"$f":"'X Team'!$D$1","v":"X Team"},{"$f":"'X Team'!$D$97","v":0},{"$f":"'X Team'!$D$98","v":0},{"$f":"'X Team'!$H$100","v":""},{"$f":"'X Team'!$H$97","v":0},{"$f":"'X Team'!$F$8","v":7},"N",{"$f":"'X Team'!$H$98","v":0},{"$f":"'X Team'!$H$99","v":0},{"$f":"'X Team'!$D$100","v":"f"}]
[123,{"$f":"'X Team'!$A$101","v":23},{"$f":"'X Team'!$D$1","v":"X Team"},{"$f":"'X Team'!$D$101","v":0},{"$f":"'X Team'!$D$102","v":0},{"$f":"'X Team'!$H$104","v":""},{"$f":"'X Team'!$H$101","v":0},{"$f":"'X Team'!$F$8","v":7},"N",{"$f":"'X Team'!$H$102","v":0},{"$f":"'X Team'!$H$103","v":0},{"$f":"'X Team'!$D$104","v":"f"}]
[124,{"$f":"'X Team'!$A$105","v":24},{"$f":"'X Team'!$D$1","v":"X Team"},{"$f":"'X Team'!$D$105","v":0},{"$f":"'X Team'!$D$106","v":0},{"$f":"'X Team'!$H$108","v":""},{"$f":"'X Team'!$H$105","v":0},{"$f":"'X Team'!$F$8","v":7},"N",{"$f":"'X Team'!$H$106","v":0},{"$f":"'X Team'!$H$107","v":0},{"$f":"'X Team'!$D$108","v":"f"}]
[125,{"$f":"'X Team'!$A$109","v":25},{"$f":"'X Team'!$D$1","v":"X Team"},{"$f":"'X Team'!$D$109","v":0},{"$f":"'X Team'!$D$110","v":0},{"$f":"'X Team'!$H$112","v":""},{"$f":"'X Team'!$H$109","v":0},{"$f":"'X Team'!$F$8","v":7},"N",{"$f":"'X Team'!$H$110","v":0},{"$f":"'X Team'!$H$111","v":0},{"$f":"'X Team'!$D$112","v":"f"}]
[144,{"$f":"'XXX Team'!$A$85","v":19},{"$f":"'XXX Team'!$D$1","v":"XXX Team"},{"$f":"'XXX Team'!$D$85","v":0},{"$f":"'XXX Team'!$D$86","v":0},{"$f":"'XXX Team'!$H$88","v":""},{"$f":"'XXX Team'!$H$85","v":0},{"$f":"'XXX Team'!$F$8","v":7},"N",{"$f":"'XXX Team'!$H$86","v":0},{"$f":"'XXX Team'!$H$87","v":0},{"$f":"'XXX Team'!$D$88","v":"f"}]
[145,{"$f":"'XXX Team'!$A$89","v":20},{"$f":"'XXX Team'!$D$1","v":"XXX Team"},{"$f":"'XXX Team'!$D$89","v":0},{"$f":"'XXX Team'!$D$90","v":0},{"$f":"'XXX Team'!$H$92","v":""},{"$f":"'XXX Team'!$H$89","v":0},{"$f":"'XXX Team'!$F$8","v":7},"N",{"$f":"'XXX Team'!$H$90","v":0},{"$f":"'XXX Team'!$H$91","v":0},{"$f":"'XXX Team'!$D$92","v":"f"}]
[146,{"$f":"'XXX Team'!$A$93","v":21},{"$f":"'XXX Team'!$D$1","v":"XXX Team"},{"$f":"'XXX Team'!$D$93","v":0},{"$f":"'XXX Team'!$D$94","v":0},{"$f":"'XXX Team'!$H$96","v":""},{"$f":"'XXX Team'!$H$93","v":0},{"$f":"'XXX Team'!$F$8","v":7},"N",{"$f":"'XXX Team'!$H$94","v":0},{"$f":"'XXX Team'!$H$95","v":0},{"$f":"'XXX Team'!$D$96","v":"f"}]
[147,{"$f":"'XXX Team'!$A$97","v":22},{"$f":"'XXX Team'!$D$1","v":"XXX Team"},{"$f":"'XXX Team'!$D$97","v":0},{"$f":"'XXX Team'!$D$98","v":0},{"$f":"'XXX Team'!$H$100","v":""},{"$f":"'XXX Team'!$H$97","v":0},{"$f":"'XXX Team'!$F$8","v":7},"N",{"$f":"'XXX Team'!$H$98","v":0},{"$f":"'XXX Team'!$H$99","v":0},{"$f":"'XXX Team'!$D$100","v":"f"}]
[148,{"$f":"'XXX Team'!$A$101","v":23},{"$f":"'XXX Team'!$D$1","v":"XXX Team"},{"$f":"'XXX Team'!$D$101","v":0},{"$f":"'XXX Team'!$D$102","v":0},{"$f":"'XXX Team'!$H$104","v":""},{"$f":"'XXX Team'!$H$101","v":0},{"$f":"'XXX Team'!$F$8","v":7},"N",{"$f":"'XXX Team'!$H$102","v":0},{"$f":"'XXX Team'!$H$103","v":0},{"$f":"'XXX Team'!$D$104","v":"f"}]
[149,{"$f":"'XXX Team'!$A$105","v":24},{"$f":"'XXX Team'!$D$1","v":"XXX Team"},{"$f":"'XXX Team'!$D$105","v":0},{"$f":"'XXX Team'!$D$106","v":0},{"$f":"'XXX Team'!$H$108","v":""},{"$f":"'XXX Team'!$H$105","v":0},{"$f":"'XXX Team'!$F$8","v":7},"N",{"$f":"'XXX Team'!$H$106","v":0},{"$f":"'XXX Team'!$H$107","v":0},{"$f":"'XXX Team'!$D$108","v":"f"}]
[150,{"$f":"'XXX Team'!$A$109","v":25},{"$f":"'XXX Team'!$D$1","v":"XXX Team"},{"$f":"'XXX Team'!$D$109","v":0},{"$f":"'XXX Team'!$D$110","v":0},{"$f":"'XXX Team'!$H$112","v":""},{"$f":"'XXX Team'!$H$109","v":0},{"$f":"'XXX Team'!$F$8","v":7},"N",{"$f":"'XXX Team'!$H$110","v":0},{"$f":"'XXX Team'!$H$111","v":0},{"$f":"'XXX Team'!$D$112","v":"f"}]
[189,{"$f":"'XX Team'!$A$65","v":14},{"$f":"'XX Team'!$D$1","v":"XX Team"},{"$f":"'XX Team'!$D$65","v":0},{"$f":"'XX Team'!$D$66","v":0},{"$f":"'XX Team'!$H$68","v":""},{"$f":"'XX Team'!$H$65","v":0},{"$f":"'XX Team'!$F$8","v":6},"N",{"$f":"'XX Team'!$H$66","v":0},{"$f":"'XX Team'!$H$67","v":0},{"$f":"'XX Team'!$D$68","v":"f"}]
[190,{"$f":"'XX Team'!$A$69","v":15},{"$f":"'XX Team'!$D$1","v":"XX Team"},{"$f":"'XX Team'!$D$69","v":0},{"$f":"'XX Team'!$D$70","v":0},{"$f":"'XX Team'!$H$72","v":""},{"$f":"'XX Team'!$H$69","v":0},{"$f":"'XX Team'!$F$8","v":6},"N",{"$f":"'XX Team'!$H$70","v":0},{"$f":"'XX Team'!$H$71","v":0},{"$f":"'XX Team'!$D$72","v":"f"}]
[191,{"$f":"'XX Team'!$A$73","v":16},{"$f":"'XX Team'!$D$1","v":"XX Team"},{"$f":"'XX Team'!$D$73","v":0},{"$f":"'XX Team'!$D$74","v":0},{"$f":"'XX Team'!$H$76","v":""},{"$f":"'XX Team'!$H$73","v":0},{"$f":"'XX Team'!$F$8","v":6},"N",{"$f":"'XX Team'!$H$74","v":0},{"$f":"'XX Team'!$H$75","v":0},{"$f":"'XX Team'!$D$76","v":"f"}]
[192,{"$f":"'XX Team'!$A$77","v":17},{"$f":"'XX Team'!$D$1","v":"XX Team"},{"$f":"'XX Team'!$D$77","v":0},{"$f":"'XX Team'!$D$78","v":0},{"$f":"'XX Team'!$H$80","v":""},{"$f":"'XX Team'!$H$77","v":0},{"$f":"'XX Team'!$F$8","v":6},"N",{"$f":"'XX Team'!$H$78","v":0},{"$f":"'XX Team'!$H$79","v":0},{"$f":"'XX Team'!$D$80","v":"f"}]
[193,{"$f":"'XX Team'!$A$81","v":18},{"$f":"'XX Team'!$D$1","v":"XX Team"},{"$f":"'XX Team'!$D$81","v":0},{"$f":"'XX Team'!$D$82","v":0},{"$f":"'XX Team'!$H$84","v":""},{"$f":"'XX Team'!$H$81","v":0},{"$f":"'XX Team'!$F$8","v":6},"N",{"$f":"'XX Team'!$H$82","v":0},{"$f":"'XX Team'!$H$83","v":0},{"$f":"'XX Team'!$D$84","v":"f"}]
[194,{"$f":"'XX Team'!$A$85","v":19},{"$f":"'XX Team'!$D$1","v":"XX Team"},{"$f":"'XX Team'!$D$85","v":0},{"$f":"'XX Team'!$D$86","v":0},{"$f":"'XX Team'!$H$88","v":""},{"$f":"'XX Team'!$H$85","v":0},{"$f":"'XX Team'!$F$8","v":6},"N",{"$f":"'XX Team'!$H$86","v":0},{"$f":"'XX Team'!$H$87","v":0},{"$f":"'XX Team'!$D$88","v":"f"}]
[195,{"$f":"'XX Team'!$A$89","v":20},{"$f":"'XX Team'!$D$1","v":"XX Team"},{"$f":"'XX Team'!$D$89","v":0},{"$f":"'XX Team'!$D$90","v":0},{"$f":"'XX Team'!$H$92","v":""},{"$f":"'XX Team'!$H$89","v":0},{"$f":"'XX Team'!$F$8","v":6},"N",{"$f":"'XX Team'!$H$90","v":0},{"$f":"'XX Team'!$H$91","v":0},{"$f":"'XX Team'!$D$92","v":"f"}]
[196,{"$f":"'XX Team'!$A$93","v":21},{"$f":"'XX Team'!$D$1","v":"XX Team"},{"$f":"'XX Team'!$D$93","v":0},{"$f":"'XX Team'!$D$94","v":0},{"$f":"'XX Team'!$H$96","v":""},{"$f":"'XX Team'!$H$93","v":0},{"$f":"'XX Team'!$F$8","v":6},"N",{"$f":"'XX Team'!$H$94","v":0},{"$f":"'XX Team'!$H$95","v":0},{"$f":"'XX Team'!$D$96","v":"f"}]
[197,{"$f":"'XX Team'!$A$97","v":22},{"$f":"'XX Team'!$D$1","v":"XX Team"},{"$f":"'XX Team'!$D$97","v":0},{"$f":"'XX Team'!$D$98","v":0},{"$f":"'XX Team'!$H$100","v":""},{"$f":"'XX Team'!$H$97","v":0},{"$f":"'XX Team'!$F$8","v":6},"N",{"$f":"'XX Team'!$H$98","v":0},{"$f":"'XX Team'!$H$99","v":0},{"$f":"'XX Team'!$D$100","v":"f"}]
[198,{"$f":"'XX Team'!$A$101","v":23},{"$f":"'XX Team'!$D$1","v":"XX Team"},{"$f":"'XX Team'!$D$101","v":0},{"$f":"'XX Team'!$D$102","v":0},{"$f":"'XX Team'!$H$104","v":""},{"$f":"'XX Team'!$H$101","v":0},{"$f":"'XX Team'!$F$8","v":6},"N",{"$f":"'XX Team'!$H$102","v":0},{"$f":"'XX Team'!$H$103","v":0},{"$f":"'XX Team'!$D$104","v":"f"}]
[199,{"$f":"'XX Team'!$A$105","v":24},{"$f":"'XX Team'!$D$1","v":"XX Team"},{"$f":"'XX Team'!$D$105","v":0},{"$f":"'XX Team'!$D$106","v":0},{"$f":"'XX Team'!$H$108","v":""},{"$f":"'XX Team'!$H$105","v":0},{"$f":"'XX Team'!$F$8","v":6},"N",{"$f":"'XX Team'!$H$106","v":0},{"$f":"'XX Team'!$H$107","v":0},{"$f":"'XX Team'!$D$108","v":"f"}]
[200,{"$f":"'XX Team'!$A$109","v":25},{"$f":"'XX Team'!$D$1","v":"XX Team"},{"$f":"'XX Team'!$D$109","v":0},{"$f":"'XX Team'!$D$110","v":0},{"$f":"'XX Team'!$H$112","v":""},{"$f":"'XX Team'!$H$109","v":0},{"$f":"'XX Team'!$F$8","v":6},"N",{"$f":"'XX Team'!$H$110","v":0},{"$f":"'XX Team'!$H$111","v":0},{"$f":"'XX Team'!$D$112","v":"f"}]
[218,{"$f":"'YY Team'!$A$81","v":18},{"$f":"'YY Team'!$D$1","v":"YY Team"},{"$f":"'YY Team'!$D$81","v":0},{"$f":"'YY Team'!$D$82","v":0},{"$f":"'YY Team'!$H$84","v":""},{"$f":"'YY Team'!$H$81","v":0},{"$f":"'YY Team'!$F$8","v":7},"N",{"$f":"'YY Team'!$H$82","v":0},{"$f":"'YY Team'!$H$83","v":0},{"$f":"'YY Team'!$D$84","v":"f"}]
[219,{"$f":"'YY Team'!$A$85","v":19},{"$f":"'YY Team'!$D$1","v":"YY Team"},{"$f":"'YY Team'!$D$85","v":0},{"$f":"'YY Team'!$D$86","v":0},{"$f":"'YY Team'!$H$88","v":""},{"$f":"'YY Team'!$H$85","v":0},{"$f":"'YY Team'!$F$8","v":7},"N",{"$f":"'YY Team'!$H$86","v":0},{"$f":"'YY Team'!$H$87","v":0},{"$f":"'YY Team'!$D$88","v":"f"}]
[220,{"$f":"'YY Team'!$A$89","v":20},{"$f":"'YY Team'!$D$1","v":"YY Team"},{"$f":"'YY Team'!$D$89","v":0},{"$f":"'YY Team'!$D$90","v":0},{"$f":"'YY Team'!$H$92","v":""},{"$f":"'YY Team'!$H$89","v":0},{"$f":"'YY Team'!$F$8","v":7},"N",{"$f":"'YY Team'!$H$90","v":0},{"$f":"'YY Team'!$H$91","v":0},{"$f":"'YY Team'!$D$92","v":"f"}]
[221,{"$f":"'YY Team'!$A$93","v":21},{"$f":"'YY Team'!$D$1","v":"YY Team"},{"$f":"'YY Team'!$D$93","v":0},{"$f":"'YY Team'!$D$94","v":0},{"$f":"'YY Team'!$H$96","v":""},{"$f":"'YY Team'!$H$93","v":0},{"$f":"'YY Team'!$F$8","v":7},"N",{"$f":"'YY Team'!$H$94","v":0},{"$f":"'YY Team'!$H$95","v":0},{"$f":"'YY Team'!$D$96","v":"f"}]
[222,{"$f":"'YY Team'!$A$97","v":22},{"$f":"'YY Team'!$D$1","v":"YY Team"},{"$f":"'YY Team'!$D$97","v":0},{"$f":"'YY Team'!$D$98","v":0},{"$f":"'YY Team'!$H$100","v":""},{"$f":"'YY Team'!$H$97","v":0},{"$f":"'YY Team'!$F$8","v":7},"N",{"$f":"'YY Team'!$H$98","v":0},{"$f":"'YY Team'!$H$99","v":0},{"$f":"'YY Team'!$D$100","v":"f"}]
[223,{"$f":"'YY Team'!$A$101","v":23},{"$f":"'YY Team'!$D$1","v":"YY Team"},{"$f":"'YY Team'!$D$101","v":0},{"$f":"'YY Team'!$D$102","v":0},{"$f":"'YY Team'!$H$104","v":""},{"$f":"'YY Team'!$H$101","v":0},{"$f":"'YY Team'!$F$8","v":7},"N",{"$f":"'YY Team'!$H$102","v":0},{"$f":"'YY Team'!$H$103","v":0},{"$f":"'YY Team'!$D$104","v":"f"}]
[224,{"$f":"'YY Team'!$A$105","v":24},{"$f":"'YY Team'!$D$1","v":"YY Team"},{"$f":"'YY Team'!$D$105","v":0},{"$f":"'YY Team'!$D$106","v":0},{"$f":"'YY Team'!$H$108","v":""},{"$f":"'YY Team'!$H$105","v":0},{"$f":"'YY Team'!$F$8","v":7},"N",{"$f":"'YY Team'!$H$106","v":0},{"$f":"'YY Team'!$H$107","v":0},{"$f":"'YY Team'!$D$108","v":"f"}]
[225,{"$f":"'YY Team'!$A$109","v":25},{"$f":"'YY Team'!$D$1","v":"YY Team"},{"$f":"'YY Team'!$D$109","v":0},{"$f":"'YY Team'!$D$110","v":0},{"$f":"'YY Team'!$H$112","v":""},{"$f":"'YY Team'!$H$109","v":0},{"$f":"'YY Team'!$F$8","v":7},{"$f":"IF(K98<(H98*2.5),\"N\",\"Y\")","v":"N"},{"$f":"'YY Team'!$H$110","v":0},{"$f":"'YY Team'!$H$111","v":0},{"$f":"'YY Team'!$D$112","v":"f"}]
[187,{"$f":"'XX Team'!$A$57","v":12},{"$f":"'XX Team'!$D$1","v":"XX Team"},{"$f":"'XX Team'!$D$57","v":0},{"$f":"'XX Team'!$D$58","v":0},{"$f":"'XX Team'!$H$60","v":""},{"$f":"'XX Team'!$H$57","v":0},{"$f":"'XX Team'!$F$8","v":6},"N",{"$f":"'XX Team'!$H$58","v":0},{"$f":"'XX Team'!$H$59","v":0},{"$f":"'XX Team'!$D$60","v":"f"}]
[188,{"$f":"'XX Team'!$A$61","v":13},{"$f":"'XX Team'!$D$1","v":"XX Team"},{"$f":"'XX Team'!$D$61","v":0},{"$f":"'XX Team'!$D$62","v":0},{"$f":"'XX Team'!$H$64","v":""},{"$f":"'XX Team'!$H$61","v":0},{"$f":"'XX Team'!$F$8","v":6},"N",{"$f":"'XX Team'!$H$62","v":0},{"$f":"'XX Team'!$H$63","v":0},{"$f":"'XX Team'!$D$64","v":"f"}]
[213,{"$f":"'YY Team'!$A$61","v":13},{"$f":"'YY Team'!$D$1","v":"YY Team"},{"$f":"'YY Team'!$D$61","v":0},{"$f":"'YY Team'!$D$62","v":0},{"$f":"'YY Team'!$H$64","v":""},{"$f":"'YY Team'!$H$61","v":0},{"$f":"'YY Team'!$F$8","v":7},"N",{"$f":"'YY Team'!$H$62","v":0},{"$f":"'YY Team'!$H$63","v":0},{"$f":"'YY Team'!$D$64","v":"f"}]
[215,{"$f":"'YY Team'!$A$69","v":15},{"$f":"'YY Team'!$D$1","v":"YY Team"},{"$f":"'YY Team'!$D$69","v":0},{"$f":"'YY Team'!$D$70","v":0},{"$f":"'YY Team'!$H$72","v":""},{"$f":"'YY Team'!$H$69","v":0},{"$f":"'YY Team'!$F$8","v":7},"N",{"$f":"'YY Team'!$H$70","v":0},{"$f":"'YY Team'!$H$71","v":0},{"$f":"'YY Team'!$D$72","v":"f"}]
[44,{"$f":"BCBC!$A$85","v":19},{"$f":"BCBC!$D$1","v":"BCBC"},{"$f":"BCBC!$D$85","v":0},{"$f":"BCBC!$D$86","v":0},{"$f":"BCBC!$H$88","v":""},{"$f":"BCBC!$H$85","v":0},{"$f":"BCBC!$F$8","v":4},"N",{"$f":"BCBC!$H$86","v":0},{"$f":"BCBC!$H$87","v":0},{"$f":"BCBC!$D$88","v":"f"}]
[217,{"$f":"'YY Team'!$A$77","v":17},{"$f":"'YY Team'!$D$1","v":"YY Team"},{"$f":"'YY Team'!$D$77","v":0},{"$f":"'YY Team'!$D$78","v":0},{"$f":"'YY Team'!$H$80","v":""},{"$f":"'YY Team'!$H$77","v":0},{"$f":"'YY Team'!$F$8","v":7},"N",{"$f":"'YY Team'!$H$78","v":0},{"$f":"'YY Team'!$H$79","v":0},{"$f":"'YY Team'!$D$80","v":"f"}]
[216,{"$f":"'YY Team'!$A$73","v":16},{"$f":"'YY Team'!$D$1","v":"YY Team"},{"$f":"'YY Team'!$D$73","v":0},{"$f":"'YY Team'!$D$74","v":0},{"$f":"'YY Team'!$H$76","v":""},{"$f":"'YY Team'!$H$73","v":0},{"$f":"'YY Team'!$F$8","v":7},"N",{"$f":"'YY Team'!$H$74","v":0},{"$f":"'YY Team'!$H$75","v":0},{"$f":"'YY Team'!$D$76","v":"f"}]
[214,{"$f":"'YY Team'!$A$65","v":14},{"$f":"'YY Team'!$D$1","v":"YY Team"},{"$f":"'YY Team'!$D$65","v":0},{"$f":"'YY Team'!$D$66","v":0},{"$f":"'YY Team'!$H$68","v":""},{"$f":"'YY Team'!$H$65","v":0},{"$f":"'YY Team'!$F$8","v":7},"N",{"$f":"'YY Team'!$H$66","v":0},{"$f":"'YY Team'!$H$67","v":0},{"$f":"'YY Team'!$D$68","v":"f"}]
[186,{"$f":"'XX Team'!$A$53","v":11},{"$f":"'XX Team'!$D$1","v":"XX Team"},{"$f":"'XX Team'!$D$53","v":0},{"$f":"'XX Team'!$D$54","v":0},{"$f":"'XX Team'!$H$56","v":""},{"$f":"'XX Team'!$H$53","v":0},{"$f":"'XX Team'!$F$8","v":6},"N",{"$f":"'XX Team'!$H$54","v":0},{"$f":"'XX Team'!$H$55","v":0},{"$f":"'XX Team'!$D$56","v":"f"}]
[118,{"$f":"'X Team'!$A$81","v":18},{"$f":"'X Team'!$D$1","v":"X Team"},{"$f":"'X Team'!$D$81","v":0},{"$f":"'X Team'!$D$82","v":0},{"$f":"'X Team'!$H$84","v":""},{"$f":"'X Team'!$H$81","v":0},{"$f":"'X Team'!$F$8","v":7},"N",{"$f":"'X Team'!$H$82","v":0},{"$f":"'X Team'!$H$83","v":0},{"$f":"'X Team'!$D$84","v":"f"}]
[114,{"$f":"'X Team'!$A$65","v":14},{"$f":"'X Team'!$D$1","v":"X Team"},{"$f":"'X Team'!$D$65","v":0},{"$f":"'X Team'!$D$66","v":0},{"$f":"'X Team'!$H$68","v":""},{"$f":"'X Team'!$H$65","v":0},{"$f":"'X Team'!$F$8","v":7},"N",{"$f":"'X Team'!$H$66","v":0},{"$f":"'X Team'!$H$67","v":0},{"$f":"'X Team'!$D$68","v":"f"}]
[67,{"$f":"'Ghetto Bombers'!$A$77","v":17},{"$f":"'Ghetto Bombers'!$D$1","v":"Ghetto Bombers"},{"$f":"'Ghetto Bombers'!$D$77","v":0},{"$f":"'Ghetto Bombers'!$D$78","v":0},{"$f":"'Ghetto Bombers'!$H$80","v":""},{"$f":"'Ghetto Bombers'!$H$77","v":0},{"$f":"'Ghetto Bombers'!$F$8","v":4},"N",{"$f":"'Ghetto Bombers'!$H$78","v":0},{"$f":"'Ghetto Bombers'!$H$79","v":0},{"$f":"'Ghetto Bombers'!$D$80","v":"f"}]
[142,{"$f":"'XXX Team'!$A$77","v":17},{"$f":"'XXX Team'!$D$1","v":"XXX Team"},{"$f":"'XXX Team'!$D$77","v":0},{"$f":"'XXX Team'!$D$78","v":0},{"$f":"'XXX Team'!$H$80","v":""},{"$f":"'XXX Team'!$H$77","v":0},{"$f":"'XXX Team'!$F$8","v":7},"N",{"$f":"'XXX Team'!$H$78","v":0},{"$f":"'XXX Team'!$H$79","v":0},{"$f":"'XXX Team'!$D$80","v":"f"}]
[115,{"$f":"'X Team'!$A$69","v":15},{"$f":"'X Team'!$D$1","v":"X Team"},{"$f":"'X Team'!$D$69","v":0},{"$f":"'X Team'!$D$70","v":0},{"$f":"'X Team'!$H$72","v":""},{"$f":"'X Team'!$H$69","v":0},{"$f":"'X Team'!$F$8","v":7},"N",{"$f":"'X Team'!$H$70","v":0},{"$f":"'X Team'!$H$71","v":0},{"$f":"'X Team'!$D$72","v":"f"}]
[17,{"$f":"'Bad Pitches'!$A$77","v":17},{"$f":"'Bad Pitches'!$D$1","v":"Bad Pitches"},{"$f":"'Bad Pitches'!$D$77","v":0},{"$f":"'Bad Pitches'!$D$78","v":0},{"$f":"'Bad Pitches'!$H$80","v":""},{"$f":"'Bad Pitches'!$H$77","v":0},{"$f":"'Bad Pitches'!$F$8","v":3},"N",{"$f":"'Bad Pitches'!$H$78","v":0},{"$f":"'Bad Pitches'!$H$79","v":0},{"$f":"'Bad Pitches'!$D$80","v":"f"}]
[143,{"$f":"'XXX Team'!$A$81","v":18},{"$f":"'XXX Team'!$D$1","v":"XXX Team"},{"$f":"'XXX Team'!$D$81","v":0},{"$f":"'XXX Team'!$D$82","v":0},{"$f":"'XXX Team'!$H$84","v":""},{"$f":"'XXX Team'!$H$81","v":0},{"$f":"'XXX Team'!$F$8","v":7},"N",{"$f":"'XXX Team'!$H$82","v":0},{"$f":"'XXX Team'!$H$83","v":0},{"$f":"'XXX Team'!$D$84","v":"f"}]
[120,{"$f":"'X Team'!$A$89","v":20},{"$f":"'X Team'!$D$1","v":"X Team"},{"$f":"'X Team'!$D$89","v":0},{"$f":"'X Team'!$D$90","v":0},{"$f":"'X Team'!$H$92","v":""},{"$f":"'X Team'!$H$89","v":0},{"$f":"'X Team'!$F$8","v":7},"N",{"$f":"'X Team'!$H$90","v":0},{"$f":"'X Team'!$H$91","v":0},{"$f":"'X Team'!$D$92","v":"f"}]
[116,{"$f":"'X Team'!$A$73","v":16},{"$f":"'X Team'!$D$1","v":"X Team"},{"$f":"'X Team'!$D$73","v":0},{"$f":"'X Team'!$D$74","v":0},{"$f":"'X Team'!$H$76","v":""},{"$f":"'X Team'!$H$73","v":0},{"$f":"'X Team'!$F$8","v":7},"N",{"$f":"'X Team'!$H$74","v":0},{"$f":"'X Team'!$H$75","v":0},{"$f":"'X Team'!$D$76","v":"f"}]
[117,{"$f":"'X Team'!$A$77","v":17},{"$f":"'X Team'!$D$1","v":"X Team"},{"$f":"'X Team'!$D$77","v":0},{"$f":"'X Team'!$D$78","v":0},{"$f":"'X Team'!$H$80","v":""},{"$f":"'X Team'!$H$77","v":0},{"$f":"'X Team'!$F$8","v":7},"N",{"$f":"'X Team'!$H$78","v":0},{"$f":"'X Team'!$H$79","v":0},{"$f":"'X Team'!$D$80","v":"f"}]
[15,{"$f":"'Bad Pitches'!$A$69","v":15},{"$f":"'Bad Pitches'!$D$1","v":"Bad Pitches"},{"$f":"'Bad Pitches'!$D$69","v":0},{"$f":"'Bad Pitches'!$D$70","v":0},{"$f":"'Bad Pitches'!$H$72","v":""},{"$f":"'Bad Pitches'!$H$69","v":0},{"$f":"'Bad Pitches'!$F$8","v":3},"N",{"$f":"'Bad Pitches'!$H$70","v":0},{"$f":"'Bad Pitches'!$H$71","v":0},{"$f":"'Bad Pitches'!$D$72","v":"f"}]
[141,{"$f":"'XXX Team'!$A$73","v":16},{"$f":"'XXX Team'!$D$1","v":"XXX Team"},{"$f":"'XXX Team'!$D$73","v":0},{"$f":"'XXX Team'!$D$74","v":0},{"$f":"'XXX Team'!$H$76","v":""},{"$f":"'XXX Team'!$H$73","v":0},{"$f":"'XXX Team'!$F$8","v":7},"N",{"$f":"'XXX Team'!$H$74","v":0},{"$f":"'XXX Team'!$H$75","v":0},{"$f":"'XXX Team'!$D$76","v":"f"}]
[20,{"$f":"'Bad Pitches'!$A$89","v":20},{"$f":"'Bad Pitches'!$D$1","v":"Bad Pitches"},{"$f":"'Bad Pitches'!$D$89","v":0},{"$f":"'Bad Pitches'!$D$90","v":0},{"$f":"'Bad Pitches'!$H$92","v":""},{"$f":"'Bad Pitches'!$H$89","v":0},{"$f":"'Bad Pitches'!$F$8","v":3},"N",{"$f":"'Bad Pitches'!$H$90","v":0},{"$f":"'Bad Pitches'!$H$91","v":0},{"$f":"'Bad Pitches'!$D$92","v":"f"}]
[16,{"$f":"'Bad Pitches'!$A$73","v":16},{"$f":"'Bad Pitches'!$D$1","v":"Bad Pitches"},{"$f":"'Bad Pitches'!$D$73","v":0},{"$f":"'Bad Pitches'!$D$74","v":0},{"$f":"'Bad Pitches'!$H$76","v":""},{"$f":"'Bad Pitches'!$H$73","v":0},{"$f":"'Bad Pitches'!$F$8","v":3},"N",{"$f":"'Bad Pitches'!$H$74","v":0},{"$f":"'Bad Pitches'!$H$75","v":0},{"$f":"'Bad Pitches'!$D$76","v":"f"}]
[64,{"$f":"'Ghetto Bombers'!$A$65","v":14},{"$f":"'Ghetto Bombers'!$D$1","v":"Ghetto Bombers"},{"$f":"'Ghetto Bombers'!$D$65","v":"Danielle"},{"$f":"'Ghetto Bombers'!$D$66","v":"Henesh"},{"$f":"'Ghetto Bombers'!$H$68","v":0.77777777777777779},{"$f":"'Ghetto Bombers'!$H$65","v":9},{"$f":"'Ghetto Bombers'!$F$8","v":4},"N",{"$f":"'Ghetto Bombers'!$H$66","v":7},{"$f":"'Ghetto Bombers'!$H$67","v":9},{"$f":"'Ghetto Bombers'!$D$68","v":"f"}]
[13,{"$f":"'Bad Pitches'!$A$61","v":13},{"$f":"'Bad Pitches'!$D$1","v":"Bad Pitches"},{"$f":"'Bad Pitches'!$D$61","v":"Karson"},{"$f":"'Bad Pitches'!$D$62","v":"Vanderver"},{"$f":"'Bad Pitches'!$H$64","v":0.7142857142857143},{"$f":"'Bad Pitches'!$H$61","v":7},{"$f":"'Bad Pitches'!$F$8","v":3},"N",{"$f":"'Bad Pitches'!$H$62","v":5},{"$f":"'Bad Pitches'!$H$63","v":7},{"$f":"'Bad Pitches'!$D$64","v":"f"}]
[85,{"$f":"'Thunder Ducks'!$A$49","v":10},{"$f":"'Thunder Ducks'!$D$1","v":"Thunder Ducks"},{"$f":"'Thunder Ducks'!$D$49","v":"Ashley"},{"$f":"'Thunder Ducks'!$D$50","v":"Hall"},{"$f":"'Thunder Ducks'!$H$52","v":0.66666666666666663},{"$f":"'Thunder Ducks'!$H$49","v":6},{"$f":"'Thunder Ducks'!$F$8","v":4},"N",{"$f":"'Thunder Ducks'!$H$50","v":4},{"$f":"'Thunder Ducks'!$H$51","v":6},{"$f":"'Thunder Ducks'!$D$52","v":"f"}]
[81,{"$f":"'Thunder Ducks'!$A$33","v":6},{"$f":"'Thunder Ducks'!$D$1","v":"Thunder Ducks"},{"$f":"'Thunder Ducks'!$D$33","v":"Emily"},{"$f":"'Thunder Ducks'!$D$34","v":"Ross"},{"$f":"'Thunder Ducks'!$H$36","v":0.5},{"$f":"'Thunder Ducks'!$H$33","v":6},{"$f":"'Thunder Ducks'!$F$8","v":4},"N",{"$f":"'Thunder Ducks'!$H$34","v":3},{"$f":"'Thunder Ducks'!$H$35","v":6},{"$f":"'Thunder Ducks'!$D$36","v":"f"}]
[41,{"$f":"BCBC!$A$73","v":16},{"$f":"BCBC!$D$1","v":"BCBC"},{"$f":"BCBC!$D$73","v":"Karen "},{"$f":"BCBC!$D$74","v":"Springer"},{"$f":"BCBC!$H$76","v":0.5},{"$f":"BCBC!$H$73","v":4},{"$f":"BCBC!$F$8","v":4},"N",{"$f":"BCBC!$H$74","v":2},{"$f":"BCBC!$H$75","v":4},{"$f":"BCBC!$D$76","v":"f"}]
[10,{"$f":"'Bad Pitches'!$A$49","v":10},{"$f":"'Bad Pitches'!$D$1","v":"Bad Pitches"},{"$f":"'Bad Pitches'!$D$49","v":"Megan"},{"$f":"'Bad Pitches'!$D$50","v":"Timpson"},{"$f":"'Bad Pitches'!$H$52","v":0.44444444444444442},{"$f":"'Bad Pitches'!$H$49","v":9},{"$f":"'Bad Pitches'!$F$8","v":3},"Y",{"$f":"'Bad Pitches'!$H$50","v":4},{"$f":"'Bad Pitches'!$H$51","v":9},{"$f":"'Bad Pitches'!$D$52","v":"f"}]
[35,{"$f":"BCBC!$A$49","v":10},{"$f":"BCBC!$D$1","v":"BCBC"},{"$f":"BCBC!$D$49","v":"Sunni"},{"$f":"BCBC!$D$50","v":"Jackson"},{"$f":"BCBC!$H$52","v":0.42857142857142855},{"$f":"BCBC!$H$49","v":7},{"$f":"BCBC!$F$8","v":4},"N",{"$f":"BCBC!$H$50","v":3},{"$f":"BCBC!$H$51","v":7},{"$f":"BCBC!$D$52","v":"f"}]
[6,{"$f":"'Bad Pitches'!$A$33","v":6},{"$f":"'Bad Pitches'!$D$1","v":"Bad Pitches"},{"$f":"'Bad Pitches'!$D$33","v":"Callianne"},{"$f":"'Bad Pitches'!$D$34","v":"Hodson"},{"$f":"'Bad Pitches'!$H$36","v":0.33333333333333331},{"$f":"'Bad Pitches'!$H$33","v":9},{"$f":"'Bad Pitches'!$F$8","v":3},"Y",{"$f":"'Bad Pitches'!$H$34","v":3},{"$f":"'Bad Pitches'!$H$35","v":9},{"$f":"'Bad Pitches'!$D$36","v":"f"}]
[62,{"$f":"'Ghetto Bombers'!$A$57","v":12},{"$f":"'Ghetto Bombers'!$D$1","v":"Ghetto Bombers"},{"$f":"'Ghetto Bombers'!$D$57","v":"Ally"},{"$f":"'Ghetto Bombers'!$D$58","v":"McAfee"},{"$f":"'Ghetto Bombers'!$H$60","v":0.33333333333333331},{"$f":"'Ghetto Bombers'!$H$57","v":3},{"$f":"'Ghetto Bombers'!$F$8","v":4},{"$f":"IF(K130<(H130*2.5),\"N\",\"Y\")","v":"N"},{"$f":"'Ghetto Bombers'!$H$58","v":1},{"$f":"'Ghetto Bombers'!$H$59","v":4},{"$f":"'Ghetto Bombers'!$D$60","v":"f"}]
[12,{"$f":"'Bad Pitches'!$A$57","v":12},{"$f":"'Bad Pitches'!$D$1","v":"Bad Pitches"},{"$f":"'Bad Pitches'!$D$57","v":"Teya"},{"$f":"'Bad Pitches'!$D$58","v":"Gasu"},{"$f":"'Bad Pitches'!$H$60","v":0.2857142857142857},{"$f":"'Bad Pitches'!$H$57","v":7},{"$f":"'Bad Pitches'!$F$8","v":3},"Y",{"$f":"'Bad Pitches'!$H$58","v":2},{"$f":"'Bad Pitches'!$H$59","v":8},{"$f":"'Bad Pitches'!$D$60","v":"f"}]
[86,{"$f":"'Thunder Ducks'!$A$53","v":11},{"$f":"'Thunder Ducks'!$D$1","v":"Thunder Ducks"},{"$f":"'Thunder Ducks'!$D$53","v":"Kat"},{"$f":"'Thunder Ducks'!$D$54","v":"Tiffany"},{"$f":"'Thunder Ducks'!$H$56","v":0.25},{"$f":"'Thunder Ducks'!$H$53","v":8},{"$f":"'Thunder Ducks'!$F$8","v":4},"N",{"$f":"'Thunder Ducks'!$H$54","v":2},{"$f":"'Thunder Ducks'!$H$55","v":8},{"$f":"'Thunder Ducks'!$D$56","v":"f"}]
[91,{"$f":"'Thunder Ducks'!$A$73","v":16},{"$f":"'Thunder Ducks'!$D$1","v":"Thunder Ducks"},{"$f":"'Thunder Ducks'!$D$73","v":"Paige"},{"$f":"'Thunder Ducks'!$D$74","v":"Jackman"},{"$f":"'Thunder Ducks'!$H$76","v":0.25},{"$f":"'Thunder Ducks'!$H$73","v":4},{"$f":"'Thunder Ducks'!$F$8","v":4},"N",{"$f":"'Thunder Ducks'!$H$74","v":1},{"$f":"'Thunder Ducks'!$H$75","v":4},{"$f":"'Thunder Ducks'!$D$76","v":"f"}]
[8,{"$f":"'Bad Pitches'!$A$41","v":8},{"$f":"'Bad Pitches'!$D$1","v":"Bad Pitches"},{"$f":"'Bad Pitches'!$D$41","v":"Janae"},{"$f":"'Bad Pitches'!$D$42","v":"Cook"},{"$f":"'Bad Pitches'!$H$44","v":0.14285714285714285},{"$f":"'Bad Pitches'!$H$41","v":7},{"$f":"'Bad Pitches'!$F$8","v":3},"Y",{"$f":"'Bad Pitches'!$H$42","v":1},{"$f":"'Bad Pitches'!$H$43","v":8},{"$f":"'Bad Pitches'!$D$44","v":"f"}]
[43,{"$f":"BCBC!$A$81","v":18},{"$f":"BCBC!$D$1","v":"BCBC"},{"$f":"BCBC!$D$81","v":"Melinda"},{"$f":"BCBC!$D$82","v":0},{"$f":"BCBC!$H$84","v":0},{"$f":"BCBC!$H$81","v":3},{"$f":"BCBC!$F$8","v":4},"N",{"$f":"BCBC!$H$82","v":0},{"$f":"BCBC!$H$83","v":3},{"$f":"BCBC!$D$84","v":"f"}]
[58,{"$f":"'Ghetto Bombers'!$A$41","v":8},{"$f":"'Ghetto Bombers'!$D$1","v":"Ghetto Bombers"},{"$f":"'Ghetto Bombers'!$D$41","v":"Ali"},{"$f":"'Ghetto Bombers'!$D$42","v":"Smith"},{"$f":"'Ghetto Bombers'!$H$44","v":0},{"$f":"'Ghetto Bombers'!$H$41","v":6},{"$f":"'Ghetto Bombers'!$F$8","v":4},"N",{"$f":"'Ghetto Bombers'!$H$42","v":0},{"$f":"'Ghetto Bombers'!$H$43","v":7},{"$f":"'Ghetto Bombers'!$D$44","v":"f"}]
[87,{"$f":"'Thunder Ducks'!$A$57","v":12},{"$f":"'Thunder Ducks'!$D$1","v":"Thunder Ducks"},{"$f":"'Thunder Ducks'!$D$57","v":"Megan"},{"$f":"'Thunder Ducks'!$D$58","v":"Goodman"},{"$f":"'Thunder Ducks'!$H$60","v":0},{"$f":"'Thunder Ducks'!$H$57","v":4},{"$f":"'Thunder Ducks'!$F$8","v":4},"N",{"$f":"'Thunder Ducks'!$H$58","v":0},{"$f":"'Thunder Ducks'!$H$59","v":4},{"$f":"'Thunder Ducks'!$D$60","v":"f"}]
[89,{"$f":"'Thunder Ducks'!$A$65","v":14},{"$f":"'Thunder Ducks'!$D$1","v":"Thunder Ducks"},{"$f":"'Thunder Ducks'!$D$65","v":"Lindsay"},{"$f":"'Thunder Ducks'!$D$66","v":"Pennington"},{"$f":"'Thunder Ducks'!$H$68","v":0},{"$f":"'Thunder Ducks'!$H$65","v":2},{"$f":"'Thunder Ducks'!$F$8","v":4},"N",{"$f":"'Thunder Ducks'!$H$66","v":0},{"$f":"'Thunder Ducks'!$H$67","v":3},{"$f":"'Thunder Ducks'!$D$68","v":"f"}]
[38,{"$f":"BCBC!$A$61","v":0},{"$f":"BCBC!$D$1","v":"BCBC"},{"$f":"BCBC!$D$61","v":"Robyne"},{"$f":"BCBC!$D$62","v":"Oostveen"},{"$f":"BCBC!$H$64","v":0},{"$f":"BCBC!$H$61","v":5},{"$f":"BCBC!$F$8","v":4},"N",{"$f":"BCBC!$H$62","v":0},{"$f":"BCBC!$H$63","v":5},{"$f":"BCBC!$D$64","v":"f"}]
[66,{"$f":"'Ghetto Bombers'!$A$73","v":16},{"$f":"'Ghetto Bombers'!$D$1","v":"Ghetto Bombers"},{"$f":"'Ghetto Bombers'!$D$73","v":"Britt"},{"$f":"'Ghetto Bombers'!$D$74","v":"M"},{"$f":"'Ghetto Bombers'!$H$76","v":0.75},{"$f":"'Ghetto Bombers'!$H$73","v":4},{"$f":"'Ghetto Bombers'!$F$8","v":4},"N",{"$f":"'Ghetto Bombers'!$H$74","v":3},{"$f":"'Ghetto Bombers'!$H$75","v":4},{"$f":"'Ghetto Bombers'!$D$76","v":"f00"}]
[53,{"$f":"'Ghetto Bombers'!$A$21","v":3},{"$f":"'Ghetto Bombers'!$D$1","v":"Ghetto Bombers"},{"$f":"'Ghetto Bombers'!$D$21","v":"Matt"},{"$f":"'Ghetto Bombers'!$D$22","v":"Newbold"},{"$f":"'Ghetto Bombers'!$H$24","v":0.94117647058823528},{"$f":"'Ghetto Bombers'!$H$21","v":17},{"$f":"'Ghetto Bombers'!$F$8","v":4},"Y",{"$f":"'Ghetto Bombers'!$H$22","v":16},{"$f":"'Ghetto Bombers'!$H$23","v":18},{"$f":"'Ghetto Bombers'!$D$24","v":"m"}]
[51,{"$f":"'Ghetto Bombers'!$A$13","v":1},{"$f":"'Ghetto Bombers'!$D$1","v":"Ghetto Bombers"},{"$f":"'Ghetto Bombers'!$D$13","v":"Ryan"},{"$f":"'Ghetto Bombers'!$D$14","v":"Newbold"},{"$f":"'Ghetto Bombers'!$H$16","v":0.92307692307692313},{"$f":"'Ghetto Bombers'!$H$13","v":13},{"$f":"'Ghetto Bombers'!$F$8","v":4},"Y",{"$f":"'Ghetto Bombers'!$H$14","v":12},{"$f":"'Ghetto Bombers'!$H$15","v":14},{"$f":"'Ghetto Bombers'!$D$16","v":"m"}]
[30,{"$f":"BCBC!$A$29","v":5},{"$f":"BCBC!$D$1","v":"BCBC"},{"$f":"BCBC!$D$29","v":"Ben"},{"$f":"BCBC!$D$30","v":"Mangum"},{"$f":"BCBC!$H$32","v":0.90909090909090906},{"$f":"BCBC!$H$29","v":11},{"$f":"BCBC!$F$8","v":4},"Y",{"$f":"BCBC!$H$30","v":10},{"$f":"BCBC!$H$31","v":11},{"$f":"BCBC!$D$32","v":"m"}]
[36,{"$f":"BCBC!$A$53","v":11},{"$f":"BCBC!$D$1","v":"BCBC"},{"$f":"BCBC!$D$53","v":"Shane"},{"$f":"BCBC!$D$54","v":"Singer"},{"$f":"BCBC!$H$56","v":0.88888888888888884},{"$f":"BCBC!$H$53","v":9},{"$f":"BCBC!$F$8","v":4},"Y",{"$f":"BCBC!$H$54","v":8},{"$f":"BCBC!$H$55","v":10},{"$f":"BCBC!$D$56","v":"m"}]
[80,{"$f":"'Thunder Ducks'!$A$29","v":5},{"$f":"'Thunder Ducks'!$D$1","v":"Thunder Ducks"},{"$f":"'Thunder Ducks'!$D$29","v":"Kyle"},{"$f":"'Thunder Ducks'!$D$30","v":"O'Bryant"},{"$f":"'Thunder Ducks'!$H$32","v":0.88888888888888884},{"$f":"'Thunder Ducks'!$H$29","v":9},{"$f":"'Thunder Ducks'!$F$8","v":4},"Y",{"$f":"'Thunder Ducks'!$H$30","v":8},{"$f":"'Thunder Ducks'!$H$31","v":10},{"$f":"'Thunder Ducks'!$D$32","v":"m"}]
[34,{"$f":"BCBC!$A$45","v":9},{"$f":"BCBC!$D$1","v":"BCBC"},{"$f":"BCBC!$D$45","v":"Dustin"},{"$f":"BCBC!$D$46","v":"Hunter"},{"$f":"BCBC!$H$48","v":0.75},{"$f":"BCBC!$H$45","v":12},{"$f":"BCBC!$F$8","v":4},"Y",{"$f":"BCBC!$H$46","v":9},{"$f":"BCBC!$H$47","v":12},{"$f":"BCBC!$D$48","v":"m"}]
[76,{"$f":"'Thunder Ducks'!$A$13","v":1},{"$f":"'Thunder Ducks'!$D$1","v":"Thunder Ducks"},{"$f":"'Thunder Ducks'!$D$13","v":"Steve"},{"$f":"'Thunder Ducks'!$D$14","v":"Hart"},{"$f":"'Thunder Ducks'!$H$16","v":0.73333333333333328},{"$f":"'Thunder Ducks'!$H$13","v":15},{"$f":"'Thunder Ducks'!$F$8","v":4},"Y",{"$f":"'Thunder Ducks'!$H$14","v":11},{"$f":"'Thunder Ducks'!$H$15","v":16},{"$f":"'Thunder Ducks'!$D$16","v":"m"}]
[1,{"$f":"'Bad Pitches'!$A$13","v":1},{"$f":"'Bad Pitches'!$D$1","v":"Bad Pitches"},{"$f":"'Bad Pitches'!$D$13","v":"Harrison"},{"$f":"'Bad Pitches'!$D$14","v":"Van Dyke"},{"$f":"'Bad Pitches'!$H$16","v":0.7142857142857143},{"$f":"'Bad Pitches'!$H$13","v":14},{"$f":"'Bad Pitches'!$F$8","v":3},"Y",{"$f":"'Bad Pitches'!$H$14","v":10},{"$f":"'Bad Pitches'!$H$15","v":15},{"$f":"'Bad Pitches'!$D$16","v":"m"}]
[3,{"$f":"'Bad Pitches'!$A$21","v":3},{"$f":"'Bad Pitches'!$D$1","v":"Bad Pitches"},{"$f":"'Bad Pitches'!$D$21","v":"Ryan"},{"$f":"'Bad Pitches'!$D$22","v":"Watt"},{"$f":"'Bad Pitches'!$H$24","v":0.7142857142857143},{"$f":"'Bad Pitches'!$H$21","v":14},{"$f":"'Bad Pitches'!$F$8","v":3},"Y",{"$f":"'Bad Pitches'!$H$22","v":10},{"$f":"'Bad Pitches'!$H$23","v":14},{"$f":"'Bad Pitches'!$D$24","v":"m"}]
[26,{"$f":"BCBC!$A$13","v":1},{"$f":"BCBC!$D$1","v":"BCBC"},{"$f":"BCBC!$D$13","v":"Jordan"},{"$f":"BCBC!$D$14","v":"Rogers"},{"$f":"BCBC!$H$16","v":0.7},{"$f":"BCBC!$H$13","v":10},{"$f":"BCBC!$F$8","v":4},"Y",{"$f":"BCBC!$H$14","v":7},{"$f":"BCBC!$H$15","v":11},{"$f":"BCBC!$D$16","v":"m"}]
[63,{"$f":"'Ghetto Bombers'!$A$61","v":13},{"$f":"'Ghetto Bombers'!$D$1","v":"Ghetto Bombers"},{"$f":"'Ghetto Bombers'!$D$61","v":"Jon"},{"$f":"'Ghetto Bombers'!$D$62","v":"Staley"},{"$f":"'Ghetto Bombers'!$H$64","v":0.7},{"$f":"'Ghetto Bombers'!$H$61","v":10},{"$f":"'Ghetto Bombers'!$F$8","v":4},"Y",{"$f":"'Ghetto Bombers'!$H$62","v":7},{"$f":"'Ghetto Bombers'!$H$63","v":11},{"$f":"'Ghetto Bombers'!$D$64","v":"m"}]
[82,{"$f":"'Thunder Ducks'!$A$37","v":7},{"$f":"'Thunder Ducks'!$D$1","v":"Thunder Ducks"},{"$f":"'Thunder Ducks'!$D$37","v":"Russ"},{"$f":"'Thunder Ducks'!$D$38","v":"Collins"},{"$f":"'Thunder Ducks'!$H$40","v":0.6428571428571429},{"$f":"'Thunder Ducks'!$H$37","v":14},{"$f":"'Thunder Ducks'!$F$8","v":4},"Y",{"$f":"'Thunder Ducks'!$H$38","v":9},{"$f":"'Thunder Ducks'!$H$39","v":15},{"$f":"'Thunder Ducks'!$D$40","v":"m"}]
[78,{"$f":"'Thunder Ducks'!$A$21","v":3},{"$f":"'Thunder Ducks'!$D$1","v":"Thunder Ducks"},{"$f":"'Thunder Ducks'!$D$21","v":"Logan"},{"$f":"'Thunder Ducks'!$D$22","v":"Bateman"},{"$f":"'Thunder Ducks'!$H$24","v":0.6},{"$f":"'Thunder Ducks'!$H$21","v":15},{"$f":"'Thunder Ducks'!$F$8","v":4},"Y",{"$f":"'Thunder Ducks'!$H$22","v":9},{"$f":"'Thunder Ducks'!$H$23","v":15},{"$f":"'Thunder Ducks'!$D$24","v":"m"}]
[57,{"$f":"'Ghetto Bombers'!$A$37","v":7},{"$f":"'Ghetto Bombers'!$D$1","v":"Ghetto Bombers"},{"$f":"'Ghetto Bombers'!$D$37","v":"Chet"},{"$f":"'Ghetto Bombers'!$D$38","v":"Wanlass"},{"$f":"'Ghetto Bombers'!$H$40","v":0.58333333333333337},{"$f":"'Ghetto Bombers'!$H$37","v":12},{"$f":"'Ghetto Bombers'!$F$8","v":4},"Y",{"$f":"'Ghetto Bombers'!$H$38","v":7},{"$f":"'Ghetto Bombers'!$H$39","v":12},{"$f":"'Ghetto Bombers'!$D$40","v":"m"}]
[61,{"$f":"'Ghetto Bombers'!$A$53","v":11},{"$f":"'Ghetto Bombers'!$D$1","v":"Ghetto Bombers"},{"$f":"'Ghetto Bombers'!$D$53","v":"Dave"},{"$f":"'Ghetto Bombers'!$D$54","v":"Vu"},{"$f":"'Ghetto Bombers'!$H$56","v":0.5},{"$f":"'Ghetto Bombers'!$H$53","v":14},{"$f":"'Ghetto Bombers'!$F$8","v":4},"Y",{"$f":"'Ghetto Bombers'!$H$54","v":7},{"$f":"'Ghetto Bombers'!$H$55","v":14},{"$f":"'Ghetto Bombers'!$D$56","v":"m"}]
[28,{"$f":"BCBC!$A$21","v":3},{"$f":"BCBC!$D$1","v":"BCBC"},{"$f":"BCBC!$D$21","v":"Vinny"},{"$f":"BCBC!$D$22","v":"Dilworth"},{"$f":"BCBC!$H$24","v":0.5},{"$f":"BCBC!$H$21","v":12},{"$f":"BCBC!$F$8","v":4},"Y",{"$f":"BCBC!$H$22","v":6},{"$f":"BCBC!$H$23","v":12},{"$f":"BCBC!$D$24","v":"m"}]
[32,{"$f":"BCBC!$A$37","v":7},{"$f":"BCBC!$D$1","v":"BCBC"},{"$f":"BCBC!$D$37","v":"Jeff"},{"$f":"BCBC!$D$38","v":"Nielsen"},{"$f":"BCBC!$H$40","v":0.5},{"$f":"BCBC!$H$37","v":14},{"$f":"BCBC!$F$8","v":4},"Y",{"$f":"BCBC!$H$38","v":7},{"$f":"BCBC!$H$39","v":14},{"$f":"BCBC!$D$40","v":"m"}]
[9,{"$f":"'Bad Pitches'!$A$45","v":9},{"$f":"'Bad Pitches'!$D$1","v":"Bad Pitches"},{"$f":"'Bad Pitches'!$D$45","v":"Aaron"},{"$f":"'Bad Pitches'!$D$46","v":"Montgomery"},{"$f":"'Bad Pitches'!$H$48","v":0.41666666666666669},{"$f":"'Bad Pitches'!$H$45","v":12},{"$f":"'Bad Pitches'!$F$8","v":3},"Y",{"$f":"'Bad Pitches'!$H$46","v":5},{"$f":"'Bad Pitches'!$H$47","v":12},{"$f":"'Bad Pitches'!$D$48","v":"m"}]
[55,{"$f":"'Ghetto Bombers'!$A$29","v":5},{"$f":"'Ghetto Bombers'!$D$1","v":"Ghetto Bombers"},{"$f":"'Ghetto Bombers'!$D$29","v":"Mac"},{"$f":"'Ghetto Bombers'!$D$30","v":"Estrada"},{"$f":"'Ghetto Bombers'!$H$32","v":0.41176470588235292},{"$f":"'Ghetto Bombers'!$H$29","v":17},{"$f":"'Ghetto Bombers'!$F$8","v":4},"Y",{"$f":"'Ghetto Bombers'!$H$30","v":7},{"$f":"'Ghetto Bombers'!$H$31","v":18},{"$f":"'Ghetto Bombers'!$D$32","v":"m"}]
[59,{"$f":"'Ghetto Bombers'!$A$45","v":9},{"$f":"'Ghetto Bombers'!$D$1","v":"Ghetto Bombers"},{"$f":"'Ghetto Bombers'!$D$45","v":"Derek"},{"$f":"'Ghetto Bombers'!$D$46","v":"Smith"},{"$f":"'Ghetto Bombers'!$H$48","v":0.33333333333333331},{"$f":"'Ghetto Bombers'!$H$45","v":12},{"$f":"'Ghetto Bombers'!$F$8","v":4},"Y",{"$f":"'Ghetto Bombers'!$H$46","v":4},{"$f":"'Ghetto Bombers'!$H$47","v":13},{"$f":"'Ghetto Bombers'!$D$48","v":"m"}]
[109,{"$f":"'X Team'!$A$45","v":9},{"$f":"'X Team'!$D$1","v":"X Team"},{"$f":"'X Team'!$D$45","v":"Tyler (TJ)"},{"$f":"'X Team'!$D$46","v":"Gossard"},{"$f":"'X Team'!$H$48","v":0},{"$f":"'X Team'!$H$45","v":63},{"$f":"'X Team'!$F$8","v":7},"Y",{"$f":"'X Team'!$H$46","v":0},{"$f":"'X Team'!$H$47","v":63},{"$f":"'X Team'!$D$48","v":"m"}]
[201,{"$f":"'YY Team'!$A$13","v":1},{"$f":"'YY Team'!$D$1","v":"YY Team"},{"$f":"'YY Team'!$D$13","v":"Kyle"},{"$f":"'YY Team'!$D$14","v":"O'Bryant "},{"$f":"'YY Team'!$H$16","v":0},{"$f":"'YY Team'!$H$13","v":63},{"$f":"'YY Team'!$F$8","v":7},{"$f":"IF(K162<(H162*2.5),\"N\",\"Y\")","v":"Y"},{"$f":"'YY Team'!$H$14","v":0},{"$f":"'YY Team'!$H$15","v":63},{"$f":"'YY Team'!$D$16","v":"m"}]
[101,{"$f":"'X Team'!$A$13","v":1},{"$f":"'X Team'!$D$1","v":"X Team"},{"$f":"'X Team'!$D$13","v":"Jake"},{"$f":"'X Team'!$D$14","v":"Reeves"},{"$f":"'X Team'!$H$16","v":0},{"$f":"'X Team'!$H$13","v":63},{"$f":"'X Team'!$F$8","v":7},"Y",{"$f":"'X Team'!$H$14","v":0},{"$f":"'X Team'!$H$15","v":63},{"$f":"'X Team'!$D$16","v":"m"}]
[105,{"$f":"'X Team'!$A$29","v":5},{"$f":"'X Team'!$D$1","v":"X Team"},{"$f":"'X Team'!$D$29","v":"Jeff"},{"$f":"'X Team'!$D$30","v":"Peacock"},{"$f":"'X Team'!$H$32","v":0},{"$f":"'X Team'!$H$29","v":63},{"$f":"'X Team'!$F$8","v":7},"Y",{"$f":"'X Team'!$H$30","v":0},{"$f":"'X Team'!$H$31","v":63},{"$f":"'X Team'!$D$32","v":"m"}]
[205,{"$f":"'YY Team'!$A$29","v":5},{"$f":"'YY Team'!$D$1","v":"YY Team"},{"$f":"'YY Team'!$D$29","v":"Logan"},{"$f":"'YY Team'!$D$30","v":"Bateman"},{"$f":"'YY Team'!$H$32","v":0},{"$f":"'YY Team'!$H$29","v":63},{"$f":"'YY Team'!$F$8","v":7},"Y",{"$f":"'YY Team'!$H$30","v":0},{"$f":"'YY Team'!$H$31","v":63},{"$f":"'YY Team'!$D$32","v":"m"}]
[126,{"$f":"'XXX Team'!$A$13","v":1},{"$f":"'XXX Team'!$D$1","v":"XXX Team"},{"$f":"'XXX Team'!$D$13","v":"Jordan"},{"$f":"'XXX Team'!$D$14","v":"Hall"},{"$f":"'XXX Team'!$H$16","v":0},{"$f":"'XXX Team'!$H$13","v":63},{"$f":"'XXX Team'!$F$8","v":7},"Y",{"$f":"'XXX Team'!$H$14","v":0},{"$f":"'XXX Team'!$H$15","v":63},{"$f":"'XXX Team'!$D$16","v":"m"}]
[130,{"$f":"'XXX Team'!$A$29","v":5},{"$f":"'XXX Team'!$D$1","v":"XXX Team"},{"$f":"'XXX Team'!$D$29","v":"Sam"},{"$f":"'XXX Team'!$D$30","v":"Cook"},{"$f":"'XXX Team'!$H$32","v":0},{"$f":"'XXX Team'!$H$29","v":63},{"$f":"'XXX Team'!$F$8","v":7},"Y",{"$f":"'XXX Team'!$H$30","v":0},{"$f":"'XXX Team'!$H$31","v":63},{"$f":"'XXX Team'!$D$32","v":"m"}]
[132,{"$f":"'XXX Team'!$A$37","v":7},{"$f":"'XXX Team'!$D$1","v":"XXX Team"},{"$f":"'XXX Team'!$D$37","v":"Ike"},{"$f":"'XXX Team'!$D$38","v":"Whiting"},{"$f":"'XXX Team'!$H$40","v":0},{"$f":"'XXX Team'!$H$37","v":63},{"$f":"'XXX Team'!$F$8","v":7},"Y",{"$f":"'XXX Team'!$H$38","v":0},{"$f":"'XXX Team'!$H$39","v":63},{"$f":"'XXX Team'!$D$40","v":"m"}]
[103,{"$f":"'X Team'!$A$21","v":3},{"$f":"'X Team'!$D$1","v":"X Team"},{"$f":"'X Team'!$D$21","v":"Jason"},{"$f":"'X Team'!$D$22","v":"Reed"},{"$f":"'X Team'!$H$24","v":0},{"$f":"'X Team'!$H$21","v":63},{"$f":"'X Team'!$F$8","v":7},"Y",{"$f":"'X Team'!$H$22","v":0},{"$f":"'X Team'!$H$23","v":63},{"$f":"'X Team'!$D$24","v":"m"}]
[207,{"$f":"'YY Team'!$A$37","v":7},{"$f":"'YY Team'!$D$1","v":"YY Team"},{"$f":"'YY Team'!$D$37","v":"Russ"},{"$f":"'YY Team'!$D$38","v":"Collins"},{"$f":"'YY Team'!$H$40","v":0},{"$f":"'YY Team'!$H$37","v":63},{"$f":"'YY Team'!$F$8","v":7},"Y",{"$f":"'YY Team'!$H$38","v":0},{"$f":"'YY Team'!$H$39","v":63},{"$f":"'YY Team'!$D$40","v":"m"}]
[134,{"$f":"'XXX Team'!$A$45","v":9},{"$f":"'XXX Team'!$D$1","v":"XXX Team"},{"$f":"'XXX Team'!$D$45","v":"Josh"},{"$f":"'XXX Team'!$D$46","v":"Schmidt"},{"$f":"'XXX Team'!$H$48","v":0},{"$f":"'XXX Team'!$H$45","v":63},{"$f":"'XXX Team'!$F$8","v":7},"Y",{"$f":"'XXX Team'!$H$46","v":0},{"$f":"'XXX Team'!$H$47","v":63},{"$f":"'XXX Team'!$D$48","v":"m"}]
[107,{"$f":"'X Team'!$A$37","v":7},{"$f":"'X Team'!$D$1","v":"X Team"},{"$f":"'X Team'!$D$37","v":"Chris"},{"$f":"'X Team'!$D$38","v":"Teerlink"},{"$f":"'X Team'!$H$40","v":0},{"$f":"'X Team'!$H$37","v":63},{"$f":"'X Team'!$F$8","v":7},"Y",{"$f":"'X Team'!$H$38","v":0},{"$f":"'X Team'!$H$39","v":63},{"$f":"'X Team'!$D$40","v":"m"}]
[203,{"$f":"'YY Team'!$A$21","v":3},{"$f":"'YY Team'!$D$1","v":"YY Team"},{"$f":"'YY Team'!$D$21","v":"Stephen "},{"$f":"'YY Team'!$D$22","v":"Hart"},{"$f":"'YY Team'!$H$24","v":0},{"$f":"'YY Team'!$H$21","v":63},{"$f":"'YY Team'!$F$8","v":7},"Y",{"$f":"'YY Team'!$H$22","v":0},{"$f":"'YY Team'!$H$23","v":63},{"$f":"'YY Team'!$D$24","v":"m"}]
[209,{"$f":"'YY Team'!$A$45","v":9},{"$f":"'YY Team'!$D$1","v":"YY Team"},{"$f":"'YY Team'!$D$45","v":"John"},{"$f":"'YY Team'!$D$46","v":"Campbell"},{"$f":"'YY Team'!$H$48","v":0},{"$f":"'YY Team'!$H$45","v":63},{"$f":"'YY Team'!$F$8","v":7},"Y",{"$f":"'YY Team'!$H$46","v":0},{"$f":"'YY Team'!$H$47","v":63},{"$f":"'YY Team'!$D$48","v":"m"}]
[185,{"$f":"'XX Team'!$A$49","v":10},{"$f":"'XX Team'!$D$1","v":"XX Team"},{"$f":"'XX Team'!$D$49","v":"Alex"},{"$f":"'XX Team'!$D$50","v":"Johnson"},{"$f":"'XX Team'!$H$52","v":0},{"$f":"'XX Team'!$H$49","v":63},{"$f":"'XX Team'!$F$8","v":6},"Y",{"$f":"'XX Team'!$H$50","v":0},{"$f":"'XX Team'!$H$51","v":63},{"$f":"'XX Team'!$D$52","v":"m"}]
[179,{"$f":"'XX Team'!$A$25","v":4},{"$f":"'XX Team'!$D$1","v":"XX Team"},{"$f":"'XX Team'!$D$25","v":"Thomas"},{"$f":"'XX Team'!$D$26","v":"Rich"},{"$f":"'XX Team'!$H$28","v":0},{"$f":"'XX Team'!$H$25","v":63},{"$f":"'XX Team'!$F$8","v":6},"Y",{"$f":"'XX Team'!$H$26","v":0},{"$f":"'XX Team'!$H$27","v":63},{"$f":"'XX Team'!$D$28","v":"m"}]
[183,{"$f":"'XX Team'!$A$41","v":8},{"$f":"'XX Team'!$D$1","v":"XX Team"},{"$f":"'XX Team'!$D$41","v":"Brandon"},{"$f":"'XX Team'!$D$42","v":"Blake"},{"$f":"'XX Team'!$H$44","v":0},{"$f":"'XX Team'!$H$41","v":63},{"$f":"'XX Team'!$F$8","v":6},"Y",{"$f":"'XX Team'!$H$42","v":0},{"$f":"'XX Team'!$H$43","v":63},{"$f":"'XX Team'!$D$44","v":"m"}]
[181,{"$f":"'XX Team'!$A$33","v":6},{"$f":"'XX Team'!$D$1","v":"XX Team"},{"$f":"'XX Team'!$D$33","v":"Ken"},{"$f":"'XX Team'!$D$34","v":"Hansen"},{"$f":"'XX Team'!$H$36","v":0},{"$f":"'XX Team'!$H$33","v":63},{"$f":"'XX Team'!$F$8","v":6},"Y",{"$f":"'XX Team'!$H$34","v":0},{"$f":"'XX Team'!$H$35","v":63},{"$f":"'XX Team'!$D$36","v":"m"}]
[177,{"$f":"'XX Team'!$A$17","v":2},{"$f":"'XX Team'!$D$1","v":"XX Team"},{"$f":"'XX Team'!$D$17","v":"Josh"},{"$f":"'XX Team'!$D$18","v":"Wright"},{"$f":"'XX Team'!$H$20","v":0},{"$f":"'XX Team'!$H$17","v":63},{"$f":"'XX Team'!$F$8","v":6},"Y",{"$f":"'XX Team'!$H$18","v":0},{"$f":"'XX Team'!$H$19","v":63},{"$f":"'XX Team'!$D$20","v":"m"}]
[138,{"$f":"'XXX Team'!$A$61","v":13},{"$f":"'XXX Team'!$D$1","v":"XXX Team"},{"$f":"'XXX Team'!$D$61","v":"Dan"},{"$f":"'XXX Team'!$D$62","v":"Flynn"},{"$f":"'XXX Team'!$H$64","v":0},{"$f":"'XXX Team'!$H$61","v":63},{"$f":"'XXX Team'!$F$8","v":7},"Y",{"$f":"'XXX Team'!$H$62","v":0},{"$f":"'XXX Team'!$H$63","v":63},{"$f":"'XXX Team'!$D$64","v":"m"}]
[128,{"$f":"'XXX Team'!$A$21","v":3},{"$f":"'XXX Team'!$D$1","v":"XXX Team"},{"$f":"'XXX Team'!$D$21","v":"Corey"},{"$f":"'XXX Team'!$D$22","v":"Murphy"},{"$f":"'XXX Team'!$H$24","v":0},{"$f":"'XXX Team'!$H$21","v":63},{"$f":"'XXX Team'!$F$8","v":7},"Y",{"$f":"'XXX Team'!$H$22","v":0},{"$f":"'XXX Team'!$H$23","v":63},{"$f":"'XXX Team'!$D$24","v":"m"}]
[112,{"$f":"'X Team'!$A$57","v":12},{"$f":"'X Team'!$D$1","v":"X Team"},{"$f":"'X Team'!$D$57","v":"Kenyon"},{"$f":"'X Team'!$D$58","v":"Kawa"},{"$f":"'X Team'!$H$60","v":0},{"$f":"'X Team'!$H$57","v":63},{"$f":"'X Team'!$F$8","v":7},"Y",{"$f":"'X Team'!$H$58","v":0},{"$f":"'X Team'!$H$59","v":63},{"$f":"'X Team'!$D$60","v":"m"}]
[136,{"$f":"'XXX Team'!$A$53","v":11},{"$f":"'XXX Team'!$D$1","v":"XXX Team"},{"$f":"'XXX Team'!$D$53","v":"Josh"},{"$f":"'XXX Team'!$D$54","v":"Anderson"},{"$f":"'XXX Team'!$H$56","v":0},{"$f":"'XXX Team'!$H$53","v":63},{"$f":"'XXX Team'!$F$8","v":7},"Y",{"$f":"'XXX Team'!$H$54","v":0},{"$f":"'XXX Team'!$H$55","v":63},{"$f":"'XXX Team'!$D$56","v":"m"}]
[139,{"$f":"'XXX Team'!$A$65","v":14},{"$f":"'XXX Team'!$D$1","v":"XXX Team"},{"$f":"'XXX Team'!$D$65","v":"J C"},{"$f":"'XXX Team'!$D$66","v":"Garcia"},{"$f":"'XXX Team'!$H$68","v":0},{"$f":"'XXX Team'!$H$65","v":63},{"$f":"'XXX Team'!$F$8","v":7},"Y",{"$f":"'XXX Team'!$H$66","v":0},{"$f":"'XXX Team'!$H$67","v":63},{"$f":"'XXX Team'!$D$68","v":"m"}]
[92,{"$f":"'Thunder Ducks'!$A$77","v":17},{"$f":"'Thunder Ducks'!$D$1","v":"Thunder Ducks"},{"$f":"'Thunder Ducks'!$D$77","v":0},{"$f":"'Thunder Ducks'!$D$78","v":0},{"$f":"'Thunder Ducks'!$H$80","v":""},{"$f":"'Thunder Ducks'!$H$77","v":0},{"$f":"'Thunder Ducks'!$F$8","v":4},"N",{"$f":"'Thunder Ducks'!$H$78","v":0},{"$f":"'Thunder Ducks'!$H$79","v":0},{"$f":"'Thunder Ducks'!$D$80","v":"m"}]
[19,{"$f":"'Bad Pitches'!$A$85","v":19},{"$f":"'Bad Pitches'!$D$1","v":"Bad Pitches"},{"$f":"'Bad Pitches'!$D$85","v":0},{"$f":"'Bad Pitches'!$D$86","v":0},{"$f":"'Bad Pitches'!$H$88","v":""},{"$f":"'Bad Pitches'!$H$85","v":0},{"$f":"'Bad Pitches'!$F$8","v":3},"N",{"$f":"'Bad Pitches'!$H$86","v":0},{"$f":"'Bad Pitches'!$H$87","v":0},{"$f":"'Bad Pitches'!$D$88","v":"m"}]
[119,{"$f":"'X Team'!$A$85","v":19},{"$f":"'X Team'!$D$1","v":"X Team"},{"$f":"'X Team'!$D$85","v":0},{"$f":"'X Team'!$D$86","v":0},{"$f":"'X Team'!$H$88","v":""},{"$f":"'X Team'!$H$85","v":0},{"$f":"'X Team'!$F$8","v":7},"N",{"$f":"'X Team'!$H$86","v":0},{"$f":"'X Team'!$H$87","v":0},{"$f":"'X Team'!$D$88","v":"m"}]
[18,{"$f":"'Bad Pitches'!$A$81","v":18},{"$f":"'Bad Pitches'!$D$1","v":"Bad Pitches"},{"$f":"'Bad Pitches'!$D$81","v":0},{"$f":"'Bad Pitches'!$D$82","v":0},{"$f":"'Bad Pitches'!$H$84","v":""},{"$f":"'Bad Pitches'!$H$81","v":0},{"$f":"'Bad Pitches'!$F$8","v":3},"N",{"$f":"'Bad Pitches'!$H$82","v":0},{"$f":"'Bad Pitches'!$H$83","v":0},{"$f":"'Bad Pitches'!$D$84","v":"m"}]
[140,{"$f":"'XXX Team'!$A$69","v":15},{"$f":"'XXX Team'!$D$1","v":"XXX Team"},{"$f":"'XXX Team'!$D$69","v":0},{"$f":"'XXX Team'!$D$70","v":0},{"$f":"'XXX Team'!$H$72","v":""},{"$f":"'XXX Team'!$H$69","v":0},{"$f":"'XXX Team'!$F$8","v":7},"N",{"$f":"'XXX Team'!$H$70","v":0},{"$f":"'XXX Team'!$H$71","v":0},{"$f":"'XXX Team'!$D$72","v":"m"}]
[68,{"$f":"'Ghetto Bombers'!$A$81","v":18},{"$f":"'Ghetto Bombers'!$D$1","v":"Ghetto Bombers"},{"$f":"'Ghetto Bombers'!$D$81","v":0},{"$f":"'Ghetto Bombers'!$D$82","v":0},{"$f":"'Ghetto Bombers'!$H$84","v":""},{"$f":"'Ghetto Bombers'!$H$81","v":0},{"$f":"'Ghetto Bombers'!$F$8","v":4},"N",{"$f":"'Ghetto Bombers'!$H$82","v":0},{"$f":"'Ghetto Bombers'!$H$83","v":0},{"$f":"'Ghetto Bombers'!$D$84","v":"m"}]
[121,{"$f":"'X Team'!$A$93","v":21},{"$f":"'X Team'!$D$1","v":"X Team"},{"$f":"'X Team'!$D$93","v":0},{"$f":"'X Team'!$D$94","v":0},{"$f":"'X Team'!$H$96","v":""},{"$f":"'X Team'!$H$93","v":0},{"$f":"'X Team'!$F$8","v":7},"N",{"$f":"'X Team'!$H$94","v":0},{"$f":"'X Team'!$H$95","v":0},{"$f":"'X Team'!$D$96","v":"m"}]
[7,{"$f":"'Bad Pitches'!$A$37","v":7},{"$f":"'Bad Pitches'!$D$1","v":"Bad Pitches"},{"$f":"'Bad Pitches'!$D$37","v":"Jeff"},{"$f":"'Bad Pitches'!$D$38","v":"Cagle"},{"$f":"'Bad Pitches'!$H$40","v":0.7142857142857143},{"$f":"'Bad Pitches'!$H$37","v":7},{"$f":"'Bad Pitches'!$F$8","v":3},"Y",{"$f":"'Bad Pitches'!$H$38","v":5},{"$f":"'Bad Pitches'!$H$39","v":8},{"$f":"'Bad Pitches'!$D$40","v":"m"}]
[40,{"$f":"BCBC!$A$69","v":15},{"$f":"BCBC!$D$1","v":"BCBC"},{"$f":"BCBC!$D$69","v":"Scotty"},{"$f":"BCBC!$D$70","v":"Garfield"},{"$f":"BCBC!$H$72","v":0.66666666666666663},{"$f":"BCBC!$H$69","v":3},{"$f":"BCBC!$F$8","v":4},"N",{"$f":"BCBC!$H$70","v":2},{"$f":"BCBC!$H$71","v":3},{"$f":"BCBC!$D$72","v":"m"}]
[39,{"$f":"BCBC!$A$65","v":14},{"$f":"BCBC!$D$1","v":"BCBC"},{"$f":"BCBC!$D$65","v":"AJ"},{"$f":"BCBC!$D$66","v":"Avellar"},{"$f":"BCBC!$H$68","v":0.66666666666666663},{"$f":"BCBC!$H$65","v":3},{"$f":"BCBC!$F$8","v":4},{"$f":"IF(K194<(H194*2.5),\"N\",\"Y\")","v":"N"},{"$f":"BCBC!$H$66","v":2},{"$f":"BCBC!$H$67","v":3},{"$f":"BCBC!$D$68","v":"m"}]
[88,{"$f":"'Thunder Ducks'!$A$61","v":13},{"$f":"'Thunder Ducks'!$D$1","v":"Thunder Ducks"},{"$f":"'Thunder Ducks'!$D$61","v":"Spencer"},{"$f":"'Thunder Ducks'!$D$62","v":"Hille"},{"$f":"'Thunder Ducks'!$H$64","v":0.5714285714285714},{"$f":"'Thunder Ducks'!$H$61","v":7},{"$f":"'Thunder Ducks'!$F$8","v":4},"N",{"$f":"'Thunder Ducks'!$H$62","v":4},{"$f":"'Thunder Ducks'!$H$63","v":7},{"$f":"'Thunder Ducks'!$D$64","v":"m"}]
[14,{"$f":"'Bad Pitches'!$A$65","v":14},{"$f":"'Bad Pitches'!$D$1","v":"Bad Pitches"},{"$f":"'Bad Pitches'!$D$65","v":"Britton"},{"$f":"'Bad Pitches'!$D$66","v":"Lund"},{"$f":"'Bad Pitches'!$H$68","v":0.5},{"$f":"'Bad Pitches'!$H$65","v":4},{"$f":"'Bad Pitches'!$F$8","v":3},"N",{"$f":"'Bad Pitches'!$H$66","v":2},{"$f":"'Bad Pitches'!$H$67","v":4},{"$f":"'Bad Pitches'!$D$68","v":"m"}]
[90,{"$f":"'Thunder Ducks'!$A$69","v":15},{"$f":"'Thunder Ducks'!$D$1","v":"Thunder Ducks"},{"$f":"'Thunder Ducks'!$D$69","v":"John"},{"$f":"'Thunder Ducks'!$D$70","v":"Campbell"},{"$f":"'Thunder Ducks'!$H$72","v":0.5},{"$f":"'Thunder Ducks'!$H$69","v":4},{"$f":"'Thunder Ducks'!$F$8","v":4},"N",{"$f":"'Thunder Ducks'!$H$70","v":2},{"$f":"'Thunder Ducks'!$H$71","v":4},{"$f":"'Thunder Ducks'!$D$72","v":"m"}]
[42,{"$f":"BCBC!$A$77","v":17},{"$f":"BCBC!$D$1","v":"BCBC"},{"$f":"BCBC!$D$77","v":"Craig"},{"$f":"BCBC!$D$78","v":"Patten"},{"$f":"BCBC!$H$80","v":0.33333333333333331},{"$f":"BCBC!$H$77","v":3},{"$f":"BCBC!$F$8","v":4},"N",{"$f":"BCBC!$H$78","v":1},{"$f":"BCBC!$H$79","v":3},{"$f":"BCBC!$D$80","v":"m"}]
[5,{"$f":"'Bad Pitches'!$A$29","v":5},{"$f":"'Bad Pitches'!$D$1","v":"Bad Pitches"},{"$f":"'Bad Pitches'!$D$29","v":"Parker"},{"$f":"'Bad Pitches'!$D$30","v":"Van Dyke"},{"$f":"'Bad Pitches'!$H$32","v":0.33333333333333331},{"$f":"'Bad Pitches'!$H$29","v":6},{"$f":"'Bad Pitches'!$F$8","v":3},"N",{"$f":"'Bad Pitches'!$H$30","v":2},{"$f":"'Bad Pitches'!$H$31","v":6},{"$f":"'Bad Pitches'!$D$32","v":"m"}]
[84,{"$f":"'Thunder Ducks'!$A$45","v":9},{"$f":"'Thunder Ducks'!$D$1","v":"Thunder Ducks"},{"$f":"'Thunder Ducks'!$D$45","v":"Adam"},{"$f":"'Thunder Ducks'!$D$46","v":"Thorne"},{"$f":"'Thunder Ducks'!$H$48","v":0.33333333333333331},{"$f":"'Thunder Ducks'!$H$45","v":3},{"$f":"'Thunder Ducks'!$F$8","v":4},"N",{"$f":"'Thunder Ducks'!$H$46","v":1},{"$f":"'Thunder Ducks'!$H$47","v":6},{"$f":"'Thunder Ducks'!$D$48","v":"m"}]
[11,{"$f":"'Bad Pitches'!$A$53","v":11},{"$f":"'Bad Pitches'!$D$1","v":"Bad Pitches"},{"$f":"'Bad Pitches'!$D$53","v":"Vincente"},{"$f":"'Bad Pitches'!$D$54","v":"Herrera"},{"$f":"'Bad Pitches'!$H$56","v":0.25},{"$f":"'Bad Pitches'!$H$53","v":8},{"$f":"'Bad Pitches'!$F$8","v":3},"Y",{"$f":"'Bad Pitches'!$H$54","v":2},{"$f":"'Bad Pitches'!$H$55","v":8},{"$f":"'Bad Pitches'!$D$56","v":"m"}]

{"sheet":"Male","index":10,"n_rows":201,"n_cols":12,"rows_kept":201,"cut":false,"hidden":false,"merged":[]}
["counter","roster #","Team Name","L-Name","F-Name","Batting Avg","# of AB's","# of Games","Enough pa's","HITS","# of PA","Male/Female"]
[53,{"$f":"'Ghetto Bombers'!$A$21","v":3},{"$f":"'Ghetto Bombers'!$D$1","v":"Ghetto Bombers"},{"$f":"'Ghetto Bombers'!$D$21","v":"Matt"},{"$f":"'Ghetto Bombers'!$D$22","v":"Newbold"},{"$f":"'Ghetto Bombers'!$H$24","v":0.94117647058823528},{"$f":"'Ghetto Bombers'!$H$21","v":17},{"$f":"'Ghetto Bombers'!$F$8","v":4},{"$f":"IF(K2<(H2*2.5),\"N\",\"Y\")","v":"Y"},{"$f":"'Ghetto Bombers'!$H$22","v":16},{"$f":"'Ghetto Bombers'!$H$23","v":18},{"$f":"'Ghetto Bombers'!$D$24","v":"m"}]
[51,{"$f":"'Ghetto Bombers'!$A$13","v":1},{"$f":"'Ghetto Bombers'!$D$1","v":"Ghetto Bombers"},{"$f":"'Ghetto Bombers'!$D$13","v":"Ryan"},{"$f":"'Ghetto Bombers'!$D$14","v":"Newbold"},{"$f":"'Ghetto Bombers'!$H$16","v":0.92307692307692313},{"$f":"'Ghetto Bombers'!$H$13","v":13},{"$f":"'Ghetto Bombers'!$F$8","v":4},"Y",{"$f":"'Ghetto Bombers'!$H$14","v":12},{"$f":"'Ghetto Bombers'!$H$15","v":14},{"$f":"'Ghetto Bombers'!$D$16","v":"m"}]
[30,{"$f":"BCBC!$A$29","v":5},{"$f":"BCBC!$D$1","v":"BCBC"},{"$f":"BCBC!$D$29","v":"Ben"},{"$f":"BCBC!$D$30","v":"Mangum"},{"$f":"BCBC!$H$32","v":0.90909090909090906},{"$f":"BCBC!$H$29","v":11},{"$f":"BCBC!$F$8","v":4},"Y",{"$f":"BCBC!$H$30","v":10},{"$f":"BCBC!$H$31","v":11},{"$f":"BCBC!$D$32","v":"m"}]
[36,{"$f":"BCBC!$A$53","v":11},{"$f":"BCBC!$D$1","v":"BCBC"},{"$f":"BCBC!$D$53","v":"Shane"},{"$f":"BCBC!$D$54","v":"Singer"},{"$f":"BCBC!$H$56","v":0.88888888888888884},{"$f":"BCBC!$H$53","v":9},{"$f":"BCBC!$F$8","v":4},"Y",{"$f":"BCBC!$H$54","v":8},{"$f":"BCBC!$H$55","v":10},{"$f":"BCBC!$D$56","v":"m"}]
[80,{"$f":"'Thunder Ducks'!$A$29","v":5},{"$f":"'Thunder Ducks'!$D$1","v":"Thunder Ducks"},{"$f":"'Thunder Ducks'!$D$29","v":"Kyle"},{"$f":"'Thunder Ducks'!$D$30","v":"O'Bryant"},{"$f":"'Thunder Ducks'!$H$32","v":0.88888888888888884},{"$f":"'Thunder Ducks'!$H$29","v":9},{"$f":"'Thunder Ducks'!$F$8","v":4},"Y",{"$f":"'Thunder Ducks'!$H$30","v":8},{"$f":"'Thunder Ducks'!$H$31","v":10},{"$f":"'Thunder Ducks'!$D$32","v":"m"}]
[34,{"$f":"BCBC!$A$45","v":9},{"$f":"BCBC!$D$1","v":"BCBC"},{"$f":"BCBC!$D$45","v":"Dustin"},{"$f":"BCBC!$D$46","v":"Hunter"},{"$f":"BCBC!$H$48","v":0.75},{"$f":"BCBC!$H$45","v":12},{"$f":"BCBC!$F$8","v":4},"Y",{"$f":"BCBC!$H$46","v":9},{"$f":"BCBC!$H$47","v":12},{"$f":"BCBC!$D$48","v":"m"}]
[76,{"$f":"'Thunder Ducks'!$A$13","v":1},{"$f":"'Thunder Ducks'!$D$1","v":"Thunder Ducks"},{"$f":"'Thunder Ducks'!$D$13","v":"Steve"},{"$f":"'Thunder Ducks'!$D$14","v":"Hart"},{"$f":"'Thunder Ducks'!$H$16","v":0.73333333333333328},{"$f":"'Thunder Ducks'!$H$13","v":15},{"$f":"'Thunder Ducks'!$F$8","v":4},"Y",{"$f":"'Thunder Ducks'!$H$14","v":11},{"$f":"'Thunder Ducks'!$H$15","v":16},{"$f":"'Thunder Ducks'!$D$16","v":"m"}]
[1,{"$f":"'Bad Pitches'!$A$13","v":1},{"$f":"'Bad Pitches'!$D$1","v":"Bad Pitches"},{"$f":"'Bad Pitches'!$D$13","v":"Harrison"},{"$f":"'Bad Pitches'!$D$14","v":"Van Dyke"},{"$f":"'Bad Pitches'!$H$16","v":0.7142857142857143},{"$f":"'Bad Pitches'!$H$13","v":14},{"$f":"'Bad Pitches'!$F$8","v":3},"Y",{"$f":"'Bad Pitches'!$H$14","v":10},{"$f":"'Bad Pitches'!$H$15","v":15},{"$f":"'Bad Pitches'!$D$16","v":"m"}]
[3,{"$f":"'Bad Pitches'!$A$21","v":3},{"$f":"'Bad Pitches'!$D$1","v":"Bad Pitches"},{"$f":"'Bad Pitches'!$D$21","v":"Ryan"},{"$f":"'Bad Pitches'!$D$22","v":"Watt"},{"$f":"'Bad Pitches'!$H$24","v":0.7142857142857143},{"$f":"'Bad Pitches'!$H$21","v":14},{"$f":"'Bad Pitches'!$F$8","v":3},"Y",{"$f":"'Bad Pitches'!$H$22","v":10},{"$f":"'Bad Pitches'!$H$23","v":14},{"$f":"'Bad Pitches'!$D$24","v":"m"}]
[26,{"$f":"BCBC!$A$13","v":1},{"$f":"BCBC!$D$1","v":"BCBC"},{"$f":"BCBC!$D$13","v":"Jordan"},{"$f":"BCBC!$D$14","v":"Rogers"},{"$f":"BCBC!$H$16","v":0.7},{"$f":"BCBC!$H$13","v":10},{"$f":"BCBC!$F$8","v":4},"Y",{"$f":"BCBC!$H$14","v":7},{"$f":"BCBC!$H$15","v":11},{"$f":"BCBC!$D$16","v":"m"}]
[63,{"$f":"'Ghetto Bombers'!$A$61","v":13},{"$f":"'Ghetto Bombers'!$D$1","v":"Ghetto Bombers"},{"$f":"'Ghetto Bombers'!$D$61","v":"Jon"},{"$f":"'Ghetto Bombers'!$D$62","v":"Staley"},{"$f":"'Ghetto Bombers'!$H$64","v":0.7},{"$f":"'Ghetto Bombers'!$H$61","v":10},{"$f":"'Ghetto Bombers'!$F$8","v":4},"Y",{"$f":"'Ghetto Bombers'!$H$62","v":7},{"$f":"'Ghetto Bombers'!$H$63","v":11},{"$f":"'Ghetto Bombers'!$D$64","v":"m"}]
[82,{"$f":"'Thunder Ducks'!$A$37","v":7},{"$f":"'Thunder Ducks'!$D$1","v":"Thunder Ducks"},{"$f":"'Thunder Ducks'!$D$37","v":"Russ"},{"$f":"'Thunder Ducks'!$D$38","v":"Collins"},{"$f":"'Thunder Ducks'!$H$40","v":0.6428571428571429},{"$f":"'Thunder Ducks'!$H$37","v":14},{"$f":"'Thunder Ducks'!$F$8","v":4},"Y",{"$f":"'Thunder Ducks'!$H$38","v":9},{"$f":"'Thunder Ducks'!$H$39","v":15},{"$f":"'Thunder Ducks'!$D$40","v":"m"}]
[78,{"$f":"'Thunder Ducks'!$A$21","v":3},{"$f":"'Thunder Ducks'!$D$1","v":"Thunder Ducks"},{"$f":"'Thunder Ducks'!$D$21","v":"Logan"},{"$f":"'Thunder Ducks'!$D$22","v":"Bateman"},{"$f":"'Thunder Ducks'!$H$24","v":0.6},{"$f":"'Thunder Ducks'!$H$21","v":15},{"$f":"'Thunder Ducks'!$F$8","v":4},"Y",{"$f":"'Thunder Ducks'!$H$22","v":9},{"$f":"'Thunder Ducks'!$H$23","v":15},{"$f":"'Thunder Ducks'!$D$24","v":"m"}]
[57,{"$f":"'Ghetto Bombers'!$A$37","v":7},{"$f":"'Ghetto Bombers'!$D$1","v":"Ghetto Bombers"},{"$f":"'Ghetto Bombers'!$D$37","v":"Chet"},{"$f":"'Ghetto Bombers'!$D$38","v":"Wanlass"},{"$f":"'Ghetto Bombers'!$H$40","v":0.58333333333333337},{"$f":"'Ghetto Bombers'!$H$37","v":12},{"$f":"'Ghetto Bombers'!$F$8","v":4},"Y",{"$f":"'Ghetto Bombers'!$H$38","v":7},{"$f":"'Ghetto Bombers'!$H$39","v":12},{"$f":"'Ghetto Bombers'!$D$40","v":"m"}]
[61,{"$f":"'Ghetto Bombers'!$A$53","v":11},{"$f":"'Ghetto Bombers'!$D$1","v":"Ghetto Bombers"},{"$f":"'Ghetto Bombers'!$D$53","v":"Dave"},{"$f":"'Ghetto Bombers'!$D$54","v":"Vu"},{"$f":"'Ghetto Bombers'!$H$56","v":0.5},{"$f":"'Ghetto Bombers'!$H$53","v":14},{"$f":"'Ghetto Bombers'!$F$8","v":4},"Y",{"$f":"'Ghetto Bombers'!$H$54","v":7},{"$f":"'Ghetto Bombers'!$H$55","v":14},{"$f":"'Ghetto Bombers'!$D$56","v":"m"}]
[28,{"$f":"BCBC!$A$21","v":3},{"$f":"BCBC!$D$1","v":"BCBC"},{"$f":"BCBC!$D$21","v":"Vinny"},{"$f":"BCBC!$D$22","v":"Dilworth"},{"$f":"BCBC!$H$24","v":0.5},{"$f":"BCBC!$H$21","v":12},{"$f":"BCBC!$F$8","v":4},"Y",{"$f":"BCBC!$H$22","v":6},{"$f":"BCBC!$H$23","v":12},{"$f":"BCBC!$D$24","v":"m"}]
[32,{"$f":"BCBC!$A$37","v":7},{"$f":"BCBC!$D$1","v":"BCBC"},{"$f":"BCBC!$D$37","v":"Jeff"},{"$f":"BCBC!$D$38","v":"Nielsen"},{"$f":"BCBC!$H$40","v":0.5},{"$f":"BCBC!$H$37","v":14},{"$f":"BCBC!$F$8","v":4},"Y",{"$f":"BCBC!$H$38","v":7},{"$f":"BCBC!$H$39","v":14},{"$f":"BCBC!$D$40","v":"m"}]
[9,{"$f":"'Bad Pitches'!$A$45","v":9},{"$f":"'Bad Pitches'!$D$1","v":"Bad Pitches"},{"$f":"'Bad Pitches'!$D$45","v":"Aaron"},{"$f":"'Bad Pitches'!$D$46","v":"Montgomery"},{"$f":"'Bad Pitches'!$H$48","v":0.41666666666666669},{"$f":"'Bad Pitches'!$H$45","v":12},{"$f":"'Bad Pitches'!$F$8","v":3},"Y",{"$f":"'Bad Pitches'!$H$46","v":5},{"$f":"'Bad Pitches'!$H$47","v":12},{"$f":"'Bad Pitches'!$D$48","v":"m"}]
[55,{"$f":"'Ghetto Bombers'!$A$29","v":5},{"$f":"'Ghetto Bombers'!$D$1","v":"Ghetto Bombers"},{"$f":"'Ghetto Bombers'!$D$29","v":"Mac"},{"$f":"'Ghetto Bombers'!$D$30","v":"Estrada"},{"$f":"'Ghetto Bombers'!$H$32","v":0.41176470588235292},{"$f":"'Ghetto Bombers'!$H$29","v":17},{"$f":"'Ghetto Bombers'!$F$8","v":4},"Y",{"$f":"'Ghetto Bombers'!$H$30","v":7},{"$f":"'Ghetto Bombers'!$H$31","v":18},{"$f":"'Ghetto Bombers'!$D$32","v":"m"}]
[59,{"$f":"'Ghetto Bombers'!$A$45","v":9},{"$f":"'Ghetto Bombers'!$D$1","v":"Ghetto Bombers"},{"$f":"'Ghetto Bombers'!$D$45","v":"Derek"},{"$f":"'Ghetto Bombers'!$D$46","v":"Smith"},{"$f":"'Ghetto Bombers'!$H$48","v":0.33333333333333331},{"$f":"'Ghetto Bombers'!$H$45","v":12},{"$f":"'Ghetto Bombers'!$F$8","v":4},"Y",{"$f":"'Ghetto Bombers'!$H$46","v":4},{"$f":"'Ghetto Bombers'!$H$47","v":13},{"$f":"'Ghetto Bombers'!$D$48","v":"m"}]
[109,{"$f":"'X Team'!$A$45","v":9},{"$f":"'X Team'!$D$1","v":"X Team"},{"$f":"'X Team'!$D$45","v":"Tyler (TJ)"},{"$f":"'X Team'!$D$46","v":"Gossard"},{"$f":"'X Team'!$H$48","v":0},{"$f":"'X Team'!$H$45","v":63},{"$f":"'X Team'!$F$8","v":7},"Y",{"$f":"'X Team'!$H$46","v":0},{"$f":"'X Team'!$H$47","v":63},{"$f":"'X Team'!$D$48","v":"m"}]
[201,{"$f":"'YY Team'!$A$13","v":1},{"$f":"'YY Team'!$D$1","v":"YY Team"},{"$f":"'YY Team'!$D$13","v":"Kyle"},{"$f":"'YY Team'!$D$14","v":"O'Bryant "},{"$f":"'YY Team'!$H$16","v":0},{"$f":"'YY Team'!$H$13","v":63},{"$f":"'YY Team'!$F$8","v":7},"Y",{"$f":"'YY Team'!$H$14","v":0},{"$f":"'YY Team'!$H$15","v":63},{"$f":"'YY Team'!$D$16","v":"m"}]
[101,{"$f":"'X Team'!$A$13","v":1},{"$f":"'X Team'!$D$1","v":"X Team"},{"$f":"'X Team'!$D$13","v":"Jake"},{"$f":"'X Team'!$D$14","v":"Reeves"},{"$f":"'X Team'!$H$16","v":0},{"$f":"'X Team'!$H$13","v":63},{"$f":"'X Team'!$F$8","v":7},"Y",{"$f":"'X Team'!$H$14","v":0},{"$f":"'X Team'!$H$15","v":63},{"$f":"'X Team'!$D$16","v":"m"}]
[105,{"$f":"'X Team'!$A$29","v":5},{"$f":"'X Team'!$D$1","v":"X Team"},{"$f":"'X Team'!$D$29","v":"Jeff"},{"$f":"'X Team'!$D$30","v":"Peacock"},{"$f":"'X Team'!$H$32","v":0},{"$f":"'X Team'!$H$29","v":63},{"$f":"'X Team'!$F$8","v":7},"Y",{"$f":"'X Team'!$H$30","v":0},{"$f":"'X Team'!$H$31","v":63},{"$f":"'X Team'!$D$32","v":"m"}]
[205,{"$f":"'YY Team'!$A$29","v":5},{"$f":"'YY Team'!$D$1","v":"YY Team"},{"$f":"'YY Team'!$D$29","v":"Logan"},{"$f":"'YY Team'!$D$30","v":"Bateman"},{"$f":"'YY Team'!$H$32","v":0},{"$f":"'YY Team'!$H$29","v":63},{"$f":"'YY Team'!$F$8","v":7},"Y",{"$f":"'YY Team'!$H$30","v":0},{"$f":"'YY Team'!$H$31","v":63},{"$f":"'YY Team'!$D$32","v":"m"}]
[126,{"$f":"'XXX Team'!$A$13","v":1},{"$f":"'XXX Team'!$D$1","v":"XXX Team"},{"$f":"'XXX Team'!$D$13","v":"Jordan"},{"$f":"'XXX Team'!$D$14","v":"Hall"},{"$f":"'XXX Team'!$H$16","v":0},{"$f":"'XXX Team'!$H$13","v":63},{"$f":"'XXX Team'!$F$8","v":7},"Y",{"$f":"'XXX Team'!$H$14","v":0},{"$f":"'XXX Team'!$H$15","v":63},{"$f":"'XXX Team'!$D$16","v":"m"}]
[130,{"$f":"'XXX Team'!$A$29","v":5},{"$f":"'XXX Team'!$D$1","v":"XXX Team"},{"$f":"'XXX Team'!$D$29","v":"Sam"},{"$f":"'XXX Team'!$D$30","v":"Cook"},{"$f":"'XXX Team'!$H$32","v":0},{"$f":"'XXX Team'!$H$29","v":63},{"$f":"'XXX Team'!$F$8","v":7},"Y",{"$f":"'XXX Team'!$H$30","v":0},{"$f":"'XXX Team'!$H$31","v":63},{"$f":"'XXX Team'!$D$32","v":"m"}]
[132,{"$f":"'XXX Team'!$A$37","v":7},{"$f":"'XXX Team'!$D$1","v":"XXX Team"},{"$f":"'XXX Team'!$D$37","v":"Ike"},{"$f":"'XXX Team'!$D$38","v":"Whiting"},{"$f":"'XXX Team'!$H$40","v":0},{"$f":"'XXX Team'!$H$37","v":63},{"$f":"'XXX Team'!$F$8","v":7},"Y",{"$f":"'XXX Team'!$H$38","v":0},{"$f":"'XXX Team'!$H$39","v":63},{"$f":"'XXX Team'!$D$40","v":"m"}]
[103,{"$f":"'X Team'!$A$21","v":3},{"$f":"'X Team'!$D$1","v":"X Team"},{"$f":"'X Team'!$D$21","v":"Jason"},{"$f":"'X Team'!$D$22","v":"Reed"},{"$f":"'X Team'!$H$24","v":0},{"$f":"'X Team'!$H$21","v":63},{"$f":"'X Team'!$F$8","v":7},"Y",{"$f":"'X Team'!$H$22","v":0},{"$f":"'X Team'!$H$23","v":63},{"$f":"'X Team'!$D$24","v":"m"}]
[207,{"$f":"'YY Team'!$A$37","v":7},{"$f":"'YY Team'!$D$1","v":"YY Team"},{"$f":"'YY Team'!$D$37","v":"Russ"},{"$f":"'YY Team'!$D$38","v":"Collins"},{"$f":"'YY Team'!$H$40","v":0},{"$f":"'YY Team'!$H$37","v":63},{"$f":"'YY Team'!$F$8","v":7},"Y",{"$f":"'YY Team'!$H$38","v":0},{"$f":"'YY Team'!$H$39","v":63},{"$f":"'YY Team'!$D$40","v":"m"}]
[134,{"$f":"'XXX Team'!$A$45","v":9},{"$f":"'XXX Team'!$D$1","v":"XXX Team"},{"$f":"'XXX Team'!$D$45","v":"Josh"},{"$f":"'XXX Team'!$D$46","v":"Schmidt"},{"$f":"'XXX Team'!$H$48","v":0},{"$f":"'XXX Team'!$H$45","v":63},{"$f":"'XXX Team'!$F$8","v":7},"Y",{"$f":"'XXX Team'!$H$46","v":0},{"$f":"'XXX Team'!$H$47","v":63},{"$f":"'XXX Team'!$D$48","v":"m"}]
[107,{"$f":"'X Team'!$A$37","v":7},{"$f":"'X Team'!$D$1","v":"X Team"},{"$f":"'X Team'!$D$37","v":"Chris"},{"$f":"'X Team'!$D$38","v":"Teerlink"},{"$f":"'X Team'!$H$40","v":0},{"$f":"'X Team'!$H$37","v":63},{"$f":"'X Team'!$F$8","v":7},"Y",{"$f":"'X Team'!$H$38","v":0},{"$f":"'X Team'!$H$39","v":63},{"$f":"'X Team'!$D$40","v":"m"}]
[203,{"$f":"'YY Team'!$A$21","v":3},{"$f":"'YY Team'!$D$1","v":"YY Team"},{"$f":"'YY Team'!$D$21","v":"Stephen "},{"$f":"'YY Team'!$D$22","v":"Hart"},{"$f":"'YY Team'!$H$24","v":0},{"$f":"'YY Team'!$H$21","v":63},{"$f":"'YY Team'!$F$8","v":7},{"$f":"IF(K34<(H34*2.5),\"N\",\"Y\")","v":"Y"},{"$f":"'YY Team'!$H$22","v":0},{"$f":"'YY Team'!$H$23","v":63},{"$f":"'YY Team'!$D$24","v":"m"}]
[209,{"$f":"'YY Team'!$A$45","v":9},{"$f":"'YY Team'!$D$1","v":"YY Team"},{"$f":"'YY Team'!$D$45","v":"John"},{"$f":"'YY Team'!$D$46","v":"Campbell"},{"$f":"'YY Team'!$H$48","v":0},{"$f":"'YY Team'!$H$45","v":63},{"$f":"'YY Team'!$F$8","v":7},"Y",{"$f":"'YY Team'!$H$46","v":0},{"$f":"'YY Team'!$H$47","v":63},{"$f":"'YY Team'!$D$48","v":"m"}]
[185,{"$f":"'XX Team'!$A$49","v":10},{"$f":"'XX Team'!$D$1","v":"XX Team"},{"$f":"'XX Team'!$D$49","v":"Alex"},{"$f":"'XX Team'!$D$50","v":"Johnson"},{"$f":"'XX Team'!$H$52","v":0},{"$f":"'XX Team'!$H$49","v":63},{"$f":"'XX Team'!$F$8","v":6},"Y",{"$f":"'XX Team'!$H$50","v":0},{"$f":"'XX Team'!$H$51","v":63},{"$f":"'XX Team'!$D$52","v":"m"}]
[179,{"$f":"'XX Team'!$A$25","v":4},{"$f":"'XX Team'!$D$1","v":"XX Team"},{"$f":"'XX Team'!$D$25","v":"Thomas"},{"$f":"'XX Team'!$D$26","v":"Rich"},{"$f":"'XX Team'!$H$28","v":0},{"$f":"'XX Team'!$H$25","v":63},{"$f":"'XX Team'!$F$8","v":6},"Y",{"$f":"'XX Team'!$H$26","v":0},{"$f":"'XX Team'!$H$27","v":63},{"$f":"'XX Team'!$D$28","v":"m"}]
[183,{"$f":"'XX Team'!$A$41","v":8},{"$f":"'XX Team'!$D$1","v":"XX Team"},{"$f":"'XX Team'!$D$41","v":"Brandon"},{"$f":"'XX Team'!$D$42","v":"Blake"},{"$f":"'XX Team'!$H$44","v":0},{"$f":"'XX Team'!$H$41","v":63},{"$f":"'XX Team'!$F$8","v":6},"Y",{"$f":"'XX Team'!$H$42","v":0},{"$f":"'XX Team'!$H$43","v":63},{"$f":"'XX Team'!$D$44","v":"m"}]
[181,{"$f":"'XX Team'!$A$33","v":6},{"$f":"'XX Team'!$D$1","v":"XX Team"},{"$f":"'XX Team'!$D$33","v":"Ken"},{"$f":"'XX Team'!$D$34","v":"Hansen"},{"$f":"'XX Team'!$H$36","v":0},{"$f":"'XX Team'!$H$33","v":63},{"$f":"'XX Team'!$F$8","v":6},"Y",{"$f":"'XX Team'!$H$34","v":0},{"$f":"'XX Team'!$H$35","v":63},{"$f":"'XX Team'!$D$36","v":"m"}]
[177,{"$f":"'XX Team'!$A$17","v":2},{"$f":"'XX Team'!$D$1","v":"XX Team"},{"$f":"'XX Team'!$D$17","v":"Josh"},{"$f":"'XX Team'!$D$18","v":"Wright"},{"$f":"'XX Team'!$H$20","v":0},{"$f":"'XX Team'!$H$17","v":63},{"$f":"'XX Team'!$F$8","v":6},"Y",{"$f":"'XX Team'!$H$18","v":0},{"$f":"'XX Team'!$H$19","v":63},{"$f":"'XX Team'!$D$20","v":"m"}]
[128,{"$f":"'XXX Team'!$A$21","v":3},{"$f":"'XXX Team'!$D$1","v":"XXX Team"},{"$f":"'XXX Team'!$D$21","v":"Corey"},{"$f":"'XXX Team'!$D$22","v":"Murphy"},{"$f":"'XXX Team'!$H$24","v":0},{"$f":"'XXX Team'!$H$21","v":63},{"$f":"'XXX Team'!$F$8","v":7},"Y",{"$f":"'XXX Team'!$H$22","v":0},{"$f":"'XXX Team'!$H$23","v":63},{"$f":"'XXX Team'!$D$24","v":"m"}]
[138,{"$f":"'XXX Team'!$A$61","v":13},{"$f":"'XXX Team'!$D$1","v":"XXX Team"},{"$f":"'XXX Team'!$D$61","v":"Dan"},{"$f":"'XXX Team'!$D$62","v":"Flynn"},{"$f":"'XXX Team'!$H$64","v":0},{"$f":"'XXX Team'!$H$61","v":63},{"$f":"'XXX Team'!$F$8","v":7},"Y",{"$f":"'XXX Team'!$H$62","v":0},{"$f":"'XXX Team'!$H$63","v":63},{"$f":"'XXX Team'!$D$64","v":"m"}]
[112,{"$f":"'X Team'!$A$57","v":12},{"$f":"'X Team'!$D$1","v":"X Team"},{"$f":"'X Team'!$D$57","v":"Kenyon"},{"$f":"'X Team'!$D$58","v":"Kawa"},{"$f":"'X Team'!$H$60","v":0},{"$f":"'X Team'!$H$57","v":63},{"$f":"'X Team'!$F$8","v":7},"Y",{"$f":"'X Team'!$H$58","v":0},{"$f":"'X Team'!$H$59","v":63},{"$f":"'X Team'!$D$60","v":"m"}]
[136,{"$f":"'XXX Team'!$A$53","v":11},{"$f":"'XXX Team'!$D$1","v":"XXX Team"},{"$f":"'XXX Team'!$D$53","v":"Josh"},{"$f":"'XXX Team'!$D$54","v":"Anderson"},{"$f":"'XXX Team'!$H$56","v":0},{"$f":"'XXX Team'!$H$53","v":63},{"$f":"'XXX Team'!$F$8","v":7},"Y",{"$f":"'XXX Team'!$H$54","v":0},{"$f":"'XXX Team'!$H$55","v":63},{"$f":"'XXX Team'!$D$56","v":"m"}]
[139,{"$f":"'XXX Team'!$A$65","v":14},{"$f":"'XXX Team'!$D$1","v":"XXX Team"},{"$f":"'XXX Team'!$D$65","v":"J C"},{"$f":"'XXX Team'!$D$66","v":"Garcia"},{"$f":"'XXX Team'!$H$68","v":0},{"$f":"'XXX Team'!$H$65","v":63},{"$f":"'XXX Team'!$F$8","v":7},"Y",{"$f":"'XXX Team'!$H$66","v":0},{"$f":"'XXX Team'!$H$67","v":63},{"$f":"'XXX Team'!$D$68","v":"m"}]
[19,{"$f":"'Bad Pitches'!$A$85","v":19},{"$f":"'Bad Pitches'!$D$1","v":"Bad Pitches"},{"$f":"'Bad Pitches'!$D$85","v":0},{"$f":"'Bad Pitches'!$D$86","v":0},{"$f":"'Bad Pitches'!$H$88","v":""},{"$f":"'Bad Pitches'!$H$85","v":0},{"$f":"'Bad Pitches'!$F$8","v":3},"N",{"$f":"'Bad Pitches'!$H$86","v":0},{"$f":"'Bad Pitches'!$H$87","v":0},{"$f":"'Bad Pitches'!$D$88","v":"m"}]
[18,{"$f":"'Bad Pitches'!$A$81","v":18},{"$f":"'Bad Pitches'!$D$1","v":"Bad Pitches"},{"$f":"'Bad Pitches'!$D$81","v":0},{"$f":"'Bad Pitches'!$D$82","v":0},{"$f":"'Bad Pitches'!$H$84","v":""},{"$f":"'Bad Pitches'!$H$81","v":0},{"$f":"'Bad Pitches'!$F$8","v":3},"N",{"$f":"'Bad Pitches'!$H$82","v":0},{"$f":"'Bad Pitches'!$H$83","v":0},{"$f":"'Bad Pitches'!$D$84","v":"m"}]
[140,{"$f":"'XXX Team'!$A$69","v":15},{"$f":"'XXX Team'!$D$1","v":"XXX Team"},{"$f":"'XXX Team'!$D$69","v":0},{"$f":"'XXX Team'!$D$70","v":0},{"$f":"'XXX Team'!$H$72","v":""},{"$f":"'XXX Team'!$H$69","v":0},{"$f":"'XXX Team'!$F$8","v":7},"N",{"$f":"'XXX Team'!$H$70","v":0},{"$f":"'XXX Team'!$H$71","v":0},{"$f":"'XXX Team'!$D$72","v":"m"}]
[119,{"$f":"'X Team'!$A$85","v":19},{"$f":"'X Team'!$D$1","v":"X Team"},{"$f":"'X Team'!$D$85","v":0},{"$f":"'X Team'!$D$86","v":0},{"$f":"'X Team'!$H$88","v":""},{"$f":"'X Team'!$H$85","v":0},{"$f":"'X Team'!$F$8","v":7},"N",{"$f":"'X Team'!$H$86","v":0},{"$f":"'X Team'!$H$87","v":0},{"$f":"'X Team'!$D$88","v":"m"}]
[68,{"$f":"'Ghetto Bombers'!$A$81","v":18},{"$f":"'Ghetto Bombers'!$D$1","v":"Ghetto Bombers"},{"$f":"'Ghetto Bombers'!$D$81","v":0},{"$f":"'Ghetto Bombers'!$D$82","v":0},{"$f":"'Ghetto Bombers'!$H$84","v":""},{"$f":"'Ghetto Bombers'!$H$81","v":0},{"$f":"'Ghetto Bombers'!$F$8","v":4},"N",{"$f":"'Ghetto Bombers'!$H$82","v":0},{"$f":"'Ghetto Bombers'!$H$83","v":0},{"$f":"'Ghetto Bombers'!$D$84","v":"m"}]
[121,{"$f":"'X Team'!$A$93","v":21},{"$f":"'X Team'!$D$1","v":"X Team"},{"$f":"'X Team'!$D$93","v":0},{"$f":"'X Team'!$D$94","v":0},{"$f":"'X Team'!$H$96","v":""},{"$f":"'X Team'!$H$93","v":0},{"$f":"'X Team'!$F$8","v":7},"N",{"$f":"'X Team'!$H$94","v":0},{"$f":"'X Team'!$H$95","v":0},{"$f":"'X Team'!$D$96","v":"m"}]
[92,{"$f":"'Thunder Ducks'!$A$77","v":17},{"$f":"'Thunder Ducks'!$D$1","v":"Thunder Ducks"},{"$f":"'Thunder Ducks'!$D$77","v":0},{"$f":"'Thunder Ducks'!$D$78","v":0},{"$f":"'Thunder Ducks'!$H$80","v":""},{"$f":"'Thunder Ducks'!$H$77","v":0},{"$f":"'Thunder Ducks'!$F$8","v":4},"N",{"$f":"'Thunder Ducks'!$H$78","v":0},{"$f":"'Thunder Ducks'!$H$79","v":0},{"$f":"'Thunder Ducks'!$D$80","v":"m"}]
[7,{"$f":"'Bad Pitches'!$A$37","v":7},{"$f":"'Bad Pitches'!$D$1","v":"Bad Pitches"},{"$f":"'Bad Pitches'!$D$37","v":"Jeff"},{"$f":"'Bad Pitches'!$D$38","v":"Cagle"},{"$f":"'Bad Pitches'!$H$40","v":0.7142857142857143},{"$f":"'Bad Pitches'!$H$37","v":7},{"$f":"'Bad Pitches'!$F$8","v":3},"Y",{"$f":"'Bad Pitches'!$H$38","v":5},{"$f":"'Bad Pitches'!$H$39","v":8},{"$f":"'Bad Pitches'!$D$40","v":"m"}]
[40,{"$f":"BCBC!$A$69","v":15},{"$f":"BCBC!$D$1","v":"BCBC"},{"$f":"BCBC!$D$69","v":"Scotty"},{"$f":"BCBC!$D$70","v":"Garfield"},{"$f":"BCBC!$H$72","v":0.66666666666666663},{"$f":"BCBC!$H$69","v":3},{"$f":"BCBC!$F$8","v":4},"N",{"$f":"BCBC!$H$70","v":2},{"$f":"BCBC!$H$71","v":3},{"$f":"BCBC!$D$72","v":"m"}]
[39,{"$f":"BCBC!$A$65","v":14},{"$f":"BCBC!$D$1","v":"BCBC"},{"$f":"BCBC!$D$65","v":"AJ"},{"$f":"BCBC!$D$66","v":"Avellar"},{"$f":"BCBC!$H$68","v":0.66666666666666663},{"$f":"BCBC!$H$65","v":3},{"$f":"BCBC!$F$8","v":4},"N",{"$f":"BCBC!$H$66","v":2},{"$f":"BCBC!$H$67","v":3},{"$f":"BCBC!$D$68","v":"m"}]
[88,{"$f":"'Thunder Ducks'!$A$61","v":13},{"$f":"'Thunder Ducks'!$D$1","v":"Thunder Ducks"},{"$f":"'Thunder Ducks'!$D$61","v":"Spencer"},{"$f":"'Thunder Ducks'!$D$62","v":"Hille"},{"$f":"'Thunder Ducks'!$H$64","v":0.5714285714285714},{"$f":"'Thunder Ducks'!$H$61","v":7},{"$f":"'Thunder Ducks'!$F$8","v":4},"N",{"$f":"'Thunder Ducks'!$H$62","v":4},{"$f":"'Thunder Ducks'!$H$63","v":7},{"$f":"'Thunder Ducks'!$D$64","v":"m"}]
[90,{"$f":"'Thunder Ducks'!$A$69","v":15},{"$f":"'Thunder Ducks'!$D$1","v":"Thunder Ducks"},{"$f":"'Thunder Ducks'!$D$69","v":"John"},{"$f":"'Thunder Ducks'!$D$70","v":"Campbell"},{"$f":"'Thunder Ducks'!$H$72","v":0.5},{"$f":"'Thunder Ducks'!$H$69","v":4},{"$f":"'Thunder Ducks'!$F$8","v":4},"N",{"$f":"'Thunder Ducks'!$H$70","v":2},{"$f":"'Thunder Ducks'!$H$71","v":4},{"$f":"'Thunder Ducks'!$D$72","v":"m"}]
[14,{"$f":"'Bad Pitches'!$A$65","v":14},{"$f":"'Bad Pitches'!$D$1","v":"Bad Pitches"},{"$f":"'Bad Pitches'!$D$65","v":"Britton"},{"$f":"'Bad Pitches'!$D$66","v":"Lund"},{"$f":"'Bad Pitches'!$H$68","v":0.5},{"$f":"'Bad Pitches'!$H$65","v":4},{"$f":"'Bad Pitches'!$F$8","v":3},"N",{"$f":"'Bad Pitches'!$H$66","v":2},{"$f":"'Bad Pitches'!$H$67","v":4},{"$f":"'Bad Pitches'!$D$68","v":"m"}]
[5,{"$f":"'Bad Pitches'!$A$29","v":5},{"$f":"'Bad Pitches'!$D$1","v":"Bad Pitches"},{"$f":"'Bad Pitches'!$D$29","v":"Parker"},{"$f":"'Bad Pitches'!$D$30","v":"Van Dyke"},{"$f":"'Bad Pitches'!$H$32","v":0.33333333333333331},{"$f":"'Bad Pitches'!$H$29","v":6},{"$f":"'Bad Pitches'!$F$8","v":3},"N",{"$f":"'Bad Pitches'!$H$30","v":2},{"$f":"'Bad Pitches'!$H$31","v":6},{"$f":"'Bad Pitches'!$D$32","v":"m"}]
[84,{"$f":"'Thunder Ducks'!$A$45","v":9},{"$f":"'Thunder Ducks'!$D$1","v":"Thunder Ducks"},{"$f":"'Thunder Ducks'!$D$45","v":"Adam"},{"$f":"'Thunder Ducks'!$D$46","v":"Thorne"},{"$f":"'Thunder Ducks'!$H$48","v":0.33333333333333331},{"$f":"'Thunder Ducks'!$H$45","v":3},{"$f":"'Thunder Ducks'!$F$8","v":4},"N",{"$f":"'Thunder Ducks'!$H$46","v":1},{"$f":"'Thunder Ducks'!$H$47","v":6},{"$f":"'Thunder Ducks'!$D$48","v":"m"}]
[42,{"$f":"BCBC!$A$77","v":17},{"$f":"BCBC!$D$1","v":"BCBC"},{"$f":"BCBC!$D$77","v":"Craig"},{"$f":"BCBC!$D$78","v":"Patten"},{"$f":"BCBC!$H$80","v":0.33333333333333331},{"$f":"BCBC!$H$77","v":3},{"$f":"BCBC!$F$8","v":4},"N",{"$f":"BCBC!$H$78","v":1},{"$f":"BCBC!$H$79","v":3},{"$f":"BCBC!$D$80","v":"m"}]
[11,{"$f":"'Bad Pitches'!$A$53","v":11},{"$f":"'Bad Pitches'!$D$1","v":"Bad Pitches"},{"$f":"'Bad Pitches'!$D$53","v":"Vincente"},{"$f":"'Bad Pitches'!$D$54","v":"Herrera"},{"$f":"'Bad Pitches'!$H$56","v":0.25},{"$f":"'Bad Pitches'!$H$53","v":8},{"$f":"'Bad Pitches'!$F$8","v":3},"Y",{"$f":"'Bad Pitches'!$H$54","v":2},{"$f":"'Bad Pitches'!$H$55","v":8},{"$f":"'Bad Pitches'!$D$56","v":"m"}]
[66,{"$f":"'Ghetto Bombers'!$A$73","v":16},{"$f":"'Ghetto Bombers'!$D$1","v":"Ghetto Bombers"},{"$f":"'Ghetto Bombers'!$D$73","v":"Britt"},{"$f":"'Ghetto Bombers'!$D$74","v":"M"},{"$f":"'Ghetto Bombers'!$H$76","v":0.75},{"$f":"'Ghetto Bombers'!$H$73","v":4},{"$f":"'Ghetto Bombers'!$F$8","v":4},"N",{"$f":"'Ghetto Bombers'!$H$74","v":3},{"$f":"'Ghetto Bombers'!$H$75","v":4},{"$f":"'Ghetto Bombers'!$D$76","v":"f00"}]
[83,{"$f":"'Thunder Ducks'!$A$41","v":8},{"$f":"'Thunder Ducks'!$D$1","v":"Thunder Ducks"},{"$f":"'Thunder Ducks'!$D$41","v":"Annie"},{"$f":"'Thunder Ducks'!$D$42","v":"Brady"},{"$f":"'Thunder Ducks'!$H$44","v":0.72727272727272729},{"$f":"'Thunder Ducks'!$H$41","v":11},{"$f":"'Thunder Ducks'!$F$8","v":4},"Y",{"$f":"'Thunder Ducks'!$H$42","v":8},{"$f":"'Thunder Ducks'!$H$43","v":11},{"$f":"'Thunder Ducks'!$D$44","v":"f"}]
[52,{"$f":"'Ghetto Bombers'!$A$17","v":2},{"$f":"'Ghetto Bombers'!$D$1","v":"Ghetto Bombers"},{"$f":"'Ghetto Bombers'!$D$17","v":"Calleigh"},{"$f":"'Ghetto Bombers'!$D$18","v":"DeYoung"},{"$f":"'Ghetto Bombers'!$H$20","v":0.6875},{"$f":"'Ghetto Bombers'!$H$17","v":16},{"$f":"'Ghetto Bombers'!$F$8","v":4},"Y",{"$f":"'Ghetto Bombers'!$H$18","v":11},{"$f":"'Ghetto Bombers'!$H$19","v":18},{"$f":"'Ghetto Bombers'!$D$20","v":"f"}]
[54,{"$f":"'Ghetto Bombers'!$A$25","v":4},{"$f":"'Ghetto Bombers'!$D$1","v":"Ghetto Bombers"},{"$f":"'Ghetto Bombers'!$D$25","v":"Brandi"},{"$f":"'Ghetto Bombers'!$D$26","v":"Hall"},{"$f":"'Ghetto Bombers'!$H$28","v":0.55555555555555558},{"$f":"'Ghetto Bombers'!$H$25","v":18},{"$f":"'Ghetto Bombers'!$F$8","v":4},{"$f":"IF(K66<(H66*2.5),\"N\",\"Y\")","v":"Y"},{"$f":"'Ghetto Bombers'!$H$26","v":10},{"$f":"'Ghetto Bombers'!$H$27","v":18},{"$f":"'Ghetto Bombers'!$D$28","v":"f"}]
[65,{"$f":"'Ghetto Bombers'!$A$69","v":15},{"$f":"'Ghetto Bombers'!$D$1","v":"Ghetto Bombers"},{"$f":"'Ghetto Bombers'!$D$69","v":"Hope"},{"$f":"'Ghetto Bombers'!$D$70","v":"Curtis"},{"$f":"'Ghetto Bombers'!$H$72","v":0.54545454545454541},{"$f":"'Ghetto Bombers'!$H$69","v":11},{"$f":"'Ghetto Bombers'!$F$8","v":4},"Y",{"$f":"'Ghetto Bombers'!$H$70","v":6},{"$f":"'Ghetto Bombers'!$H$71","v":11},{"$f":"'Ghetto Bombers'!$D$72","v":"f"}]
[4,{"$f":"'Bad Pitches'!$A$25","v":4},{"$f":"'Bad Pitches'!$D$1","v":"Bad Pitches"},{"$f":"'Bad Pitches'!$D$25","v":"Tanzie"},{"$f":"'Bad Pitches'!$D$26","v":"Gasu"},{"$f":"'Bad Pitches'!$H$28","v":0.5},{"$f":"'Bad Pitches'!$H$25","v":14},{"$f":"'Bad Pitches'!$F$8","v":3},"Y",{"$f":"'Bad Pitches'!$H$26","v":7},{"$f":"'Bad Pitches'!$H$27","v":14},{"$f":"'Bad Pitches'!$D$28","v":"f"}]
[56,{"$f":"'Ghetto Bombers'!$A$33","v":6},{"$f":"'Ghetto Bombers'!$D$1","v":"Ghetto Bombers"},{"$f":"'Ghetto Bombers'!$D$33","v":"JoJo"},{"$f":"'Ghetto Bombers'!$D$34","v":"Carlson"},{"$f":"'Ghetto Bombers'!$H$36","v":0.5},{"$f":"'Ghetto Bombers'!$H$33","v":10},{"$f":"'Ghetto Bombers'!$F$8","v":4},"Y",{"$f":"'Ghetto Bombers'!$H$34","v":5},{"$f":"'Ghetto Bombers'!$H$35","v":10},{"$f":"'Ghetto Bombers'!$D$36","v":"f"}]
[60,{"$f":"'Ghetto Bombers'!$A$49","v":10},{"$f":"'Ghetto Bombers'!$D$1","v":"Ghetto Bombers"},{"$f":"'Ghetto Bombers'!$D$49","v":"Heidi"},{"$f":"'Ghetto Bombers'!$D$50","v":"Taylor"},{"$f":"'Ghetto Bombers'!$H$52","v":0.46666666666666667},{"$f":"'Ghetto Bombers'!$H$49","v":15},{"$f":"'Ghetto Bombers'!$F$8","v":4},"Y",{"$f":"'Ghetto Bombers'!$H$50","v":7},{"$f":"'Ghetto Bombers'!$H$51","v":16},{"$f":"'Ghetto Bombers'!$D$52","v":"f"}]
[79,{"$f":"'Thunder Ducks'!$A$25","v":4},{"$f":"'Thunder Ducks'!$D$1","v":"Thunder Ducks"},{"$f":"'Thunder Ducks'!$D$25","v":"Jennie"},{"$f":"'Thunder Ducks'!$D$26","v":"Anderson"},{"$f":"'Thunder Ducks'!$H$28","v":0.46153846153846156},{"$f":"'Thunder Ducks'!$H$25","v":13},{"$f":"'Thunder Ducks'!$F$8","v":4},"Y",{"$f":"'Thunder Ducks'!$H$26","v":6},{"$f":"'Thunder Ducks'!$H$27","v":15},{"$f":"'Thunder Ducks'!$D$28","v":"f"}]
[27,{"$f":"BCBC!$A$17","v":2},{"$f":"BCBC!$D$1","v":"BCBC"},{"$f":"BCBC!$D$17","v":"Alex"},{"$f":"BCBC!$D$18","v":"Ferrel"},{"$f":"BCBC!$H$20","v":0.45454545454545453},{"$f":"BCBC!$H$17","v":11},{"$f":"BCBC!$F$8","v":4},"Y",{"$f":"BCBC!$H$18","v":5},{"$f":"BCBC!$H$19","v":11},{"$f":"BCBC!$D$20","v":"f"}]
[31,{"$f":"BCBC!$A$33","v":6},{"$f":"BCBC!$D$1","v":"BCBC"},{"$f":"BCBC!$D$33","v":"Tiff"},{"$f":"BCBC!$D$34","v":"Morton"},{"$f":"BCBC!$H$36","v":0.4},{"$f":"BCBC!$H$33","v":10},{"$f":"BCBC!$F$8","v":4},"Y",{"$f":"BCBC!$H$34","v":4},{"$f":"BCBC!$H$35","v":11},{"$f":"BCBC!$D$36","v":"f"}]
[29,{"$f":"BCBC!$A$25","v":4},{"$f":"BCBC!$D$1","v":"BCBC"},{"$f":"BCBC!$D$25","v":"Casey"},{"$f":"BCBC!$D$26","v":"Velarde"},{"$f":"BCBC!$H$28","v":0.36363636363636365},{"$f":"BCBC!$H$25","v":11},{"$f":"BCBC!$F$8","v":4},"Y",{"$f":"BCBC!$H$26","v":4},{"$f":"BCBC!$H$27","v":12},{"$f":"BCBC!$D$28","v":"f"}]
[77,{"$f":"'Thunder Ducks'!$A$17","v":2},{"$f":"'Thunder Ducks'!$D$1","v":"Thunder Ducks"},{"$f":"'Thunder Ducks'!$D$17","v":"Josie"},{"$f":"'Thunder Ducks'!$D$18","v":"Harris"},{"$f":"'Thunder Ducks'!$H$20","v":0.33333333333333331},{"$f":"'Thunder Ducks'!$H$17","v":12},{"$f":"'Thunder Ducks'!$F$8","v":4},"Y",{"$f":"'Thunder Ducks'!$H$18","v":4},{"$f":"'Thunder Ducks'!$H$19","v":14},{"$f":"'Thunder Ducks'!$D$20","v":"f"}]
[2,{"$f":"'Bad Pitches'!$A$17","v":2},{"$f":"'Bad Pitches'!$D$1","v":"Bad Pitches"},{"$f":"'Bad Pitches'!$D$17","v":"Paige"},{"$f":"'Bad Pitches'!$D$18","v":"Reynolds"},{"$f":"'Bad Pitches'!$H$20","v":0.3},{"$f":"'Bad Pitches'!$H$17","v":10},{"$f":"'Bad Pitches'!$F$8","v":3},"Y",{"$f":"'Bad Pitches'!$H$18","v":3},{"$f":"'Bad Pitches'!$H$19","v":10},{"$f":"'Bad Pitches'!$D$20","v":"f"}]
[33,{"$f":"BCBC!$A$41","v":8},{"$f":"BCBC!$D$1","v":"BCBC"},{"$f":"BCBC!$D$41","v":"Maree"},{"$f":"BCBC!$D$42","v":"Achermann"},{"$f":"BCBC!$H$44","v":0.15384615384615385},{"$f":"BCBC!$H$41","v":13},{"$f":"BCBC!$F$8","v":4},"Y",{"$f":"BCBC!$H$42","v":2},{"$f":"BCBC!$H$43","v":13},{"$f":"BCBC!$D$44","v":"f"}]
[37,{"$f":"BCBC!$A$57","v":12},{"$f":"BCBC!$D$1","v":"BCBC"},{"$f":"BCBC!$D$57","v":"Mel"},{"$f":"BCBC!$D$58","v":"Maile"},{"$f":"BCBC!$H$60","v":9.0909090909090912E-2},{"$f":"BCBC!$H$57","v":11},{"$f":"BCBC!$F$8","v":4},"Y",{"$f":"BCBC!$H$58","v":1},{"$f":"BCBC!$H$59","v":12},{"$f":"BCBC!$D$60","v":"f"}]
[206,{"$f":"'YY Team'!$A$33","v":6},{"$f":"'YY Team'!$D$1","v":"YY Team"},{"$f":"'YY Team'!$D$33","v":"Britt"},{"$f":"'YY Team'!$D$34","v":"Call"},{"$f":"'YY Team'!$H$36","v":0},{"$f":"'YY Team'!$H$33","v":63},{"$f":"'YY Team'!$F$8","v":7},"Y",{"$f":"'YY Team'!$H$34","v":0},{"$f":"'YY Team'!$H$35","v":63},{"$f":"'YY Team'!$D$36","v":"f"}]
[137,{"$f":"'XXX Team'!$A$57","v":12},{"$f":"'XXX Team'!$D$1","v":"XXX Team"},{"$f":"'XXX Team'!$D$57","v":"Anna"},{"$f":"'XXX Team'!$D$58","v":"Hall"},{"$f":"'XXX Team'!$H$60","v":0},{"$f":"'XXX Team'!$H$57","v":63},{"$f":"'XXX Team'!$F$8","v":7},"Y",{"$f":"'XXX Team'!$H$58","v":0},{"$f":"'XXX Team'!$H$59","v":63},{"$f":"'XXX Team'!$D$60","v":"f"}]
[135,{"$f":"'XXX Team'!$A$49","v":10},{"$f":"'XXX Team'!$D$1","v":"XXX Team"},{"$f":"'XXX Team'!$D$49","v":"Chandra"},{"$f":"'XXX Team'!$D$50","v":"Cruz"},{"$f":"'XXX Team'!$H$52","v":0},{"$f":"'XXX Team'!$H$49","v":63},{"$f":"'XXX Team'!$F$8","v":7},"Y",{"$f":"'XXX Team'!$H$50","v":0},{"$f":"'XXX Team'!$H$51","v":63},{"$f":"'XXX Team'!$D$52","v":"f"}]
[104,{"$f":"'X Team'!$A$25","v":4},{"$f":"'X Team'!$D$1","v":"X Team"},{"$f":"'X Team'!$D$25","v":"Chelsea"},{"$f":"'X Team'!$D$26","v":"LdBaron"},{"$f":"'X Team'!$H$28","v":0},{"$f":"'X Team'!$H$25","v":63},{"$f":"'X Team'!$F$8","v":7},"Y",{"$f":"'X Team'!$H$26","v":0},{"$f":"'X Team'!$H$27","v":63},{"$f":"'X Team'!$D$28","v":"f"}]
[102,{"$f":"'X Team'!$A$17","v":2},{"$f":"'X Team'!$D$1","v":"X Team"},{"$f":"'X Team'!$D$17","v":"Paige"},{"$f":"'X Team'!$D$18","v":"Jackman"},{"$f":"'X Team'!$H$20","v":0},{"$f":"'X Team'!$H$17","v":63},{"$f":"'X Team'!$F$8","v":7},"Y",{"$f":"'X Team'!$H$18","v":0},{"$f":"'X Team'!$H$19","v":63},{"$f":"'X Team'!$D$20","v":"f"}]
[202,{"$f":"'YY Team'!$A$17","v":2},{"$f":"'YY Team'!$D$1","v":"YY Team"},{"$f":"'YY Team'!$D$17","v":"Tasha"},{"$f":"'YY Team'!$D$18","v":"Arnold"},{"$f":"'YY Team'!$H$20","v":0},{"$f":"'YY Team'!$H$17","v":63},{"$f":"'YY Team'!$F$8","v":7},"Y",{"$f":"'YY Team'!$H$18","v":0},{"$f":"'YY Team'!$H$19","v":63},{"$f":"'YY Team'!$D$20","v":"f"}]
[129,{"$f":"'XXX Team'!$A$25","v":4},{"$f":"'XXX Team'!$D$1","v":"XXX Team"},{"$f":"'XXX Team'!$D$25","v":"Gimmie"},{"$f":"'XXX Team'!$D$26","v":"Murphy"},{"$f":"'XXX Team'!$H$28","v":0},{"$f":"'XXX Team'!$H$25","v":63},{"$f":"'XXX Team'!$F$8","v":7},"Y",{"$f":"'XXX Team'!$H$26","v":0},{"$f":"'XXX Team'!$H$27","v":63},{"$f":"'XXX Team'!$D$28","v":"f"}]
[127,{"$f":"'XXX Team'!$A$17","v":2},{"$f":"'XXX Team'!$D$1","v":"XXX Team"},{"$f":"'XXX Team'!$D$17","v":"Jenn"},{"$f":"'XXX Team'!$D$18","v":"Hall"},{"$f":"'XXX Team'!$H$20","v":0},{"$f":"'XXX Team'!$H$17","v":63},{"$f":"'XXX Team'!$F$8","v":7},"Y",{"$f":"'XXX Team'!$H$18","v":0},{"$f":"'XXX Team'!$H$19","v":63},{"$f":"'XXX Team'!$D$20","v":"f"}]
[204,{"$f":"'YY Team'!$A$25","v":4},{"$f":"'YY Team'!$D$1","v":"YY Team"},{"$f":"'YY Team'!$D$25","v":"Josie"},{"$f":"'YY Team'!$D$26","v":"Harris"},{"$f":"'YY Team'!$H$28","v":0},{"$f":"'YY Team'!$H$25","v":63},{"$f":"'YY Team'!$F$8","v":7},"Y",{"$f":"'YY Team'!$H$26","v":0},{"$f":"'YY Team'!$H$27","v":63},{"$f":"'YY Team'!$D$28","v":"f"}]
[108,{"$f":"'X Team'!$A$41","v":8},{"$f":"'X Team'!$D$1","v":"X Team"},{"$f":"'X Team'!$D$41","v":"Cassi"},{"$f":"'X Team'!$D$42","v":"Kendzior"},{"$f":"'X Team'!$H$44","v":0},{"$f":"'X Team'!$H$41","v":63},{"$f":"'X Team'!$F$8","v":7},"Y",{"$f":"'X Team'!$H$42","v":0},{"$f":"'X Team'!$H$43","v":63},{"$f":"'X Team'!$D$44","v":"f"}]
[131,{"$f":"'XXX Team'!$A$33","v":6},{"$f":"'XXX Team'!$D$1","v":"XXX Team"},{"$f":"'XXX Team'!$D$33","v":"Deanndra"},{"$f":"'XXX Team'!$D$34","v":"Billie"},{"$f":"'XXX Team'!$H$36","v":0},{"$f":"'XXX Team'!$H$33","v":63},{"$f":"'XXX Team'!$F$8","v":7},"Y",{"$f":"'XXX Team'!$H$34","v":0},{"$f":"'XXX Team'!$H$35","v":63},{"$f":"'XXX Team'!$D$36","v":"f"}]
[208,{"$f":"'YY Team'!$A$41","v":8},{"$f":"'YY Team'!$D$1","v":"YY Team"},{"$f":"'YY Team'!$D$41","v":"Lindsay"},{"$f":"'YY Team'!$D$42","v":"Pennington"},{"$f":"'YY Team'!$H$44","v":0},{"$f":"'YY Team'!$H$41","v":63},{"$f":"'YY Team'!$F$8","v":7},"Y",{"$f":"'YY Team'!$H$42","v":0},{"$f":"'YY Team'!$H$43","v":63},{"$f":"'YY Team'!$D$44","v":"f"}]
[133,{"$f":"'XXX Team'!$A$41","v":8},{"$f":"'XXX Team'!$D$1","v":"XXX Team"},{"$f":"'XXX Team'!$D$41","v":"Emma"},{"$f":"'XXX Team'!$D$42","v":"Hall"},{"$f":"'XXX Team'!$H$44","v":0},{"$f":"'XXX Team'!$H$41","v":63},{"$f":"'XXX Team'!$F$8","v":7},"Y",{"$f":"'XXX Team'!$H$42","v":0},{"$f":"'XXX Team'!$H$43","v":63},{"$f":"'XXX Team'!$D$44","v":"f"}]
[106,{"$f":"'X Team'!$A$33","v":6},{"$f":"'X Team'!$D$1","v":"X Team"},{"$f":"'X Team'!$D$33","v":"Jo"},{"$f":"'X Team'!$D$34","v":"Cruz"},{"$f":"'X Team'!$H$36","v":0},{"$f":"'X Team'!$H$33","v":63},{"$f":"'X Team'!$F$8","v":7},"Y",{"$f":"'X Team'!$H$34","v":0},{"$f":"'X Team'!$H$35","v":63},{"$f":"'X Team'!$D$36","v":"f"}]
[184,{"$f":"'XX Team'!$A$45","v":9},{"$f":"'XX Team'!$D$1","v":"XX Team"},{"$f":"'XX Team'!$D$45","v":"Nancy"},{"$f":"'XX Team'!$D$46","v":"Lowe"},{"$f":"'XX Team'!$H$48","v":0},{"$f":"'XX Team'!$H$45","v":63},{"$f":"'XX Team'!$F$8","v":6},"Y",{"$f":"'XX Team'!$H$46","v":0},{"$f":"'XX Team'!$H$47","v":63},{"$f":"'XX Team'!$D$48","v":"f"}]
[180,{"$f":"'XX Team'!$A$29","v":5},{"$f":"'XX Team'!$D$1","v":"XX Team"},{"$f":"'XX Team'!$D$29","v":"Toni"},{"$f":"'XX Team'!$D$30","v":"Wall"},{"$f":"'XX Team'!$H$32","v":0},{"$f":"'XX Team'!$H$29","v":63},{"$f":"'XX Team'!$F$8","v":6},"Y",{"$f":"'XX Team'!$H$30","v":0},{"$f":"'XX Team'!$H$31","v":63},{"$f":"'XX Team'!$D$32","v":"f"}]
[178,{"$f":"'XX Team'!$A$21","v":3},{"$f":"'XX Team'!$D$1","v":"XX Team"},{"$f":"'XX Team'!$D$21","v":"Mary"},{"$f":"'XX Team'!$D$22","v":"Childs"},{"$f":"'XX Team'!$H$24","v":0},{"$f":"'XX Team'!$H$21","v":63},{"$f":"'XX Team'!$F$8","v":6},"Y",{"$f":"'XX Team'!$H$22","v":0},{"$f":"'XX Team'!$H$23","v":63},{"$f":"'XX Team'!$D$24","v":"f"}]
[176,{"$f":"'XX Team'!$A$13","v":1},{"$f":"'XX Team'!$D$1","v":"XX Team"},{"$f":"'XX Team'!$D$13","v":"Francis"},{"$f":"'XX Team'!$D$14","v":"Brown"},{"$f":"'XX Team'!$H$16","v":0},{"$f":"'XX Team'!$H$13","v":63},{"$f":"'XX Team'!$F$8","v":6},"Y",{"$f":"'XX Team'!$H$14","v":0},{"$f":"'XX Team'!$H$15","v":63},{"$f":"'XX Team'!$D$16","v":"f"}]
[182,{"$f":"'XX Team'!$A$37","v":7},{"$f":"'XX Team'!$D$1","v":"XX Team"},{"$f":"'XX Team'!$D$37","v":"Shela"},{"$f":"'XX Team'!$D$38","v":"Anderson"},{"$f":"'XX Team'!$H$40","v":0},{"$f":"'XX Team'!$H$37","v":63},{"$f":"'XX Team'!$F$8","v":6},"Y",{"$f":"'XX Team'!$H$38","v":0},{"$f":"'XX Team'!$H$39","v":63},{"$f":"'XX Team'!$D$40","v":"f"}]
[110,{"$f":"'X Team'!$A$49","v":10},{"$f":"'X Team'!$D$1","v":"X Team"},{"$f":"'X Team'!$D$49","v":"Shae Lee"},{"$f":"'X Team'!$D$50","v":"Pearson"},{"$f":"'X Team'!$H$52","v":0},{"$f":"'X Team'!$H$49","v":63},{"$f":"'X Team'!$F$8","v":7},{"$f":"IF(K98<(H98*2.5),\"N\",\"Y\")","v":"Y"},{"$f":"'X Team'!$H$50","v":0},{"$f":"'X Team'!$H$51","v":63},{"$f":"'X Team'!$D$52","v":"f"}]
[211,{"$f":"'YY Team'!$A$53","v":11},{"$f":"'YY Team'!$D$1","v":"YY Team"},{"$f":"'YY Team'!$D$53","v":"Jennie"},{"$f":"'YY Team'!$D$54","v":"Anderson"},{"$f":"'YY Team'!$H$56","v":0},{"$f":"'YY Team'!$H$53","v":63},{"$f":"'YY Team'!$F$8","v":7},"Y",{"$f":"'YY Team'!$H$54","v":0},{"$f":"'YY Team'!$H$55","v":63},{"$f":"'YY Team'!$D$56","v":"f"}]
[210,{"$f":"'YY Team'!$A$49","v":10},{"$f":"'YY Team'!$D$1","v":"YY Team"},{"$f":"'YY Team'!$D$49","v":"Taylor"},{"$f":"'YY Team'!$D$50","v":"McCallum"},{"$f":"'YY Team'!$H$52","v":0},{"$f":"'YY Team'!$H$49","v":63},{"$f":"'YY Team'!$F$8","v":7},"Y",{"$f":"'YY Team'!$H$50","v":0},{"$f":"'YY Team'!$H$51","v":63},{"$f":"'YY Team'!$D$52","v":"f"}]
[111,{"$f":"'X Team'!$A$53","v":11},{"$f":"'X Team'!$D$1","v":"X Team"},{"$f":"'X Team'!$D$53","v":"Jo"},{"$f":"'X Team'!$D$54","v":"Blake"},{"$f":"'X Team'!$H$56","v":0},{"$f":"'X Team'!$H$53","v":63},{"$f":"'X Team'!$F$8","v":7},"Y",{"$f":"'X Team'!$H$54","v":0},{"$f":"'X Team'!$H$55","v":63},{"$f":"'X Team'!$D$56","v":"f"}]
[113,{"$f":"'X Team'!$A$61","v":13},{"$f":"'X Team'!$D$1","v":"X Team"},{"$f":"'X Team'!$D$61","v":"Amanda "},{"$f":"'X Team'!$D$62","v":"Kenzior"},{"$f":"'X Team'!$H$64","v":0},{"$f":"'X Team'!$H$61","v":63},{"$f":"'X Team'!$F$8","v":7},"Y",{"$f":"'X Team'!$H$62","v":0},{"$f":"'X Team'!$H$63","v":63},{"$f":"'X Team'!$D$64","v":"f"}]
[216,{"$f":"'YY Team'!$A$73","v":16},{"$f":"'YY Team'!$D$1","v":"YY Team"},{"$f":"'YY Team'!$D$73","v":0},{"$f":"'YY Team'!$D$74","v":0},{"$f":"'YY Team'!$H$76","v":""},{"$f":"'YY Team'!$H$73","v":0},{"$f":"'YY Team'!$F$8","v":7},"N",{"$f":"'YY Team'!$H$74","v":0},{"$f":"'YY Team'!$H$75","v":0},{"$f":"'YY Team'!$D$76","v":"f"}]
[214,{"$f":"'YY Team'!$A$65","v":14},{"$f":"'YY Team'!$D$1","v":"YY Team"},{"$f":"'YY Team'!$D$65","v":0},{"$f":"'YY Team'!$D$66","v":0},{"$f":"'YY Team'!$H$68","v":""},{"$f":"'YY Team'!$H$65","v":0},{"$f":"'YY Team'!$F$8","v":7},"N",{"$f":"'YY Team'!$H$66","v":0},{"$f":"'YY Team'!$H$67","v":0},{"$f":"'YY Team'!$D$68","v":"f"}]
[186,{"$f":"'XX Team'!$A$53","v":11},{"$f":"'XX Team'!$D$1","v":"XX Team"},{"$f":"'XX Team'!$D$53","v":0},{"$f":"'XX Team'!$D$54","v":0},{"$f":"'XX Team'!$H$56","v":""},{"$f":"'XX Team'!$H$53","v":0},{"$f":"'XX Team'!$F$8","v":6},"N",{"$f":"'XX Team'!$H$54","v":0},{"$f":"'XX Team'!$H$55","v":0},{"$f":"'XX Team'!$D$56","v":"f"}]
[212,{"$f":"'YY Team'!$A$57","v":12},{"$f":"'YY Team'!$D$1","v":"YY Team"},{"$f":"'YY Team'!$D$57","v":0},{"$f":"'YY Team'!$D$58","v":0},{"$f":"'YY Team'!$H$60","v":""},{"$f":"'YY Team'!$H$57","v":0},{"$f":"'YY Team'!$F$8","v":7},"N",{"$f":"'YY Team'!$H$58","v":0},{"$f":"'YY Team'!$H$59","v":0},{"$f":"'YY Team'!$D$60","v":"f"}]
[21,{"$f":"'Bad Pitches'!$A$93","v":21},{"$f":"'Bad Pitches'!$D$1","v":"Bad Pitches"},{"$f":"'Bad Pitches'!$D$93","v":0},{"$f":"'Bad Pitches'!$D$94","v":0},{"$f":"'Bad Pitches'!$H$96","v":""},{"$f":"'Bad Pitches'!$H$93","v":0},{"$f":"'Bad Pitches'!$F$8","v":3},"N",{"$f":"'Bad Pitches'!$H$94","v":0},{"$f":"'Bad Pitches'!$H$95","v":0},{"$f":"'Bad Pitches'!$D$96","v":"f"}]
[22,{"$f":"'Bad Pitches'!$A$97","v":22},{"$f":"'Bad Pitches'!$D$1","v":"Bad Pitches"},{"$f":"'Bad Pitches'!$D$97","v":0},{"$f":"'Bad Pitches'!$D$98","v":0},{"$f":"'Bad Pitches'!$H$100","v":""},{"$f":"'Bad Pitches'!$H$97","v":0},{"$f":"'Bad Pitches'!$F$8","v":3},"N",{"$f":"'Bad Pitches'!$H$98","v":0},{"$f":"'Bad Pitches'!$H$99","v":0},{"$f":"'Bad Pitches'!$D$100","v":"f"}]
[23,{"$f":"'Bad Pitches'!$A$101","v":23},{"$f":"'Bad Pitches'!$D$1","v":"Bad Pitches"},{"$f":"'Bad Pitches'!$D$101","v":0},{"$f":"'Bad Pitches'!$D$102","v":0},{"$f":"'Bad Pitches'!$H$104","v":""},{"$f":"'Bad Pitches'!$H$101","v":0},{"$f":"'Bad Pitches'!$F$8","v":3},"N",{"$f":"'Bad Pitches'!$H$102","v":0},{"$f":"'Bad Pitches'!$H$103","v":0},{"$f":"'Bad Pitches'!$D$104","v":"f"}]
[24,{"$f":"'Bad Pitches'!$A$105","v":24},{"$f":"'Bad Pitches'!$D$1","v":"Bad Pitches"},{"$f":"'Bad Pitches'!$D$105","v":0},{"$f":"'Bad Pitches'!$D$106","v":0},{"$f":"'Bad Pitches'!$H$108","v":""},{"$f":"'Bad Pitches'!$H$105","v":0},{"$f":"'Bad Pitches'!$F$8","v":3},"N",{"$f":"'Bad Pitches'!$H$106","v":0},{"$f":"'Bad Pitches'!$H$107","v":0},{"$f":"'Bad Pitches'!$D$108","v":"f"}]
[25,{"$f":"'Bad Pitches'!$A$109","v":25},{"$f":"'Bad Pitches'!$D$1","v":"Bad Pitches"},{"$f":"'Bad Pitches'!$D$109","v":0},{"$f":"'Bad Pitches'!$D$110","v":0},{"$f":"'Bad Pitches'!$H$112","v":""},{"$f":"'Bad Pitches'!$H$109","v":0},{"$f":"'Bad Pitches'!$F$8","v":3},"N",{"$f":"'Bad Pitches'!$H$110","v":0},{"$f":"'Bad Pitches'!$H$111","v":0},{"$f":"'Bad Pitches'!$D$112","v":"f"}]
[45,{"$f":"BCBC!$A$89","v":20},{"$f":"BCBC!$D$1","v":"BCBC"},{"$f":"BCBC!$D$89","v":0},{"$f":"BCBC!$D$90","v":0},{"$f":"BCBC!$H$92","v":""},{"$f":"BCBC!$H$89","v":0},{"$f":"BCBC!$F$8","v":4},"N",{"$f":"BCBC!$H$90","v":0},{"$f":"BCBC!$H$91","v":0},{"$f":"BCBC!$D$92","v":"f"}]
[46,{"$f":"BCBC!$A$93","v":21},{"$f":"BCBC!$D$1","v":"BCBC"},{"$f":"BCBC!$D$93","v":0},{"$f":"BCBC!$D$94","v":0},{"$f":"BCBC!$H$96","v":""},{"$f":"BCBC!$H$93","v":0},{"$f":"BCBC!$F$8","v":4},"N",{"$f":"BCBC!$H$94","v":0},{"$f":"BCBC!$H$95","v":0},{"$f":"BCBC!$D$96","v":"f"}]
[47,{"$f":"BCBC!$A$97","v":22},{"$f":"BCBC!$D$1","v":"BCBC"},{"$f":"BCBC!$D$97","v":0},{"$f":"BCBC!$D$98","v":0},{"$f":"BCBC!$H$100","v":""},{"$f":"BCBC!$H$97","v":0},{"$f":"BCBC!$F$8","v":4},"N",{"$f":"BCBC!$H$98","v":0},{"$f":"BCBC!$H$99","v":0},{"$f":"BCBC!$D$100","v":"f"}]
[48,{"$f":"BCBC!$A$101","v":23},{"$f":"BCBC!$D$1","v":"BCBC"},{"$f":"BCBC!$D$101","v":0},{"$f":"BCBC!$D$102","v":0},{"$f":"BCBC!$H$104","v":""},{"$f":"BCBC!$H$101","v":0},{"$f":"BCBC!$F$8","v":4},"N",{"$f":"BCBC!$H$102","v":0},{"$f":"BCBC!$H$103","v":0},{"$f":"BCBC!$D$104","v":"f"}]
[49,{"$f":"BCBC!$A$105","v":24},{"$f":"BCBC!$D$1","v":"BCBC"},{"$f":"BCBC!$D$105","v":0},{"$f":"BCBC!$D$106","v":0},{"$f":"BCBC!$H$108","v":""},{"$f":"BCBC!$H$105","v":0},{"$f":"BCBC!$F$8","v":4},"N",{"$f":"BCBC!$H$106","v":0},{"$f":"BCBC!$H$107","v":0},{"$f":"BCBC!$D$108","v":"f"}]
[50,{"$f":"BCBC!$A$109","v":25},{"$f":"BCBC!$D$1","v":"BCBC"},{"$f":"BCBC!$D$109","v":0},{"$f":"BCBC!$D$110","v":0},{"$f":"BCBC!$H$112","v":""},{"$f":"BCBC!$H$109","v":0},{"$f":"BCBC!$F$8","v":4},"N",{"$f":"BCBC!$H$110","v":0},{"$f":"BCBC!$H$111","v":0},{"$f":"BCBC!$D$112","v":"f"}]
[69,{"$f":"'Ghetto Bombers'!$A$85","v":19},{"$f":"'Ghetto Bombers'!$D$1","v":"Ghetto Bombers"},{"$f":"'Ghetto Bombers'!$D$85","v":0},{"$f":"'Ghetto Bombers'!$D$86","v":0},{"$f":"'Ghetto Bombers'!$H$88","v":""},{"$f":"'Ghetto Bombers'!$H$85","v":0},{"$f":"'Ghetto Bombers'!$F$8","v":4},"N",{"$f":"'Ghetto Bombers'!$H$86","v":0},{"$f":"'Ghetto Bombers'!$H$87","v":0},{"$f":"'Ghetto Bombers'!$D$88","v":"f"}]
[70,{"$f":"'Ghetto Bombers'!$A$89","v":20},{"$f":"'Ghetto Bombers'!$D$1","v":"Ghetto Bombers"},{"$f":"'Ghetto Bombers'!$D$89","v":0},{"$f":"'Ghetto Bombers'!$D$90","v":0},{"$f":"'Ghetto Bombers'!$H$92","v":""},{"$f":"'Ghetto Bombers'!$H$89","v":0},{"$f":"'Ghetto Bombers'!$F$8","v":4},"N",{"$f":"'Ghetto Bombers'!$H$90","v":0},{"$f":"'Ghetto Bombers'!$H$91","v":0},{"$f":"'Ghetto Bombers'!$D$92","v":"f"}]
[71,{"$f":"'Ghetto Bombers'!$A$93","v":21},{"$f":"'Ghetto Bombers'!$D$1","v":"Ghetto Bombers"},{"$f":"'Ghetto Bombers'!$D$93","v":0},{"$f":"'Ghetto Bombers'!$D$94","v":0},{"$f":"'Ghetto Bombers'!$H$96","v":""},{"$f":"'Ghetto Bombers'!$H$93","v":0},{"$f":"'Ghetto Bombers'!$F$8","v":4},"N",{"$f":"'Ghetto Bombers'!$H$94","v":0},{"$f":"'Ghetto Bombers'!$H$95","v":0},{"$f":"'Ghetto Bombers'!$D$96","v":"f"}]
[72,{"$f":"'Ghetto Bombers'!$A$97","v":22},{"$f":"'Ghetto Bombers'!$D$1","v":"Ghetto Bombers"},{"$f":"'Ghetto Bombers'!$D$97","v":0},{"$f":"'Ghetto Bombers'!$D$98","v":0},{"$f":"'Ghetto Bombers'!$H$100","v":""},{"$f":"'Ghetto Bombers'!$H$97","v":0},{"$f":"'Ghetto Bombers'!$F$8","v":4},"N",{"$f":"'Ghetto Bombers'!$H$98","v":0},{"$f":"'Ghetto Bombers'!$H$99","v":0},{"$f":"'Ghetto Bombers'!$D$100","v":"f"}]
[73,{"$f":"'Ghetto Bombers'!$A$101","v":23},{"$f":"'Ghetto Bombers'!$D$1","v":"Ghetto Bombers"},{"$f":"'Ghetto Bombers'!$D$101","v":0},{"$f":"'Ghetto Bombers'!$D$102","v":0},{"$f":"'Ghetto Bombers'!$H$104","v":""},{"$f":"'Ghetto Bombers'!$H$101","v":0},{"$f":"'Ghetto Bombers'!$F$8","v":4},"N",{"$f":"'Ghetto Bombers'!$H$102","v":0},{"$f":"'Ghetto Bombers'!$H$103","v":0},{"$f":"'Ghetto Bombers'!$D$104","v":"f"}]
[74,{"$f":"'Ghetto Bombers'!$A$105","v":24},{"$f":"'Ghetto Bombers'!$D$1","v":"Ghetto Bombers"},{"$f":"'Ghetto Bombers'!$D$105","v":0},{"$f":"'Ghetto Bombers'!$D$106","v":0},{"$f":"'Ghetto Bombers'!$H$108","v":""},{"$f":"'Ghetto Bombers'!$H$105","v":0},{"$f":"'Ghetto Bombers'!$F$8","v":4},"N",{"$f":"'Ghetto Bombers'!$H$106","v":0},{"$f":"'Ghetto Bombers'!$H$107","v":0},{"$f":"'Ghetto Bombers'!$D$108","v":"f"}]
[75,{"$f":"'Ghetto Bombers'!$A$109","v":25},{"$f":"'Ghetto Bombers'!$D$1","v":"Ghetto Bombers"},{"$f":"'Ghetto Bombers'!$D$109","v":0},{"$f":"'Ghetto Bombers'!$D$110","v":0},{"$f":"'Ghetto Bombers'!$H$112","v":""},{"$f":"'Ghetto Bombers'!$H$109","v":0},{"$f":"'Ghetto Bombers'!$F$8","v":4},"N",{"$f":"'Ghetto Bombers'!$H$110","v":0},{"$f":"'Ghetto Bombers'!$H$111","v":0},{"$f":"'Ghetto Bombers'!$D$112","v":"f"}]
[94,{"$f":"'Thunder Ducks'!$A$85","v":19},{"$f":"'Thunder Ducks'!$D$1","v":"Thunder Ducks"},{"$f":"'Thunder Ducks'!$D$85","v":0},{"$f":"'Thunder Ducks'!$D$86","v":0},{"$f":"'Thunder Ducks'!$H$88","v":""},{"$f":"'Thunder Ducks'!$H$85","v":0},{"$f":"'Thunder Ducks'!$F$8","v":4},"N",{"$f":"'Thunder Ducks'!$H$86","v":0},{"$f":"'Thunder Ducks'!$H$87","v":0},{"$f":"'Thunder Ducks'!$D$88","v":"f"}]
[95,{"$f":"'Thunder Ducks'!$A$89","v":20},{"$f":"'Thunder Ducks'!$D$1","v":"Thunder Ducks"},{"$f":"'Thunder Ducks'!$D$89","v":0},{"$f":"'Thunder Ducks'!$D$90","v":0},{"$f":"'Thunder Ducks'!$H$92","v":""},{"$f":"'Thunder Ducks'!$H$89","v":0},{"$f":"'Thunder Ducks'!$F$8","v":4},"N",{"$f":"'Thunder Ducks'!$H$90","v":0},{"$f":"'Thunder Ducks'!$H$91","v":0},{"$f":"'Thunder Ducks'!$D$92","v":"f"}]
[96,{"$f":"'Thunder Ducks'!$A$93","v":21},{"$f":"'Thunder Ducks'!$D$1","v":"Thunder Ducks"},{"$f":"'Thunder Ducks'!$D$93","v":0},{"$f":"'Thunder Ducks'!$D$94","v":0},{"$f":"'Thunder Ducks'!$H$96","v":""},{"$f":"'Thunder Ducks'!$H$93","v":0},{"$f":"'Thunder Ducks'!$F$8","v":4},"N",{"$f":"'Thunder Ducks'!$H$94","v":0},{"$f":"'Thunder Ducks'!$H$95","v":0},{"$f":"'Thunder Ducks'!$D$96","v":"f"}]
[97,{"$f":"'Thunder Ducks'!$A$97","v":22},{"$f":"'Thunder Ducks'!$D$1","v":"Thunder Ducks"},{"$f":"'Thunder Ducks'!$D$97","v":0},{"$f":"'Thunder Ducks'!$D$98","v":0},{"$f":"'Thunder Ducks'!$H$100","v":""},{"$f":"'Thunder Ducks'!$H$97","v":0},{"$f":"'Thunder Ducks'!$F$8","v":4},"N",{"$f":"'Thunder Ducks'!$H$98","v":0},{"$f":"'Thunder Ducks'!$H$99","v":0},{"$f":"'Thunder Ducks'!$D$100","v":"f"}]
[98,{"$f":"'Thunder Ducks'!$A$101","v":23},{"$f":"'Thunder Ducks'!$D$1","v":"Thunder Ducks"},{"$f":"'Thunder Ducks'!$D$101","v":0},{"$f":"'Thunder Ducks'!$D$102","v":0},{"$f":"'Thunder Ducks'!$H$104","v":""},{"$f":"'Thunder Ducks'!$H$101","v":0},{"$f":"'Thunder Ducks'!$F$8","v":4},"N",{"$f":"'Thunder Ducks'!$H$102","v":0},{"$f":"'Thunder Ducks'!$H$103","v":0},{"$f":"'Thunder Ducks'!$D$104","v":"f"}]
[99,{"$f":"'Thunder Ducks'!$A$105","v":24},{"$f":"'Thunder Ducks'!$D$1","v":"Thunder Ducks"},{"$f":"'Thunder Ducks'!$D$105","v":0},{"$f":"'Thunder Ducks'!$D$106","v":0},{"$f":"'Thunder Ducks'!$H$108","v":""},{"$f":"'Thunder Ducks'!$H$105","v":0},{"$f":"'Thunder Ducks'!$F$8","v":4},{"$f":"IF(K130<(H130*2.5),\"N\",\"Y\")","v":"N"},{"$f":"'Thunder Ducks'!$H$106","v":0},{"$f":"'Thunder Ducks'!$H$107","v":0},{"$f":"'Thunder Ducks'!$D$108","v":"f"}]
[100,{"$f":"'Thunder Ducks'!$A$109","v":25},{"$f":"'Thunder Ducks'!$D$1","v":"Thunder Ducks"},{"$f":"'Thunder Ducks'!$D$109","v":0},{"$f":"'Thunder Ducks'!$D$110","v":0},{"$f":"'Thunder Ducks'!$H$112","v":""},{"$f":"'Thunder Ducks'!$H$109","v":0},{"$f":"'Thunder Ducks'!$F$8","v":4},"N",{"$f":"'Thunder Ducks'!$H$110","v":0},{"$f":"'Thunder Ducks'!$H$111","v":0},{"$f":"'Thunder Ducks'!$D$112","v":"f"}]
[122,{"$f":"'X Team'!$A$97","v":22},{"$f":"'X Team'!$D$1","v":"X Team"},{"$f":"'X Team'!$D$97","v":0},{"$f":"'X Team'!$D$98","v":0},{"$f":"'X Team'!$H$100","v":""},{"$f":"'X Team'!$H$97","v":0},{"$f":"'X Team'!$F$8","v":7},"N",{"$f":"'X Team'!$H$98","v":0},{"$f":"'X Team'!$H$99","v":0},{"$f":"'X Team'!$D$100","v":"f"}]
[123,{"$f":"'X Team'!$A$101","v":23},{"$f":"'X Team'!$D$1","v":"X Team"},{"$f":"'X Team'!$D$101","v":0},{"$f":"'X Team'!$D$102","v":0},{"$f":"'X Team'!$H$104","v":""},{"$f":"'X Team'!$H$101","v":0},{"$f":"'X Team'!$F$8","v":7},"N",{"$f":"'X Team'!$H$102","v":0},{"$f":"'X Team'!$H$103","v":0},{"$f":"'X Team'!$D$104","v":"f"}]
[124,{"$f":"'X Team'!$A$105","v":24},{"$f":"'X Team'!$D$1","v":"X Team"},{"$f":"'X Team'!$D$105","v":0},{"$f":"'X Team'!$D$106","v":0},{"$f":"'X Team'!$H$108","v":""},{"$f":"'X Team'!$H$105","v":0},{"$f":"'X Team'!$F$8","v":7},"N",{"$f":"'X Team'!$H$106","v":0},{"$f":"'X Team'!$H$107","v":0},{"$f":"'X Team'!$D$108","v":"f"}]
[125,{"$f":"'X Team'!$A$109","v":25},{"$f":"'X Team'!$D$1","v":"X Team"},{"$f":"'X Team'!$D$109","v":0},{"$f":"'X Team'!$D$110","v":0},{"$f":"'X Team'!$H$112","v":""},{"$f":"'X Team'!$H$109","v":0},{"$f":"'X Team'!$F$8","v":7},"N",{"$f":"'X Team'!$H$110","v":0},{"$f":"'X Team'!$H$111","v":0},{"$f":"'X Team'!$D$112","v":"f"}]
[144,{"$f":"'XXX Team'!$A$85","v":19},{"$f":"'XXX Team'!$D$1","v":"XXX Team"},{"$f":"'XXX Team'!$D$85","v":0},{"$f":"'XXX Team'!$D$86","v":0},{"$f":"'XXX Team'!$H$88","v":""},{"$f":"'XXX Team'!$H$85","v":0},{"$f":"'XXX Team'!$F$8","v":7},"N",{"$f":"'XXX Team'!$H$86","v":0},{"$f":"'XXX Team'!$H$87","v":0},{"$f":"'XXX Team'!$D$88","v":"f"}]
[145,{"$f":"'XXX Team'!$A$89","v":20},{"$f":"'XXX Team'!$D$1","v":"XXX Team"},{"$f":"'XXX Team'!$D$89","v":0},{"$f":"'XXX Team'!$D$90","v":0},{"$f":"'XXX Team'!$H$92","v":""},{"$f":"'XXX Team'!$H$89","v":0},{"$f":"'XXX Team'!$F$8","v":7},"N",{"$f":"'XXX Team'!$H$90","v":0},{"$f":"'XXX Team'!$H$91","v":0},{"$f":"'XXX Team'!$D$92","v":"f"}]
[146,{"$f":"'XXX Team'!$A$93","v":21},{"$f":"'XXX Team'!$D$1","v":"XXX Team"},{"$f":"'XXX Team'!$D$93","v":0},{"$f":"'XXX Team'!$D$94","v":0},{"$f":"'XXX Team'!$H$96","v":""},{"$f":"'XXX Team'!$H$93","v":0},{"$f":"'XXX Team'!$F$8","v":7},"N",{"$f":"'XXX Team'!$H$94","v":0},{"$f":"'XXX Team'!$H$95","v":0},{"$f":"'XXX Team'!$D$96","v":"f"}]
[147,{"$f":"'XXX Team'!$A$97","v":22},{"$f":"'XXX Team'!$D$1","v":"XXX Team"},{"$f":"'XXX Team'!$D$97","v":0},{"$f":"'XXX Team'!$D$98","v":0},{"$f":"'XXX Team'!$H$100","v":""},{"$f":"'XXX Team'!$H$97","v":0},{"$f":"'XXX Team'!$F$8","v":7},"N",{"$f":"'XXX Team'!$H$98","v":0},{"$f":"'XXX Team'!$H$99","v":0},{"$f":"'XXX Team'!$D$100","v":"f"}]
[148,{"$f":"'XXX Team'!$A$101","v":23},{"$f":"'XXX Team'!$D$1","v":"XXX Team"},{"$f":"'XXX Team'!$D$101","v":0},{"$f":"'XXX Team'!$D$102","v":0},{"$f":"'XXX Team'!$H$104","v":""},{"$f":"'XXX Team'!$H$101","v":0},{"$f":"'XXX Team'!$F$8","v":7},"N",{"$f":"'XXX Team'!$H$102","v":0},{"$f":"'XXX Team'!$H$103","v":0},{"$f":"'XXX Team'!$D$104","v":"f"}]
[149,{"$f":"'XXX Team'!$A$105","v":24},{"$f":"'XXX Team'!$D$1","v":"XXX Team"},{"$f":"'XXX Team'!$D$105","v":0},{"$f":"'XXX Team'!$D$106","v":0},{"$f":"'XXX Team'!$H$108","v":""},{"$f":"'XXX Team'!$H$105","v":0},{"$f":"'XXX Team'!$F$8","v":7},"N",{"$f":"'XXX Team'!$H$106","v":0},{"$f":"'XXX Team'!$H$107","v":0},{"$f":"'XXX Team'!$D$108","v":"f"}]
[150,{"$f":"'XXX Team'!$A$109","v":25},{"$f":"'XXX Team'!$D$1","v":"XXX Team"},{"$f":"'XXX Team'!$D$109","v":0},{"$f":"'XXX Team'!$D$110","v":0},{"$f":"'XXX Team'!$H$112","v":""},{"$f":"'XXX Team'!$H$109","v":0},{"$f":"'XXX Team'!$F$8","v":7},"N",{"$f":"'XXX Team'!$H$110","v":0},{"$f":"'XXX Team'!$H$111","v":0},{"$f":"'XXX Team'!$D$112","v":"f"}]
[189,{"$f":"'XX Team'!$A$65","v":14},{"$f":"'XX Team'!$D$1","v":"XX Team"},{"$f":"'XX Team'!$D$65","v":0},{"$f":"'XX Team'!$D$66","v":0},{"$f":"'XX Team'!$H$68","v":""},{"$f":"'XX Team'!$H$65","v":0},{"$f":"'XX Team'!$F$8","v":6},"N",{"$f":"'XX Team'!$H$66","v":0},{"$f":"'XX Team'!$H$67","v":0},{"$f":"'XX Team'!$D$68","v":"f"}]
[190,{"$f":"'XX Team'!$A$69","v":15},{"$f":"'XX Team'!$D$1","v":"XX Team"},{"$f":"'XX Team'!$D$69","v":0},{"$f":"'XX Team'!$D$70","v":0},{"$f":"'XX Team'!$H$72","v":""},{"$f":"'XX Team'!$H$69","v":0},{"$f":"'XX Team'!$F$8","v":6},"N",{"$f":"'XX Team'!$H$70","v":0},{"$f":"'XX Team'!$H$71","v":0},{"$f":"'XX Team'!$D$72","v":"f"}]
[191,{"$f":"'XX Team'!$A$73","v":16},{"$f":"'XX Team'!$D$1","v":"XX Team"},{"$f":"'XX Team'!$D$73","v":0},{"$f":"'XX Team'!$D$74","v":0},{"$f":"'XX Team'!$H$76","v":""},{"$f":"'XX Team'!$H$73","v":0},{"$f":"'XX Team'!$F$8","v":6},"N",{"$f":"'XX Team'!$H$74","v":0},{"$f":"'XX Team'!$H$75","v":0},{"$f":"'XX Team'!$D$76","v":"f"}]
[192,{"$f":"'XX Team'!$A$77","v":17},{"$f":"'XX Team'!$D$1","v":"XX Team"},{"$f":"'XX Team'!$D$77","v":0},{"$f":"'XX Team'!$D$78","v":0},{"$f":"'XX Team'!$H$80","v":""},{"$f":"'XX Team'!$H$77","v":0},{"$f":"'XX Team'!$F$8","v":6},"N",{"$f":"'XX Team'!$H$78","v":0},{"$f":"'XX Team'!$H$79","v":0},{"$f":"'XX Team'!$D$80","v":"f"}]
[193,{"$f":"'XX Team'!$A$81","v":18},{"$f":"'XX Team'!$D$1","v":"XX Team"},{"$f":"'XX Team'!$D$81","v":0},{"$f":"'XX Team'!$D$82","v":0},{"$f":"'XX Team'!$H$84","v":""},{"$f":"'XX Team'!$H$81","v":0},{"$f":"'XX Team'!$F$8","v":6},"N",{"$f":"'XX Team'!$H$82","v":0},{"$f":"'XX Team'!$H$83","v":0},{"$f":"'XX Team'!$D$84","v":"f"}]
[194,{"$f":"'XX Team'!$A$85","v":19},{"$f":"'XX Team'!$D$1","v":"XX Team"},{"$f":"'XX Team'!$D$85","v":0},{"$f":"'XX Team'!$D$86","v":0},{"$f":"'XX Team'!$H$88","v":""},{"$f":"'XX Team'!$H$85","v":0},{"$f":"'XX Team'!$F$8","v":6},"N",{"$f":"'XX Team'!$H$86","v":0},{"$f":"'XX Team'!$H$87","v":0},{"$f":"'XX Team'!$D$88","v":"f"}]
[195,{"$f":"'XX Team'!$A$89","v":20},{"$f":"'XX Team'!$D$1","v":"XX Team"},{"$f":"'XX Team'!$D$89","v":0},{"$f":"'XX Team'!$D$90","v":0},{"$f":"'XX Team'!$H$92","v":""},{"$f":"'XX Team'!$H$89","v":0},{"$f":"'XX Team'!$F$8","v":6},"N",{"$f":"'XX Team'!$H$90","v":0},{"$f":"'XX Team'!$H$91","v":0},{"$f":"'XX Team'!$D$92","v":"f"}]
[196,{"$f":"'XX Team'!$A$93","v":21},{"$f":"'XX Team'!$D$1","v":"XX Team"},{"$f":"'XX Team'!$D$93","v":0},{"$f":"'XX Team'!$D$94","v":0},{"$f":"'XX Team'!$H$96","v":""},{"$f":"'XX Team'!$H$93","v":0},{"$f":"'XX Team'!$F$8","v":6},"N",{"$f":"'XX Team'!$H$94","v":0},{"$f":"'XX Team'!$H$95","v":0},{"$f":"'XX Team'!$D$96","v":"f"}]
[197,{"$f":"'XX Team'!$A$97","v":22},{"$f":"'XX Team'!$D$1","v":"XX Team"},{"$f":"'XX Team'!$D$97","v":0},{"$f":"'XX Team'!$D$98","v":0},{"$f":"'XX Team'!$H$100","v":""},{"$f":"'XX Team'!$H$97","v":0},{"$f":"'XX Team'!$F$8","v":6},"N",{"$f":"'XX Team'!$H$98","v":0},{"$f":"'XX Team'!$H$99","v":0},{"$f":"'XX Team'!$D$100","v":"f"}]
[198,{"$f":"'XX Team'!$A$101","v":23},{"$f":"'XX Team'!$D$1","v":"XX Team"},{"$f":"'XX Team'!$D$101","v":0},{"$f":"'XX Team'!$D$102","v":0},{"$f":"'XX Team'!$H$104","v":""},{"$f":"'XX Team'!$H$101","v":0},{"$f":"'XX Team'!$F$8","v":6},"N",{"$f":"'XX Team'!$H$102","v":0},{"$f":"'XX Team'!$H$103","v":0},{"$f":"'XX Team'!$D$104","v":"f"}]
[199,{"$f":"'XX Team'!$A$105","v":24},{"$f":"'XX Team'!$D$1","v":"XX Team"},{"$f":"'XX Team'!$D$105","v":0},{"$f":"'XX Team'!$D$106","v":0},{"$f":"'XX Team'!$H$108","v":""},{"$f":"'XX Team'!$H$105","v":0},{"$f":"'XX Team'!$F$8","v":6},"N",{"$f":"'XX Team'!$H$106","v":0},{"$f":"'XX Team'!$H$107","v":0},{"$f":"'XX Team'!$D$108","v":"f"}]
[200,{"$f":"'XX Team'!$A$109","v":25},{"$f":"'XX Team'!$D$1","v":"XX Team"},{"$f":"'XX Team'!$D$109","v":0},{"$f":"'XX Team'!$D$110","v":0},{"$f":"'XX Team'!$H$112","v":""},{"$f":"'XX Team'!$H$109","v":0},{"$f":"'XX Team'!$F$8","v":6},"N",{"$f":"'XX Team'!$H$110","v":0},{"$f":"'XX Team'!$H$111","v":0},{"$f":"'XX Team'!$D$112","v":"f"}]
[218,{"$f":"'YY Team'!$A$81","v":18},{"$f":"'YY Team'!$D$1","v":"YY Team"},{"$f":"'YY Team'!$D$81","v":0},{"$f":"'YY Team'!$D$82","v":0},{"$f":"'YY Team'!$H$84","v":""},{"$f":"'YY Team'!$H$81","v":0},{"$f":"'YY Team'!$F$8","v":7},"N",{"$f":"'YY Team'!$H$82","v":0},{"$f":"'YY Team'!$H$83","v":0},{"$f":"'YY Team'!$D$84","v":"f"}]
[219,{"$f":"'YY Team'!$A$85","v":19},{"$f":"'YY Team'!$D$1","v":"YY Team"},{"$f":"'YY Team'!$D$85","v":0},{"$f":"'YY Team'!$D$86","v":0},{"$f":"'YY Team'!$H$88","v":""},{"$f":"'YY Team'!$H$85","v":0},{"$f":"'YY Team'!$F$8","v":7},"N",{"$f":"'YY Team'!$H$86","v":0},{"$f":"'YY Team'!$H$87","v":0},{"$f":"'YY Team'!$D$88","v":"f"}]
[220,{"$f":"'YY Team'!$A$89","v":20},{"$f":"'YY Team'!$D$1","v":"YY Team"},{"$f":"'YY Team'!$D$89","v":0},{"$f":"'YY Team'!$D$90","v":0},{"$f":"'YY Team'!$H$92","v":""},{"$f":"'YY Team'!$H$89","v":0},{"$f":"'YY Team'!$F$8","v":7},"N",{"$f":"'YY Team'!$H$90","v":0},{"$f":"'YY Team'!$H$91","v":0},{"$f":"'YY Team'!$D$92","v":"f"}]
[221,{"$f":"'YY Team'!$A$93","v":21},{"$f":"'YY Team'!$D$1","v":"YY Team"},{"$f":"'YY Team'!$D$93","v":0},{"$f":"'YY Team'!$D$94","v":0},{"$f":"'YY Team'!$H$96","v":""},{"$f":"'YY Team'!$H$93","v":0},{"$f":"'YY Team'!$F$8","v":7},"N",{"$f":"'YY Team'!$H$94","v":0},{"$f":"'YY Team'!$H$95","v":0},{"$f":"'YY Team'!$D$96","v":"f"}]
[222,{"$f":"'YY Team'!$A$97","v":22},{"$f":"'YY Team'!$D$1","v":"YY Team"},{"$f":"'YY Team'!$D$97","v":0},{"$f":"'YY Team'!$D$98","v":0},{"$f":"'YY Team'!$H$100","v":""},{"$f":"'YY Team'!$H$97","v":0},{"$f":"'YY Team'!$F$8","v":7},"N",{"$f":"'YY Team'!$H$98","v":0},{"$f":"'YY Team'!$H$99","v":0},{"$f":"'YY Team'!$D$100","v":"f"}]
[223,{"$f":"'YY Team'!$A$101","v":23},{"$f":"'YY Team'!$D$1","v":"YY Team"},{"$f":"'YY Team'!$D$101","v":0},{"$f":"'YY Team'!$D$102","v":0},{"$f":"'YY Team'!$H$104","v":""},{"$f":"'YY Team'!$H$101","v":0},{"$f":"'YY Team'!$F$8","v":7},"N",{"$f":"'YY Team'!$H$102","v":0},{"$f":"'YY Team'!$H$103","v":0},{"$f":"'YY Team'!$D$104","v":"f"}]
[224,{"$f":"'YY Team'!$A$105","v":24},{"$f":"'YY Team'!$D$1","v":"YY Team"},{"$f":"'YY Team'!$D$105","v":0},{"$f":"'YY Team'!$D$106","v":0},{"$f":"'YY Team'!$H$108","v":""},{"$f":"'YY Team'!$H$105","v":0},{"$f":"'YY Team'!$F$8","v":7},"N",{"$f":"'YY Team'!$H$106","v":0},{"$f":"'YY Team'!$H$107","v":0},{"$f":"'YY Team'!$D$108","v":"f"}]
[225,{"$f":"'YY Team'!$A$109","v":25},{"$f":"'YY Team'!$D$1","v":"YY Team"},{"$f":"'YY Team'!$D$109","v":0},{"$f":"'YY Team'!$D$110","v":0},{"$f":"'YY Team'!$H$112","v":""},{"$f":"'YY Team'!$H$109","v":0},{"$f":"'YY Team'!$F$8","v":7},{"$f":"IF(K162<(H162*2.5),\"N\",\"Y\")","v":"N"},{"$f":"'YY Team'!$H$110","v":0},{"$f":"'YY Team'!$H$111","v":0},{"$f":"'YY Team'!$D$112","v":"f"}]
[187,{"$f":"'XX Team'!$A$57","v":12},{"$f":"'XX Team'!$D$1","v":"XX Team"},{"$f":"'XX Team'!$D$57","v":0},{"$f":"'XX Team'!$D$58","v":0},{"$f":"'XX Team'!$H$60","v":""},{"$f":"'XX Team'!$H$57","v":0},{"$f":"'XX Team'!$F$8","v":6},"N",{"$f":"'XX Team'!$H$58","v":0},{"$f":"'XX Team'!$H$59","v":0},{"$f":"'XX Team'!$D$60","v":"f"}]
[188,{"$f":"'XX Team'!$A$61","v":13},{"$f":"'XX Team'!$D$1","v":"XX Team"},{"$f":"'XX Team'!$D$61","v":0},{"$f":"'XX Team'!$D$62","v":0},{"$f":"'XX Team'!$H$64","v":""},{"$f":"'XX Team'!$H$61","v":0},{"$f":"'XX Team'!$F$8","v":6},"N",{"$f":"'XX Team'!$H$62","v":0},{"$f":"'XX Team'!$H$63","v":0},{"$f":"'XX Team'!$D$64","v":"f"}]
[213,{"$f":"'YY Team'!$A$61","v":13},{"$f":"'YY Team'!$D$1","v":"YY Team"},{"$f":"'YY Team'!$D$61","v":0},{"$f":"'YY Team'!$D$62","v":0},{"$f":"'YY Team'!$H$64","v":""},{"$f":"'YY Team'!$H$61","v":0},{"$f":"'YY Team'!$F$8","v":7},"N",{"$f":"'YY Team'!$H$62","v":0},{"$f":"'YY Team'!$H$63","v":0},{"$f":"'YY Team'!$D$64","v":"f"}]
[215,{"$f":"'YY Team'!$A$69","v":15},{"$f":"'YY Team'!$D$1","v":"YY Team"},{"$f":"'YY Team'!$D$69","v":0},{"$f":"'YY Team'!$D$70","v":0},{"$f":"'YY Team'!$H$72","v":""},{"$f":"'YY Team'!$H$69","v":0},{"$f":"'YY Team'!$F$8","v":7},"N",{"$f":"'YY Team'!$H$70","v":0},{"$f":"'YY Team'!$H$71","v":0},{"$f":"'YY Team'!$D$72","v":"f"}]
[44,{"$f":"BCBC!$A$85","v":19},{"$f":"BCBC!$D$1","v":"BCBC"},{"$f":"BCBC!$D$85","v":0},{"$f":"BCBC!$D$86","v":0},{"$f":"BCBC!$H$88","v":""},{"$f":"BCBC!$H$85","v":0},{"$f":"BCBC!$F$8","v":4},"N",{"$f":"BCBC!$H$86","v":0},{"$f":"BCBC!$H$87","v":0},{"$f":"BCBC!$D$88","v":"f"}]
[217,{"$f":"'YY Team'!$A$77","v":17},{"$f":"'YY Team'!$D$1","v":"YY Team"},{"$f":"'YY Team'!$D$77","v":0},{"$f":"'YY Team'!$D$78","v":0},{"$f":"'YY Team'!$H$80","v":""},{"$f":"'YY Team'!$H$77","v":0},{"$f":"'YY Team'!$F$8","v":7},"N",{"$f":"'YY Team'!$H$78","v":0},{"$f":"'YY Team'!$H$79","v":0},{"$f":"'YY Team'!$D$80","v":"f"}]
[118,{"$f":"'X Team'!$A$81","v":18},{"$f":"'X Team'!$D$1","v":"X Team"},{"$f":"'X Team'!$D$81","v":0},{"$f":"'X Team'!$D$82","v":0},{"$f":"'X Team'!$H$84","v":""},{"$f":"'X Team'!$H$81","v":0},{"$f":"'X Team'!$F$8","v":7},"N",{"$f":"'X Team'!$H$82","v":0},{"$f":"'X Team'!$H$83","v":0},{"$f":"'X Team'!$D$84","v":"f"}]
[114,{"$f":"'X Team'!$A$65","v":14},{"$f":"'X Team'!$D$1","v":"X Team"},{"$f":"'X Team'!$D$65","v":0},{"$f":"'X Team'!$D$66","v":0},{"$f":"'X Team'!$H$68","v":""},{"$f":"'X Team'!$H$65","v":0},{"$f":"'X Team'!$F$8","v":7},"N",{"$f":"'X Team'!$H$66","v":0},{"$f":"'X Team'!$H$67","v":0},{"$f":"'X Team'!$D$68","v":"f"}]
[67,{"$f":"'Ghetto Bombers'!$A$77","v":17},{"$f":"'Ghetto Bombers'!$D$1","v":"Ghetto Bombers"},{"$f":"'Ghetto Bombers'!$D$77","v":0},{"$f":"'Ghetto Bombers'!$D$78","v":0},{"$f":"'Ghetto Bombers'!$H$80","v":""},{"$f":"'Ghetto Bombers'!$H$77","v":0},{"$f":"'Ghetto Bombers'!$F$8","v":4},"N",{"$f":"'Ghetto Bombers'!$H$78","v":0},{"$f":"'Ghetto Bombers'!$H$79","v":0},{"$f":"'Ghetto Bombers'!$D$80","v":"f"}]
[142,{"$f":"'XXX Team'!$A$77","v":17},{"$f":"'XXX Team'!$D$1","v":"XXX Team"},{"$f":"'XXX Team'!$D$77","v":0},{"$f":"'XXX Team'!$D$78","v":0},{"$f":"'XXX Team'!$H$80","v":""},{"$f":"'XXX Team'!$H$77","v":0},{"$f":"'XXX Team'!$F$8","v":7},"N",{"$f":"'XXX Team'!$H$78","v":0},{"$f":"'XXX Team'!$H$79","v":0},{"$f":"'XXX Team'!$D$80","v":"f"}]
[115,{"$f":"'X Team'!$A$69","v":15},{"$f":"'X Team'!$D$1","v":"X Team"},{"$f":"'X Team'!$D$69","v":0},{"$f":"'X Team'!$D$70","v":0},{"$f":"'X Team'!$H$72","v":""},{"$f":"'X Team'!$H$69","v":0},{"$f":"'X Team'!$F$8","v":7},"N",{"$f":"'X Team'!$H$70","v":0},{"$f":"'X Team'!$H$71","v":0},{"$f":"'X Team'!$D$72","v":"f"}]
[17,{"$f":"'Bad Pitches'!$A$77","v":17},{"$f":"'Bad Pitches'!$D$1","v":"Bad Pitches"},{"$f":"'Bad Pitches'!$D$77","v":0},{"$f":"'Bad Pitches'!$D$78","v":0},{"$f":"'Bad Pitches'!$H$80","v":""},{"$f":"'Bad Pitches'!$H$77","v":0},{"$f":"'Bad Pitches'!$F$8","v":3},"N",{"$f":"'Bad Pitches'!$H$78","v":0},{"$f":"'Bad Pitches'!$H$79","v":0},{"$f":"'Bad Pitches'!$D$80","v":"f"}]
[143,{"$f":"'XXX Team'!$A$81","v":18},{"$f":"'XXX Team'!$D$1","v":"XXX Team"},{"$f":"'XXX Team'!$D$81","v":0},{"$f":"'XXX Team'!$D$82","v":0},{"$f":"'XXX Team'!$H$84","v":""},{"$f":"'XXX Team'!$H$81","v":0},{"$f":"'XXX Team'!$F$8","v":7},"N",{"$f":"'XXX Team'!$H$82","v":0},{"$f":"'XXX Team'!$H$83","v":0},{"$f":"'XXX Team'!$D$84","v":"f"}]
[120,{"$f":"'X Team'!$A$89","v":20},{"$f":"'X Team'!$D$1","v":"X Team"},{"$f":"'X Team'!$D$89","v":0},{"$f":"'X Team'!$D$90","v":0},{"$f":"'X Team'!$H$92","v":""},{"$f":"'X Team'!$H$89","v":0},{"$f":"'X Team'!$F$8","v":7},"N",{"$f":"'X Team'!$H$90","v":0},{"$f":"'X Team'!$H$91","v":0},{"$f":"'X Team'!$D$92","v":"f"}]
[116,{"$f":"'X Team'!$A$73","v":16},{"$f":"'X Team'!$D$1","v":"X Team"},{"$f":"'X Team'!$D$73","v":0},{"$f":"'X Team'!$D$74","v":0},{"$f":"'X Team'!$H$76","v":""},{"$f":"'X Team'!$H$73","v":0},{"$f":"'X Team'!$F$8","v":7},"N",{"$f":"'X Team'!$H$74","v":0},{"$f":"'X Team'!$H$75","v":0},{"$f":"'X Team'!$D$76","v":"f"}]
[117,{"$f":"'X Team'!$A$77","v":17},{"$f":"'X Team'!$D$1","v":"X Team"},{"$f":"'X Team'!$D$77","v":0},{"$f":"'X Team'!$D$78","v":0},{"$f":"'X Team'!$H$80","v":""},{"$f":"'X Team'!$H$77","v":0},{"$f":"'X Team'!$F$8","v":7},"N",{"$f":"'X Team'!$H$78","v":0},{"$f":"'X Team'!$H$79","v":0},{"$f":"'X Team'!$D$80","v":"f"}]
[15,{"$f":"'Bad Pitches'!$A$69","v":15},{"$f":"'Bad Pitches'!$D$1","v":"Bad Pitches"},{"$f":"'Bad Pitches'!$D$69","v":0},{"$f":"'Bad Pitches'!$D$70","v":0},{"$f":"'Bad Pitches'!$H$72","v":""},{"$f":"'Bad Pitches'!$H$69","v":0},{"$f":"'Bad Pitches'!$F$8","v":3},"N",{"$f":"'Bad Pitches'!$H$70","v":0},{"$f":"'Bad Pitches'!$H$71","v":0},{"$f":"'Bad Pitches'!$D$72","v":"f"}]
[141,{"$f":"'XXX Team'!$A$73","v":16},{"$f":"'XXX Team'!$D$1","v":"XXX Team"},{"$f":"'XXX Team'!$D$73","v":0},{"$f":"'XXX Team'!$D$74","v":0},{"$f":"'XXX Team'!$H$76","v":""},{"$f":"'XXX Team'!$H$73","v":0},{"$f":"'XXX Team'!$F$8","v":7},"N",{"$f":"'XXX Team'!$H$74","v":0},{"$f":"'XXX Team'!$H$75","v":0},{"$f":"'XXX Team'!$D$76","v":"f"}]
[20,{"$f":"'Bad Pitches'!$A$89","v":20},{"$f":"'Bad Pitches'!$D$1","v":"Bad Pitches"},{"$f":"'Bad Pitches'!$D$89","v":0},{"$f":"'Bad Pitches'!$D$90","v":0},{"$f":"'Bad Pitches'!$H$92","v":""},{"$f":"'Bad Pitches'!$H$89","v":0},{"$f":"'Bad Pitches'!$F$8","v":3},"N",{"$f":"'Bad Pitches'!$H$90","v":0},{"$f":"'Bad Pitches'!$H$91","v":0},{"$f":"'Bad Pitches'!$D$92","v":"f"}]
[16,{"$f":"'Bad Pitches'!$A$73","v":16},{"$f":"'Bad Pitches'!$D$1","v":"Bad Pitches"},{"$f":"'Bad Pitches'!$D$73","v":0},{"$f":"'Bad Pitches'!$D$74","v":0},{"$f":"'Bad Pitches'!$H$76","v":""},{"$f":"'Bad Pitches'!$H$73","v":0},{"$f":"'Bad Pitches'!$F$8","v":3},"N",{"$f":"'Bad Pitches'!$H$74","v":0},{"$f":"'Bad Pitches'!$H$75","v":0},{"$f":"'Bad Pitches'!$D$76","v":"f"}]
[93,{"$f":"'Thunder Ducks'!$A$81","v":18},{"$f":"'Thunder Ducks'!$D$1","v":"Thunder Ducks"},{"$f":"'Thunder Ducks'!$D$81","v":0},{"$f":"'Thunder Ducks'!$D$82","v":0},{"$f":"'Thunder Ducks'!$H$84","v":""},{"$f":"'Thunder Ducks'!$H$81","v":0},{"$f":"'Thunder Ducks'!$F$8","v":4},"N",{"$f":"'Thunder Ducks'!$H$82","v":0},{"$f":"'Thunder Ducks'!$H$83","v":0},{"$f":"'Thunder Ducks'!$D$84","v":"f"}]
[64,{"$f":"'Ghetto Bombers'!$A$65","v":14},{"$f":"'Ghetto Bombers'!$D$1","v":"Ghetto Bombers"},{"$f":"'Ghetto Bombers'!$D$65","v":"Danielle"},{"$f":"'Ghetto Bombers'!$D$66","v":"Henesh"},{"$f":"'Ghetto Bombers'!$H$68","v":0.77777777777777779},{"$f":"'Ghetto Bombers'!$H$65","v":9},{"$f":"'Ghetto Bombers'!$F$8","v":4},"N",{"$f":"'Ghetto Bombers'!$H$66","v":7},{"$f":"'Ghetto Bombers'!$H$67","v":9},{"$f":"'Ghetto Bombers'!$D$68","v":"f"}]
[13,{"$f":"'Bad Pitches'!$A$61","v":13},{"$f":"'Bad Pitches'!$D$1","v":"Bad Pitches"},{"$f":"'Bad Pitches'!$D$61","v":"Karson"},{"$f":"'Bad Pitches'!$D$62","v":"Vanderver"},{"$f":"'Bad Pitches'!$H$64","v":0.7142857142857143},{"$f":"'Bad Pitches'!$H$61","v":7},{"$f":"'Bad Pitches'!$F$8","v":3},"N",{"$f":"'Bad Pitches'!$H$62","v":5},{"$f":"'Bad Pitches'!$H$63","v":7},{"$f":"'Bad Pitches'!$D$64","v":"f"}]
[85,{"$f":"'Thunder Ducks'!$A$49","v":10},{"$f":"'Thunder Ducks'!$D$1","v":"Thunder Ducks"},{"$f":"'Thunder Ducks'!$D$49","v":"Ashley"},{"$f":"'Thunder Ducks'!$D$50","v":"Hall"},{"$f":"'Thunder Ducks'!$H$52","v":0.66666666666666663},{"$f":"'Thunder Ducks'!$H$49","v":6},{"$f":"'Thunder Ducks'!$F$8","v":4},"N",{"$f":"'Thunder Ducks'!$H$50","v":4},{"$f":"'Thunder Ducks'!$H$51","v":6},{"$f":"'Thunder Ducks'!$D$52","v":"f"}]
[41,{"$f":"BCBC!$A$73","v":16},{"$f":"BCBC!$D$1","v":"BCBC"},{"$f":"BCBC!$D$73","v":"Karen "},{"$f":"BCBC!$D$74","v":"Springer"},{"$f":"BCBC!$H$76","v":0.5},{"$f":"BCBC!$H$73","v":4},{"$f":"BCBC!$F$8","v":4},"N",{"$f":"BCBC!$H$74","v":2},{"$f":"BCBC!$H$75","v":4},{"$f":"BCBC!$D$76","v":"f"}]
[81,{"$f":"'Thunder Ducks'!$A$33","v":6},{"$f":"'Thunder Ducks'!$D$1","v":"Thunder Ducks"},{"$f":"'Thunder Ducks'!$D$33","v":"Emily"},{"$f":"'Thunder Ducks'!$D$34","v":"Ross"},{"$f":"'Thunder Ducks'!$H$36","v":0.5},{"$f":"'Thunder Ducks'!$H$33","v":6},{"$f":"'Thunder Ducks'!$F$8","v":4},"N",{"$f":"'Thunder Ducks'!$H$34","v":3},{"$f":"'Thunder Ducks'!$H$35","v":6},{"$f":"'Thunder Ducks'!$D$36","v":"f"}]
[10,{"$f":"'Bad Pitches'!$A$49","v":10},{"$f":"'Bad Pitches'!$D$1","v":"Bad Pitches"},{"$f":"'Bad Pitches'!$D$49","v":"Megan"},{"$f":"'Bad Pitches'!$D$50","v":"Timpson"},{"$f":"'Bad Pitches'!$H$52","v":0.44444444444444442},{"$f":"'Bad Pitches'!$H$49","v":9},{"$f":"'Bad Pitches'!$F$8","v":3},"Y",{"$f":"'Bad Pitches'!$H$50","v":4},{"$f":"'Bad Pitches'!$H$51","v":9},{"$f":"'Bad Pitches'!$D$52","v":"f"}]
[35,{"$f":"BCBC!$A$49","v":10},{"$f":"BCBC!$D$1","v":"BCBC"},{"$f":"BCBC!$D$49","v":"Sunni"},{"$f":"BCBC!$D$50","v":"Jackson"},{"$f":"BCBC!$H$52","v":0.42857142857142855},{"$f":"BCBC!$H$49","v":7},{"$f":"BCBC!$F$8","v":4},"N",{"$f":"BCBC!$H$50","v":3},{"$f":"BCBC!$H$51","v":7},{"$f":"BCBC!$D$52","v":"f"}]
[6,{"$f":"'Bad Pitches'!$A$33","v":6},{"$f":"'Bad Pitches'!$D$1","v":"Bad Pitches"},{"$f":"'Bad Pitches'!$D$33","v":"Callianne"},{"$f":"'Bad Pitches'!$D$34","v":"Hodson"},{"$f":"'Bad Pitches'!$H$36","v":0.33333333333333331},{"$f":"'Bad Pitches'!$H$33","v":9},{"$f":"'Bad Pitches'!$F$8","v":3},"Y",{"$f":"'Bad Pitches'!$H$34","v":3},{"$f":"'Bad Pitches'!$H$35","v":9},{"$f":"'Bad Pitches'!$D$36","v":"f"}]
[62,{"$f":"'Ghetto Bombers'!$A$57","v":12},{"$f":"'Ghetto Bombers'!$D$1","v":"Ghetto Bombers"},{"$f":"'Ghetto Bombers'!$D$57","v":"Ally"},{"$f":"'Ghetto Bombers'!$D$58","v":"McAfee"},{"$f":"'Ghetto Bombers'!$H$60","v":0.33333333333333331},{"$f":"'Ghetto Bombers'!$H$57","v":3},{"$f":"'Ghetto Bombers'!$F$8","v":4},"N",{"$f":"'Ghetto Bombers'!$H$58","v":1},{"$f":"'Ghetto Bombers'!$H$59","v":4},{"$f":"'Ghetto Bombers'!$D$60","v":"f"}]
[12,{"$f":"'Bad Pitches'!$A$57","v":12},{"$f":"'Bad Pitches'!$D$1","v":"Bad Pitches"},{"$f":"'Bad Pitches'!$D$57","v":"Teya"},{"$f":"'Bad Pitches'!$D$58","v":"Gasu"},{"$f":"'Bad Pitches'!$H$60","v":0.2857142857142857},{"$f":"'Bad Pitches'!$H$57","v":7},{"$f":"'Bad Pitches'!$F$8","v":3},"Y",{"$f":"'Bad Pitches'!$H$58","v":2},{"$f":"'Bad Pitches'!$H$59","v":8},{"$f":"'Bad Pitches'!$D$60","v":"f"}]
[86,{"$f":"'Thunder Ducks'!$A$53","v":11},{"$f":"'Thunder Ducks'!$D$1","v":"Thunder Ducks"},{"$f":"'Thunder Ducks'!$D$53","v":"Kat"},{"$f":"'Thunder Ducks'!$D$54","v":"Tiffany"},{"$f":"'Thunder Ducks'!$H$56","v":0.25},{"$f":"'Thunder Ducks'!$H$53","v":8},{"$f":"'Thunder Ducks'!$F$8","v":4},{"$f":"IF(K194<(H194*2.5),\"N\",\"Y\")","v":"N"},{"$f":"'Thunder Ducks'!$H$54","v":2},{"$f":"'Thunder Ducks'!$H$55","v":8},{"$f":"'Thunder Ducks'!$D$56","v":"f"}]
[91,{"$f":"'Thunder Ducks'!$A$73","v":16},{"$f":"'Thunder Ducks'!$D$1","v":"Thunder Ducks"},{"$f":"'Thunder Ducks'!$D$73","v":"Paige"},{"$f":"'Thunder Ducks'!$D$74","v":"Jackman"},{"$f":"'Thunder Ducks'!$H$76","v":0.25},{"$f":"'Thunder Ducks'!$H$73","v":4},{"$f":"'Thunder Ducks'!$F$8","v":4},"N",{"$f":"'Thunder Ducks'!$H$74","v":1},{"$f":"'Thunder Ducks'!$H$75","v":4},{"$f":"'Thunder Ducks'!$D$76","v":"f"}]
[8,{"$f":"'Bad Pitches'!$A$41","v":8},{"$f":"'Bad Pitches'!$D$1","v":"Bad Pitches"},{"$f":"'Bad Pitches'!$D$41","v":"Janae"},{"$f":"'Bad Pitches'!$D$42","v":"Cook"},{"$f":"'Bad Pitches'!$H$44","v":0.14285714285714285},{"$f":"'Bad Pitches'!$H$41","v":7},{"$f":"'Bad Pitches'!$F$8","v":3},"Y",{"$f":"'Bad Pitches'!$H$42","v":1},{"$f":"'Bad Pitches'!$H$43","v":8},{"$f":"'Bad Pitches'!$D$44","v":"f"}]
[43,{"$f":"BCBC!$A$81","v":18},{"$f":"BCBC!$D$1","v":"BCBC"},{"$f":"BCBC!$D$81","v":"Melinda"},{"$f":"BCBC!$D$82","v":0},{"$f":"BCBC!$H$84","v":0},{"$f":"BCBC!$H$81","v":3},{"$f":"BCBC!$F$8","v":4},"N",{"$f":"BCBC!$H$82","v":0},{"$f":"BCBC!$H$83","v":3},{"$f":"BCBC!$D$84","v":"f"}]
[58,{"$f":"'Ghetto Bombers'!$A$41","v":8},{"$f":"'Ghetto Bombers'!$D$1","v":"Ghetto Bombers"},{"$f":"'Ghetto Bombers'!$D$41","v":"Ali"},{"$f":"'Ghetto Bombers'!$D$42","v":"Smith"},{"$f":"'Ghetto Bombers'!$H$44","v":0},{"$f":"'Ghetto Bombers'!$H$41","v":6},{"$f":"'Ghetto Bombers'!$F$8","v":4},"N",{"$f":"'Ghetto Bombers'!$H$42","v":0},{"$f":"'Ghetto Bombers'!$H$43","v":7},{"$f":"'Ghetto Bombers'!$D$44","v":"f"}]
[38,{"$f":"BCBC!$A$61","v":0},{"$f":"BCBC!$D$1","v":"BCBC"},{"$f":"BCBC!$D$61","v":"Robyne"},{"$f":"BCBC!$D$62","v":"Oostveen"},{"$f":"BCBC!$H$64","v":0},{"$f":"BCBC!$H$61","v":5},{"$f":"BCBC!$F$8","v":4},"N",{"$f":"BCBC!$H$62","v":0},{"$f":"BCBC!$H$63","v":5},{"$f":"BCBC!$D$64","v":"f"}]
[87,{"$f":"'Thunder Ducks'!$A$57","v":12},{"$f":"'Thunder Ducks'!$D$1","v":"Thunder Ducks"},{"$f":"'Thunder Ducks'!$D$57","v":"Megan"},{"$f":"'Thunder Ducks'!$D$58","v":"Goodman"},{"$f":"'Thunder Ducks'!$H$60","v":0},{"$f":"'Thunder Ducks'!$H$57","v":4},{"$f":"'Thunder Ducks'!$F$8","v":4},"N",{"$f":"'Thunder Ducks'!$H$58","v":0},{"$f":"'Thunder Ducks'!$H$59","v":4},{"$f":"'Thunder Ducks'!$D$60","v":"f"}]
[89,{"$f":"'Thunder Ducks'!$A$65","v":14},{"$f":"'Thunder Ducks'!$D$1","v":"Thunder Ducks"},{"$f":"'Thunder Ducks'!$D$65","v":"Lindsay"},{"$f":"'Thunder Ducks'!$D$66","v":"Pennington"},{"$f":"'Thunder Ducks'!$H$68","v":0},{"$f":"'Thunder Ducks'!$H$65","v":2},{"$f":"'Thunder Ducks'!$F$8","v":4},"N",{"$f":"'Thunder Ducks'!$H$66","v":0},{"$f":"'Thunder Ducks'!$H$67","v":3},{"$f":"'Thunder Ducks'!$D$68","v":"f"}]

{"sheet":"Sheet1","index":11,"n_rows":0,"n_cols":0,"rows_kept":0,"cut":false,"hidden":false,"merged":[]}

{"sheet":"STANDINGS","index":12,"n_rows":9,"n_cols":6,"rows_kept":9,"cut":false,"hidden":false,"merged":[]}
["COUNTER","TEAM","WINS","LOSSES","Winning Percentage","TEAM B/A"]
[3,{"$f":"'Ghetto Bombers'!$D$1","v":"Ghetto Bombers"},{"$f":"'Ghetto Bombers'!$F$3","v":3},{"$f":"'Ghetto Bombers'!$F$4","v":1},{"$f":"((C2/(C2+D2)))","v":0.75},{"$f":"'Ghetto Bombers'!$F$10","v":0.58823529411764708}]
[1,{"$f":"'Bad Pitches'!$D$1","v":"Bad Pitches"},{"$f":"'Bad Pitches'!$F$3","v":2},{"$f":"'Bad Pitches'!$F$4","v":2},0.5,{"$f":"'Bad Pitches'!$F$10","v":0.4765625}]
[4,{"$f":"'Thunder Ducks'!$D$1","v":"Thunder Ducks"},{"$f":"'Thunder Ducks'!$F$3","v":2},{"$f":"'Thunder Ducks'!$F$4","v":2},0.5,{"$f":"'Thunder Ducks'!$F$10","v":0.54135338345864659}]
[2,{"$f":"BCBC!$D$1","v":"BCBC"},{"$f":"BCBC!$F$3","v":1},{"$f":"BCBC!$F$4","v":3},0.25,{"$f":"BCBC!$F$10","v":0.48026315789473684}]
[5,{"$f":"'X Team'!$D$1","v":"X Team"},{"$f":"'X Team'!$F$3","v":0},{"$f":"'X Team'!$F$4","v":7},0,{"$f":"'X Team'!$F$10","v":0}]
[8,{"$f":"'XX Team'!$D$1","v":"XX Team"},{"$f":"'XX Team'!$F$3","v":0},{"$f":"'XX Team'!$F$4","v":6},0,{"$f":"'XX Team'!$F$10","v":0}]
[6,{"$f":"'XXX Team'!$D$1","v":"XXX Team"},{"$f":"'XXX Team'!$F$3","v":0},{"$f":"'XXX Team'!$F$4","v":7},0,{"$f":"'XXX Team'!$F$10","v":0}]
[7,{"$f":"'YY Team'!$D$1","v":"YY Team"},{"$f":"'YY Team'!$F$3","v":0},{"$f":"'YY Team'!$F$4","v":7},0,{"$f":"'YY Team'!$F$10","v":0}]

{"sheet":"print","index":13,"n_rows":49,"n_cols":7,"rows_kept":49,"cut":false,"hidden":false,"merged":[]}
["Statistics as of:",{"$f":"Start!$A$2","v":"2023-08-31"}]
[]
["LEAGUE LEADING HITTERS - Female"]
[]
["Players Name",null,"TEAM","AVG","AB","HITS","PA"]
[{"$f":"Female!D2","v":"Annie"},{"$f":"Female!E2","v":"Brady"},{"$f":"Female!C2","v":"Thunder Ducks"},{"$f":"Female!F2","v":0.72727272727272729},{"$f":"Female!G2","v":11},{"$f":"Female!J2","v":8},{"$f":"Female!K2","v":11}]
[{"$f":"Female!D3","v":"Calleigh"},{"$f":"Female!E3","v":"DeYoung"},{"$f":"Female!C3","v":"Ghetto Bombers"},{"$f":"Female!F3","v":0.6875},{"$f":"Female!G3","v":16},{"$f":"Female!J3","v":11},{"$f":"Female!K3","v":18}]
[{"$f":"Female!D4","v":"Brandi"},{"$f":"Female!E4","v":"Hall"},{"$f":"Female!C4","v":"Ghetto Bombers"},{"$f":"Female!F4","v":0.55555555555555558},{"$f":"Female!G4","v":18},{"$f":"Female!J4","v":10},{"$f":"Female!K4","v":18}]
[{"$f":"Female!D5","v":"Hope"},{"$f":"Female!E5","v":"Curtis"},{"$f":"Female!C5","v":"Ghetto Bombers"},{"$f":"Female!F5","v":0.54545454545454541},{"$f":"Female!G5","v":11},{"$f":"Female!J5","v":6},{"$f":"Female!K5","v":11}]
[{"$f":"Female!D6","v":"Tanzie"},{"$f":"Female!E6","v":"Gasu"},{"$f":"Female!C6","v":"Bad Pitches"},{"$f":"Female!F6","v":0.5},{"$f":"Female!G6","v":14},{"$f":"Female!J6","v":7},{"$f":"Female!K6","v":14}]
[{"$f":"Female!D7","v":"JoJo"},{"$f":"Female!E7","v":"Carlson"},{"$f":"Female!C7","v":"Ghetto Bombers"},{"$f":"Female!F7","v":0.5},{"$f":"Female!G7","v":10},{"$f":"Female!J7","v":5},{"$f":"Female!K7","v":10}]
[{"$f":"Female!D8","v":"Heidi"},{"$f":"Female!E8","v":"Taylor"},{"$f":"Female!C8","v":"Ghetto Bombers"},{"$f":"Female!F8","v":0.46666666666666667},{"$f":"Female!G8","v":15},{"$f":"Female!J8","v":7},{"$f":"Female!K8","v":16}]
[{"$f":"Female!D9","v":"Jennie"},{"$f":"Female!E9","v":"Anderson"},{"$f":"Female!C9","v":"Thunder Ducks"},{"$f":"Female!F9","v":0.46153846153846156},{"$f":"Female!G9","v":13},{"$f":"Female!J9","v":6},{"$f":"Female!K9","v":15}]
[{"$f":"Female!D10","v":"Alex"},{"$f":"Female!E10","v":"Ferrel"},{"$f":"Female!C10","v":"BCBC"},{"$f":"Female!F10","v":0.45454545454545453},{"$f":"Female!G10","v":11},{"$f":"Female!J10","v":5},{"$f":"Female!K10","v":11}]
[{"$f":"Female!D11","v":"Tiff"},{"$f":"Female!E11","v":"Morton"},{"$f":"Female!C11","v":"BCBC"},{"$f":"Female!F11","v":0.4},{"$f":"Female!G11","v":10},{"$f":"Female!J11","v":4},{"$f":"Female!K11","v":11}]
[{"$f":"Female!D12","v":"Casey"},{"$f":"Female!E12","v":"Velarde"},{"$f":"Female!C12","v":"BCBC"},{"$f":"Female!F12","v":0.36363636363636365},{"$f":"Female!G12","v":11},{"$f":"Female!J12","v":4},{"$f":"Female!K12","v":12}]
[]
[]
["LEAGUE LEADING HITTERS - Male"]
[]
["Players Name",null,"TEAM","AVG","AB","HITS","PA"]
[{"$f":"Male!D2","v":"Matt"},{"$f":"Male!E2","v":"Newbold"},{"$f":"Male!C2","v":"Ghetto Bombers"},{"$f":"Male!F2","v":0.94117647058823528},{"$f":"Male!G2","v":17},{"$f":"Male!J2","v":16},{"$f":"Male!K2","v":18}]
[{"$f":"Male!D3","v":"Ryan"},{"$f":"Male!E3","v":"Newbold"},{"$f":"Male!C3","v":"Ghetto Bombers"},{"$f":"Male!F3","v":0.92307692307692313},{"$f":"Male!G3","v":13},{"$f":"Male!J3","v":12},{"$f":"Male!K3","v":14}]
[{"$f":"Male!D4","v":"Ben"},{"$f":"Male!E4","v":"Mangum"},{"$f":"Male!C4","v":"BCBC"},{"$f":"Male!F4","v":0.90909090909090906},{"$f":"Male!G4","v":11},{"$f":"Male!J4","v":10},{"$f":"Male!K4","v":11}]
[{"$f":"Male!D5","v":"Shane"},{"$f":"Male!E5","v":"Singer"},{"$f":"Male!C5","v":"BCBC"},{"$f":"Male!F5","v":0.88888888888888884},{"$f":"Male!G5","v":9},{"$f":"Male!J5","v":8},{"$f":"Male!K5","v":10}]
[{"$f":"Male!D6","v":"Kyle"},{"$f":"Male!E6","v":"O'Bryant"},{"$f":"Male!C6","v":"Thunder Ducks"},{"$f":"Male!F6","v":0.88888888888888884},{"$f":"Male!G6","v":9},{"$f":"Male!J6","v":8},{"$f":"Male!K6","v":10}]
[{"$f":"Male!D7","v":"Dustin"},{"$f":"Male!E7","v":"Hunter"},{"$f":"Male!C7","v":"BCBC"},{"$f":"Male!F7","v":0.75},{"$f":"Male!G7","v":12},{"$f":"Male!J7","v":9},{"$f":"Male!K7","v":12}]
[{"$f":"Male!D8","v":"Steve"},{"$f":"Male!E8","v":"Hart"},{"$f":"Male!C8","v":"Thunder Ducks"},{"$f":"Male!F8","v":0.73333333333333328},{"$f":"Male!G8","v":15},{"$f":"Male!J8","v":11},{"$f":"Male!K8","v":16}]
[{"$f":"Male!D9","v":"Harrison"},{"$f":"Male!E9","v":"Van Dyke"},{"$f":"Male!C9","v":"Bad Pitches"},{"$f":"Male!F9","v":0.7142857142857143},{"$f":"Male!G9","v":14},{"$f":"Male!J9","v":10},{"$f":"Male!K9","v":15}]
[{"$f":"Male!D10","v":"Ryan"},{"$f":"Male!E10","v":"Watt"},{"$f":"Male!C10","v":"Bad Pitches"},{"$f":"Male!F10","v":0.7142857142857143},{"$f":"Male!G10","v":14},{"$f":"Male!J10","v":10},{"$f":"Male!K10","v":14}]
[{"$f":"Male!D11","v":"Jordan"},{"$f":"Male!E11","v":"Rogers"},{"$f":"Male!C11","v":"BCBC"},{"$f":"Male!F11","v":0.7},{"$f":"Male!G11","v":10},{"$f":"Male!J11","v":7},{"$f":"Male!K11","v":11}]
[{"$f":"Male!D12","v":"Jon"},{"$f":"Male!E12","v":"Staley"},{"$f":"Male!C12","v":"Ghetto Bombers"},{"$f":"Male!F12","v":0.7},{"$f":"Male!G12","v":10},{"$f":"Male!J12","v":7},{"$f":"Male!K12","v":11}]
[]
[]
[]
[]
[]
["STANDINGS"]
["TEAMS NAME",null,null,"WINS","LOSSES","TEAM BATTING AVG"]
[{"$f":"STANDINGS!$B2","v":"Ghetto Bombers"},null,null,{"$f":"STANDINGS!$C2","v":3},{"$f":"STANDINGS!$D2","v":1},{"$f":"STANDINGS!$F2","v":0.58823529411764708}]
[{"$f":"STANDINGS!$B3","v":"Bad Pitches"},null,null,{"$f":"STANDINGS!$C3","v":2},{"$f":"STANDINGS!$D3","v":2},{"$f":"STANDINGS!$F3","v":0.4765625}]
[{"$f":"STANDINGS!$B4","v":"Thunder Ducks"},null,null,{"$f":"STANDINGS!$C4","v":2},{"$f":"STANDINGS!$D4","v":2},{"$f":"STANDINGS!$F4","v":0.54135338345864659}]
[{"$f":"STANDINGS!$B5","v":"BCBC"},null,null,{"$f":"STANDINGS!$C5","v":1},{"$f":"STANDINGS!$D5","v":3},{"$f":"STANDINGS!$F5","v":0.48026315789473684}]
[{"$f":"STANDINGS!$B6","v":"X Team"},null,null,{"$f":"STANDINGS!$C6","v":0},{"$f":"STANDINGS!$D6","v":7},{"$f":"STANDINGS!$F6","v":0}]
[{"$f":"STANDINGS!$B7","v":"XX Team"},null,null,{"$f":"STANDINGS!$C7","v":0},{"$f":"STANDINGS!$D7","v":6},{"$f":"STANDINGS!$F7","v":0}]
[{"$f":"STANDINGS!$B8","v":"XXX Team"},null,null,{"$f":"STANDINGS!$C8","v":0},{"$f":"STANDINGS!$D8","v":7},{"$f":"STANDINGS!$F8","v":0}]
[{"$f":"STANDINGS!$B9","v":"YY Team"},null,null,{"$f":"STANDINGS!$C9","v":0},{"$f":"STANDINGS!$D9","v":7},{"$f":"STANDINGS!$F9","v":0}]
[{"$f":"STANDINGS!#REF!","v":{"$error":"#REF!"}},null,null,{"$f":"STANDINGS!#REF!","v":{"$error":"#REF!"}},{"$f":"STANDINGS!#REF!","v":{"$error":"#REF!"}},{"$f":"STANDINGS!#REF!","v":{"$error":"#REF!"}}]
[{"$f":"STANDINGS!#REF!","v":{"$error":"#REF!"}},null,null,{"$f":"STANDINGS!#REF!","v":{"$error":"#REF!"}},{"$f":"STANDINGS!#REF!","v":{"$error":"#REF!"}},{"$f":"STANDINGS!#REF!","v":{"$error":"#REF!"}}]

{"sheet":"Sheet2","index":14,"n_rows":0,"n_cols":0,"rows_kept":0,"cut":false,"hidden":false,"merged":[]}