{"text_format":"1","workbook":"xlsx","n_sheets":17,"sheets":["Start","Bad Pitches","BCBC","Ghetto Bombers","Hit Squad","Sticks","Team 6","Team 7","Team 8","Female","Male","Sheet1","STANDINGS","print","Sheet2","Module1","Module2"],"not_rendered":{"charts":0,"images":0,"macros":1,"external_links":0,"defined_names":9,"comments":0,"pivot_tables":0},"unopened":[{"sheet":"Module1","index":15,"reason":"part_missing"},{"sheet":"Module2","index":16,"reason":"part_missing"}],"bounds":{"document_bytes":16777216,"sheet_cells":100000,"rows_first":2000,"rows_last":500,"rows_between":2000,"halvings":0,"cell_chars":16384,"cell_head_chars":4096},"cells_cut":0,"cells_raw":0,"read":"whole","date_system":"1900"}

{"sheet":"Start","index":0,"n_rows":10,"n_cols":10,"rows_kept":10,"cut":false,"hidden":false,"merged":[]}
["Last game day"]
["2023-05-04",null,null,null,null,null,null,null,"Team Legends"]
[null,null,null,null,null,null,null,null,"Team 1",{"$f":"'Bad Pitches'!D1","v":"Bad Pitches"}]
[null,null,null,null,null,null,null,null,"Team 2",{"$f":"BCBC!D1","v":"BCBC"}]
[null,null,null,null,null,null,null,null,"Team 3",{"$f":"'Ghetto Bombers'!D1","v":"Ghetto Bombers"}]
[null,null,null,null,null,null,null,null,"Team 4",{"$f":"'Hit Squad'!D1","v":"Hit Squad"}]
[null,null,null,null,null,null,null,null,"Team 5",{"$f":"Sticks!D1","v":"Sticks"}]
[null,null,null,null,null,null,null,null,"Team 6",{"$f":"'Team 6'!D1","v":"Team 6"}]
[null,null,null,null,null,null,null,null,"Team 7",{"$f":"'Team 7'!D1","v":" "}]
[null,null,null,null,null,null,null,null,"Team 8",{"$f":"'Team 8'!D1","v":" "}]

{"sheet":"Bad Pitches","index":1,"n_rows":115,"n_cols":27,"rows_kept":115,"cut":false,"hidden":false,"merged":[]}
[null,null,"Team Name","Bad Pitches",null,null,null,null,"Score",14,3,19]
[null,null,null,null,null,null,null,null,"Opponents Score",11,9,16]
[null,null,null,"Wins",null,{"$f":"SUM(J6:AA6)","v":2},null,null,"W or L",{"$f":"IF(SUM(J1,J2)=0,\"\",IF(J1<J2,\"L\",\"W\"))","v":"W"},"L","W","","","","","","","",{"$f":"IF(SUM(T1,T2)=0,\"\",IF(T1<T2,\"L\",\"W\"))","v":""},"","","","","","",""]
[null,null,null,"Losses",null,{"$f":"SUM(J7:AA7)","v":1},null,"Forfeit","FW or FL"]
[null,null,null,null,"games played excluding Forfeit Wins",null,null,null,null,{"$f":"IF(J3=\"\",\"\",IF(J4=\"FW\",\"\",1))","v":1},1,1,"","","","","","","","","","","",null,{"$f":"IF(Y3=\"\",\"\",IF(Y4=\"FW\",\"\",1))","v":""},{"$f":"IF(Z3=\"\",\"\",IF(Z4=\"FW\",\"\",1))","v":""},{"$f":"IF(AA3=\"\",\"\",IF(AA4=\"FW\",\"\",1))","v":""}]
[null,null,null,null,null,null,null,{"$f":"IF(H4=\"w\",1,\"\")","v":""},"win",{"$f":"IF(J3=\"w\",1,\"\")","v":1},"",1,"","","","","","","","","","","",null,{"$f":"IF(Y3=\"w\",1,\"\")","v":""},{"$f":"IF(Z3=\"w\",1,\"\")","v":""},{"$f":"IF(AA3=\"w\",1,\"\")","v":""}]
[null,null,null,null,null,null,null,{"$f":"IF(H4=\"l\",1,\"\")","v":""},"loss",{"$f":"IF(J3=\"l\",1,\"\")","v":""},1,"","","","","","","","","","","","",null,{"$f":"IF(Y3=\"l\",1,\"\")","v":""},{"$f":"IF(Z3=\"l\",1,\"\")","v":""},{"$f":"IF(AA3=\"l\",1,\"\")","v":""}]
[null,null,null,"Games Played Excluding Forfeit Wins",null,{"$f":"SUM(J5:AA5)","v":3},null,"Opponents Team Name",null,"Sticks","BCBC","Ghetto Bombers",null,"No Games",null,null,"No Games"]
[null,null,null,"League Run Diff     ",null,{"$f":"SUM(J9:AA9)","v":0},null,null,"Game Run Diff",{"$f":"IF(J1=\"\",\"\",J1-J2)","v":3},-6,3,"","","","","","","",null,{"$f":"IF(U1=\"\",\"\",U1-U2)","v":""},"","","","","",""]
[null,null,null,"Team Batting Avg   ",null,{"$f":"$H$115","v":0.43859649122807015},null,null,"Game Date","2023-04-20","2023-04-27","2023-05-04","2023-05-11","2023-05-18","2023-05-25","2023-05-25","2023-06-01","2023-06-08","2023-06-08"]
[]
[null,null,null,null,null,null,null,"STATS",null,1,2,3,4,5,6,7,8,9,10,11,12,13,14,15,16,17,18]
[1,{"$f":"$D$1","v":"Bad Pitches"},"L-Name","Ryan ",null,"# of AB's",null,{"$f":"SUM(J13:AA13)","v":13},"AB's",5,4,4]
[null,null,"F-Name","Watt",null,"# of Hits",null,{"$f":"SUM(J14:AA14)","v":8},"Hits",2,3,3]
[null,null,null,null,null,"# of PA",null,{"$f":"SUM(J15:AA15)","v":13},"PA",5,4,4]
[null,null,null,"m",null,"Avg",null,{"$f":"IF(H13=0,\"\",(H14/H13))","v":0.61538461538461542},"Avg",{"$f":"IF(J13=\"\",\"\",J14/J13)","v":0.4},0.75,0.75,"","","","","","","",{"$f":"IF(T13=\"\",\"\",T14/T13)","v":""},"","","","","","",""]
[2,{"$f":"$D$1","v":"Bad Pitches"},"L-Name","Tayce",null,"# of AB's",null,{"$f":"SUM(J17:AA17)","v":13},"AB's",5,4,4]
[null,null,"F-Name","Shamo",null,"# of Hits",null,{"$f":"SUM(J18:AA18)","v":4},"Hits",1,1,2]
[null,null,null,null,null,"# of PA",null,{"$f":"SUM(J19:AA19)","v":13},"PA",5,4,4]
[null,null,null,"f",null,"Avg",null,{"$f":"IF(H17=0,\"\",H18/H17)","v":0.30769230769230771},"Avg",{"$f":"IF(J17=\"\",\"\",J18/J17)","v":0.2},0.25,0.5,"","","","","","","",{"$f":"IF(T17=\"\",\"\",T18/T17)","v":""},"","","","","","",""]
[3,{"$f":"$D$1","v":"Bad Pitches"},"L-Name","Jeff",null,"# of AB's",null,{"$f":"SUM(J21:AA21)","v":11},"AB's",4,3,4]
[null,null,"F-Name","Cagle",null,"# of Hits",null,{"$f":"SUM(J22:AA22)","v":6},"Hits",2,2,2]
[null,null,null,null,null,"# of PA",null,{"$f":"SUM(J23:AA23)","v":11},"PA",4,3,4]
[null,null,null,"m",null,"Avg",null,{"$f":"IF(H21=0,\"\",H22/H21)","v":0.54545454545454541},"Avg",{"$f":"IF(J21=\"\",\"\",J22/J21)","v":0.5},0.66666666666666663,0.5,"","","","","","","",{"$f":"IF(T21=\"\",\"\",T22/T21)","v":""},"","","","","","",""]
[4,{"$f":"$D$1","v":"Bad Pitches"},"L-Name","Stephanie",null,"# of AB's",null,{"$f":"SUM(J25:AA25)","v":12},"AB's",4,4,4]
[null,null,"F-Name","Bonham",null,"# of Hits",null,{"$f":"SUM(J26:AA26)","v":3},"Hits",1,0,2]
[null,null,null,null,null,"# of PA",null,{"$f":"SUM(J27:AA27)","v":12},"PA",4,4,4]
[null,null,null,"f",null,"Avg",null,{"$f":"IF(H25=0,\"\",H26/H25)","v":0.25},"Avg",{"$f":"IF(J25=\"\",\"\",J26/J25)","v":0.25},0,0.5,"","","","","","","",{"$f":"IF(T25=\"\",\"\",T26/T25)","v":""},"","","","","","",""]
[5,{"$f":"$D$1","v":"Bad Pitches"},"L-Name","Aaron",null,"# of AB's",null,{"$f":"SUM(J29:AA29)","v":11},"AB's",4,3,4]
[null,null,"F-Name","Montgomery",null,"# of Hits",null,{"$f":"SUM(J30:AA30)","v":5},"Hits",2,1,2]
[null,null,null,null,null,"# of PA",null,{"$f":"SUM(J31:AA31)","v":11},"PA",4,3,4]
[null,null,null,"m",null,"Avg",null,{"$f":"IF(H29=0,\"\",H30/H29)","v":0.45454545454545453},"Avg",{"$f":"IF(J29=\"\",\"\",J30/J29)","v":0.5},0.33333333333333331,0.5,"","","","","","","",{"$f":"IF(T29=\"\",\"\",T30/T29)","v":""},"","","","","","",""]
[6,{"$f":"$D$1","v":"Bad Pitches"},"L-Name","Paige",null,"# of AB's",null,{"$f":"SUM(J33:AA33)","v":12},"AB's",4,3,5]
[null,null,"F-Name","Reynolds",null,"# of Hits",null,{"$f":"SUM(J34:AA34)","v":4},"Hits",2,0,2]
[null,null,null,null,null,"# of PA",null,{"$f":"SUM(J35:AA35)","v":12},"PA",4,3,5]
[null,null,null,"f",null,"Avg",null,{"$f":"IF(H33=0,\"\",H34/H33)","v":0.33333333333333331},"Avg",{"$f":"IF(J33=\"\",\"\",J34/J33)","v":0.5},0,0.4,"","","","","","","","","","","","","","",""]
[7,{"$f":"$D$1","v":"Bad Pitches"},"L-Name","Brian",null,"# of AB's",null,{"$f":"SUM(J37:AA37)","v":8},"AB's",4,null,4]
[null,null,"F-Name","Godfrey",null,"# of Hits",null,{"$f":"SUM(J38:AA38)","v":5},"Hits",2,null,3]
[null,null,null,null,null,"# of PA",null,{"$f":"SUM(J39:AA39)","v":8},"PA",4,null,4]
[null,null,null,"m",null,"Avg",null,{"$f":"IF(H37=0,\"\",H38/H37)","v":0.625},"Avg",{"$f":"IF(J37=\"\",\"\",J38/J37)","v":0.5},"",0.75,"","","","","","","",{"$f":"IF(T37=\"\",\"\",T38/T37)","v":""},"","","","","","",""]
[8,{"$f":"$D$1","v":"Bad Pitches"},"L-Name","Calliane",null,"# of AB's",null,{"$f":"SUM(J41:AA41)","v":8},"AB's",4,null,4]
[null,null,"F-Name","Hodson",null,"# of Hits",null,{"$f":"SUM(J42:AA42)","v":7},"Hits",3,null,4]
[null,null,null,null,null,"# of PA",null,{"$f":"SUM(J43:AA43)","v":8},"PA",4,null,4]
[null,null,null,"f",null,"Avg",null,{"$f":"IF(H41=0,\"\",H42/H41)","v":0.875},"Avg",{"$f":"IF(J41=\"\",\"\",J42/J41)","v":0.75},"",1,"","","","","","","",{"$f":"IF(T41=\"\",\"\",T42/T41)","v":""},"","","","","","",""]
[9,{"$f":"$D$1","v":"Bad Pitches"},"L-Name","Vincente",null,"# of AB's",null,{"$f":"SUM(J45:AA45)","v":11},"AB's",4,3,4]
[null,null,"F-Name","Herrera",null,"# of Hits",null,{"$f":"SUM(J46:AA46)","v":6},"Hits",2,1,3]
[null,null,null,null,null,"# of PA",null,{"$f":"SUM(J47:AA47)","v":12},"PA",4,3,5]
[null,null,null,"m",null,"Avg",null,{"$f":"IF(H45=0,\"\",H46/H45)","v":0.54545454545454541},"Avg",{"$f":"IF(J45=\"\",\"\",J46/J45)","v":0.5},0.33333333333333331,0.75,"","","","","","","",{"$f":"IF(T45=\"\",\"\",T46/T45)","v":""},"","","","","","",""]
[10,{"$f":"$D$1","v":"Bad Pitches"},"L-Name","Emma",null,"# of AB's",null,{"$f":"SUM(J49:AA49)","v":4},"AB's",4]
[null,null,"F-Name","Larsen",null,"# of Hits",null,{"$f":"SUM(J50:AA50)","v":0},"Hits",0]
[null,null,null,null,null,"# of PA",null,{"$f":"SUM(J51:AA51)","v":4},"PA",4]
[null,null,null,"f",null,"Avg",null,{"$f":"IF(H49=0,\"\",H50/H49)","v":0},"Avg",{"$f":"IF(J49=\"\",\"\",J50/J49)","v":0},"","","","","","","","","",{"$f":"IF(T49=\"\",\"\",T50/T49)","v":""},"","","","","","",""]
[11,{"$f":"$D$1","v":"Bad Pitches"},"L-Name","Seth",null,"# of AB's",null,{"$f":"SUM(J53:AA53)","v":4},"AB's",null,4]
[null,null,"F-Name","Kaelin",null,"# of Hits",null,{"$f":"SUM(J54:AA54)","v":0},"Hits",null,0]
[null,null,null,null,null,"# of PA",null,{"$f":"SUM(J55:AA55)","v":4},"PA",null,4]
[null,null,null,"m",null,"Avg",null,{"$f":"IF(H53=0,\"\",H54/H53)","v":0},"Avg",{"$f":"IF(J53=\"\",\"\",J54/J53)","v":""},0,"","","","","","","","",{"$f":"IF(T53=\"\",\"\",T54/T53)","v":""},"","","","","","",""]
[12,{"$f":"$D$1","v":"Bad Pitches"},"L-Name","Sandra ",null,"# of AB's",null,{"$f":"SUM(J57:AA57)","v":3},"AB's",null,3]
[null,null,"F-Name","Chavez",null,"# of Hits",null,{"$f":"SUM(J58:AA58)","v":1},"Hits",null,1]
[null,null,null,null,null,"# of PA",null,{"$f":"SUM(J59:AA59)","v":3},"PA",null,3]
[null,null,null,"f",null,"Avg",null,{"$f":"IF(H57=0,\"\",H58/H57)","v":0.33333333333333331},"Avg",{"$f":"IF(J57=\"\",\"\",J58/J57)","v":""},0.33333333333333331,"","","","",null,"","","",{"$f":"IF(T57=\"\",\"\",T58/T57)","v":""},"","","","","","",""]
[13,{"$f":"$D$1","v":"Bad Pitches"},"B","Britt",null,"# of AB's",null,{"$f":"SUM(J61:AA61)","v":4},"AB's",null,null,4]
[null,null,"F-Name","Call",null,"# of Hits",null,{"$f":"SUM(J62:AA62)","v":1},"Hits",null,null,1]
[null,null,null,null,null,"# of PA",null,{"$f":"SUM(J63:AA63)","v":4},"PA",null,null,4]
[null,null,null,"f",null,"Avg",null,{"$f":"IF(H61=0,\"\",H62/H61)","v":0.25},"Avg",{"$f":"IF(J61=\"\",\"\",J62/J61)","v":""},"",0.25,"","","","","","","",{"$f":"IF(T61=\"\",\"\",T62/T61)","v":""},"","","","","","",""]
[14,{"$f":"$D$1","v":"Bad Pitches"},"L-Name",null,null,"# of AB's",null,{"$f":"SUM(J65:AA65)","v":0},"AB's"]
[null,null,"F-Name",null,null,"# of Hits",null,{"$f":"SUM(J66:AA66)","v":0},"Hits"]
[null,null,null,null,null,"# of PA",null,{"$f":"SUM(J67:AA67)","v":0},"PA"]
[null,null,null,"m",null,"Avg",null,{"$f":"IF(H65=0,\"\",H66/H65)","v":""},"Avg",{"$f":"IF(J65=\"\",\"\",J66/J65)","v":""},"","","","","","","","","",{"$f":"IF(T65=\"\",\"\",T66/T65)","v":""},"","","","","","",""]
[15,{"$f":"$D$1","v":"Bad Pitches"},"L-Name",null,null,"# of AB's",null,{"$f":"SUM(J69:AA69)","v":0},"AB's"]
[null,null,"F-Name",null,null,"# of Hits",null,{"$f":"SUM(J70:AA70)","v":0},"Hits"]
[null,null,null,null,null,"# of PA",null,{"$f":"SUM(J71:AA71)","v":0},"PA"]
[null,null,null,"f",null,"Avg",null,{"$f":"IF(H69=0,\"\",H70/H69)","v":""},"Avg",{"$f":"IF(J69=\"\",\"\",J70/J69)","v":""},"","","","","","","","",null,{"$f":"IF(T69=\"\",\"\",T70/T69)","v":""},"","","","","","",""]
[16,{"$f":"$D$1","v":"Bad Pitches"},"R",null,null,"# of AB's",null,{"$f":"SUM(J73:AA73)","v":0},"AB's"]
[null,null,"F-Name",null,null,"# of Hits",null,{"$f":"SUM(J74:AA74)","v":0},"Hits"]
[null,null,null,null,null,"# of PA",null,{"$f":"SUM(J75:AA75)","v":0},"PA"]
[null,null,null,"f",null,"Avg",null,{"$f":"IF(H73=0,\"\",H74/H73)","v":""},"Avg",{"$f":"IF(J73=\"\",\"\",J74/J73)","v":""},"","","","","","","","","",{"$f":"IF(T73=\"\",\"\",T74/T73)","v":""},"","","","","","",""]
[17,{"$f":"$D$1","v":"Bad Pitches"},"L-Name",null,null,"# of AB's",null,{"$f":"SUM(J77:AA77)","v":0},"AB's"]
[null,null,"F-Name",null,null,"# of Hits",null,{"$f":"SUM(J78:AA78)","v":0},"Hits"]
[null,null,null,null,null,"# of PA",null,{"$f":"SUM(J79:AA79)","v":0},"PA"]
[null,null,null,"f",null,"Avg",null,{"$f":"IF(H77=0,\"\",H78/H77)","v":""},"Avg",{"$f":"IF(J77=\"\",\"\",J78/J77)","v":""},"","","","","","","","","",{"$f":"IF(T77=\"\",\"\",T78/T77)","v":""},"","","","","","",""]
[18,{"$f":"$D$1","v":"Bad Pitches"},"L-Name",null,null,"# of AB's",null,{"$f":"SUM(J81:AA81)","v":0},"AB's"]
[null,null,"F-Name",null,null,"# of Hits",null,{"$f":"SUM(J82:AA82)","v":0},"Hits"]
[null,null,null,null,null,"# of PA",null,{"$f":"SUM(J83:AA83)","v":0},"PA"]
[null,null,null,"m",null,"Avg",null,{"$f":"IF(H81=0,\"\",H82/H81)","v":""},"Avg",{"$f":"IF(J81=\"\",\"\",J82/J81)","v":""},"","","","","","","","","",{"$f":"IF(T81=\"\",\"\",T82/T81)","v":""},"","","","","","",""]
[19,{"$f":"$D$1","v":"Bad Pitches"},"L-Name",null,null,"# of AB's",null,{"$f":"SUM(J85:AA85)","v":0},"AB's"]
[null,null,"F-Name",null,null,"# of Hits",null,{"$f":"SUM(J86:AA86)","v":0},"Hits"]
[null,null,null,null,null,"# of PA",null,{"$f":"SUM(J87:AA87)","v":0},"PA"]
[null,null,null,"m",null,"Avg",null,{"$f":"IF(H85=0,\"\",H86/H85)","v":""},"Avg",{"$f":"IF(J85=\"\",\"\",J86/J85)","v":""},"","","","","","","","","",{"$f":"IF(T85=\"\",\"\",T86/T85)","v":""},"","","","","","",""]
[20,{"$f":"$D$1","v":"Bad Pitches"},"L-Name",null,null,"# of AB's",null,{"$f":"SUM(J89:AA89)","v":0},"AB's"]
[null,null,"F-Name",null,null,"# of Hits",null,{"$f":"SUM(J90:AA90)","v":0},"Hits"]
[null,null,null,null,null,"# of PA",null,{"$f":"SUM(J91:AA91)","v":0},"PA"]
[null,null,null,"f",null,"Avg",null,{"$f":"IF(H89=0,\"\",H90/H89)","v":""},"Avg",{"$f":"IF(J89=\"\",\"\",J90/J89)","v":""},"","","","","","","","","",{"$f":"IF(T89=\"\",\"\",T90/T89)","v":""},"","","","","","",""]
[21,{"$f":"$D$1","v":"Bad Pitches"},"L-Name",null,null,"# of AB's",null,{"$f":"SUM(J93:AA93)","v":0},"AB's"]
[null,null,"F-Name",null,null,"# of Hits",null,{"$f":"SUM(J94:AA94)","v":0},"Hits"]
[null,null,null,null,null,"# of PA",null,{"$f":"SUM(J95:AA95)","v":0},"PA"]
[null,null,null,"f",null,"Avg",null,{"$f":"IF(H93=0,\"\",H94/H93)","v":""},"Avg",{"$f":"IF(J93=\"\",\"\",J94/J93)","v":""},"","","","","","","","","",{"$f":"IF(T93=\"\",\"\",T94/T93)","v":""},"","","","","","",""]
[22,{"$f":"$D$1","v":"Bad Pitches"},"L-Name",null,null,"# of AB's",null,{"$f":"SUM(J97:AA97)","v":0},"AB's"]
[null,null,"F-Name",null,null,"# of Hits",null,{"$f":"SUM(J98:AA98)","v":0},"Hits"]
[null,null,null,null,null,"# of PA",null,{"$f":"SUM(J99:AA99)","v":0},"PA"]
[null,null,null,"f",null,"Avg",null,{"$f":"IF(H97=0,\"\",H98/H97)","v":""},"Avg",{"$f":"IF(J97=\"\",\"\",J98/J97)","v":""},"","","","","","","","","",{"$f":"IF(T97=\"\",\"\",T98/T97)","v":""},"","","","","","",""]
[23,{"$f":"$D$1","v":"Bad Pitches"},"L-Name",null,null,"# of AB's",null,{"$f":"SUM(J101:AA101)","v":0},"AB's"]
[null,null,"F-Name",null,null,"# of Hits",null,{"$f":"SUM(J102:AA102)","v":0},"Hits"]
[null,null,null,null,null,"# of PA",null,{"$f":"SUM(J103:AA103)","v":0},"PA"]
[null,null,null,"f",null,"Avg",null,{"$f":"IF(H101=0,\"\",H102/H101)","v":""},"Avg",{"$f":"IF(J101=\"\",\"\",J102/J101)","v":""},"","","","","","","","","",{"$f":"IF(T101=\"\",\"\",T102/T101)","v":""},"","","","","","",""]
[24,{"$f":"$D$1","v":"Bad Pitches"},"L-Name",null,null,"# of AB's",null,{"$f":"SUM(J105:AA105)","v":0},"AB's"]
[null,null,"F-Name",null,null,"# of Hits",null,{"$f":"SUM(J106:AA106)","v":0},"Hits"]
[null,null,null,null,null,"# of PA",null,{"$f":"SUM(J107:AA107)","v":0},"PA"]
[null,null,null,"f",null,"Avg",null,{"$f":"IF(H105=0,\"\",H106/H105)","v":""},"Avg",{"$f":"IF(J105=\"\",\"\",J106/J105)","v":""},"","","","","","","","","",{"$f":"IF(T105=\"\",\"\",T106/T105)","v":""},"","","","","","",""]
[25,{"$f":"$D$1","v":"Bad Pitches"},"L-Name",null,null,"# of AB's",null,{"$f":"SUM(J109:AA109)","v":0},"AB's"]
[null,null,"F-Name",null,null,"# of Hits",null,{"$f":"SUM(J110:AA110)","v":0},"Hits"]
[null,null,null,null,null,"# of PA",null,{"$f":"SUM(J111:AA111)","v":0},"PA"]
[null,null,null,"f",null,"Avg",null,{"$f":"IF(H109=0,\"\",H110/H109)","v":""},"Avg",{"$f":"IF(J109=\"\",\"\",J110/J109)","v":""},"","","","","","","","","",{"$f":"IF(T109=\"\",\"\",T110/T109)","v":""},"","","","","","",""]
[null,{"$f":"$D$1","v":"Bad Pitches"},null,"TEAM",null,"# of AB's",null,{"$f":"SUM(J113:AA113)","v":114},"AB's",{"$f":"IF(SUM(J109,J105,J101,J97,J93,J89,J85,J81,J77,J73,J69,J65,J61,J57,J53,J49,J45,J41,J37,J33,J29,J25,J21,J17,J13)=0,\"\",SUM(J13,J17,J21,J25,J29,J33,J37,J41,J45,J49,J53,J57,J61,J65,J69,J73,J77,J81,J85,J89,J93,J97,J101,J105,J109))","v":42},31,41,"","","","","","","","","","","","","","",""]
[null,null,null,"Summary",null,"# of Hits",null,{"$f":"SUM(J114:AA114)","v":50},"Hits",{"$f":"IF(SUM(J110,J106,J102,J98,J94,J90,J86,J82,J78,J74,J70,J66,J62,J58,J54,J50,J46,J42,J38,J34,J30,J26,J22,J18,J14)=0,\"\",SUM(J14,J18,J22,J26,J30,J34,J38,J42,J46,J50,J54,J58,J62,J66,J70,J74,J78,J82,J86,J90,J94,J98,J102,J106,J110))","v":17},9,24,"","","","","","","","","","","","","","",""]
[null,null,null,null,null,"Avg",null,{"$f":"IF(H113=0,\"N/A\",H114/H113)","v":0.43859649122807015},"Avg",{"$f":"IF(J113=\"\",\"\",J114/J113)","v":0.40476190476190477},0.29032258064516131,0.58536585365853655,"","","","","","","",{"$f":"IF(T113=\"\",\"\",T114/T113)","v":""},"","","","","","",""]

{"sheet":"BCBC","index":2,"n_rows":115,"n_cols":27,"rows_kept":115,"cut":false,"hidden":false,"merged":[]}
[null,null,"Team Name","BCBC",null,null,null,null,"Score",28,9,15,28]
[null,null,null,null,null,null,null,null,"Opponents Score",17,3,14,11]
[null,null,null,"Wins",null,{"$f":"SUM(J6:AA6)","v":4},null,null,"W or L",{"$f":"IF(SUM(J1,J2)=0,\"\",IF(J1<J2,\"L\",\"W\"))","v":"W"},"W","W","W","","","","","","","","","","","","","",""]
[null,null,null,"Losses",null,{"$f":"SUM(J7:AA7)","v":0},null,"Forfeit","FW or FL"]
[null,null,null,null,"games played excluding Forfeit Wins",null,null,null,null,{"$f":"IF(J3=\"\",\"\",IF(J4=\"FW\",\"\",1))","v":1},1,1,1,"","","","","","","","","","","","","",""]
[null,null,null,null,null,null,null,{"$f":"IF(H4=\"w\",1,\"\")","v":""},"win",{"$f":"IF(J3=\"w\",1,\"\")","v":1},1,1,1,"","","","","","","","","","","","","",""]
[null,null,null,null,null,null,null,{"$f":"IF(H4=\"l\",1,\"\")","v":""},"loss",{"$f":"IF(J3=\"l\",1,\"\")","v":""},"","","","","","","","","","","","","","","","",""]
[null,null,null,"Games Played Excluding Forfeit Wins",null,{"$f":"SUM(J5:AA5)","v":4},null,"Opponents Team Name",null,"Ghetto Bombers","Bad Pitches","Sticks","Hit Squad",null,"No Games",null,null,"No Games"]
[null,null,null,"League Run Diff     ",null,{"$f":"SUM(J9:AA9)","v":35},null,null,"Game Run Diff",{"$f":"IF(J1=\"\",\"\",J1-J2)","v":11},6,1,17,"","",null,"","","","","","","","","","",""]
[null,null,null,"Team Batting Avg   ",null,{"$f":"$H$115","v":0.58083832335329344},null,null,"Game Date","2023-04-20","2023-04-27","2023-04-27","2023-05-04","2023-05-11","2023-05-18","2023-05-25","2023-05-25","2023-06-01","2023-06-08"]
[]
[null,null,null,null,null,null,null,"STATS",null,1,2,3,4,5,6,7,8,9,10,11,12,13,14,15,16,17,18]
[1,{"$f":"$D$1","v":"BCBC"},"L-Name","Jordan",null,"# of AB's",null,{"$f":"SUM(J13:AA13)","v":11},"AB's",5,3,3]
[null,null,"F-Name","Rodgers",null,"# of Hits",null,{"$f":"SUM(J14:AA14)","v":7},"Hits",3,2,2]
[null,null,null,null,null,"# of PA",null,{"$f":"SUM(J15:AA15)","v":11},"PA",5,3,3]
[null,null,null,"m",null,"Avg",null,{"$f":"IF(H13=0,\"\",(H14/H13))","v":0.63636363636363635},"Avg",{"$f":"IF(J13=\"\",\"\",J14/J13)","v":0.6},0.66666666666666663,0.66666666666666663,"","","","","","","","","","","","","","",""]
[2,{"$f":"$D$1","v":"BCBC"},"L-Name","Karen",null,"# of AB's",null,{"$f":"SUM(J17:AA17)","v":5},"AB's",5]
[null,null,"F-Name","Springer",null,"# of Hits",null,{"$f":"SUM(J18:AA18)","v":2},"Hits",2]
[null,null,null,null,null,"# of PA",null,{"$f":"SUM(J19:AA19)","v":5},"PA",5]
[null,null,null,"f",null,"Avg",null,{"$f":"IF(H17=0,\"\",H18/H17)","v":0.4},"Avg",{"$f":"IF(J17=\"\",\"\",J18/J17)","v":0.4},"","","","","","","","","","","","","","","","",""]
[3,{"$f":"$D$1","v":"BCBC"},"L-Name","Shane",null,"# of AB's",null,{"$f":"SUM(J21:AA21)","v":16},"AB's",5,3,3,5]
[null,null,"F-Name","Singer",null,"# of Hits",null,{"$f":"SUM(J22:AA22)","v":12},"Hits",4,1,3,4]
[null,null,null,null,null,"# of PA",null,{"$f":"SUM(J23:AA23)","v":16},"PA",5,3,3,5]
[null,null,null,"m",null,"Avg",null,{"$f":"IF(H21=0,\"\",H22/H21)","v":0.75},"Avg",{"$f":"IF(J21=\"\",\"\",J22/J21)","v":0.8},0.33333333333333331,1,0.8,"","","","","","","","","","","","","",""]
[4,{"$f":"$D$1","v":"BCBC"},"L-Name","Maree",null,"# of AB's",null,{"$f":"SUM(J25:AA25)","v":16},"AB's",5,3,3,5]
[null,null,"F-Name","Achermann",null,"# of Hits",null,{"$f":"SUM(J26:AA26)","v":10},"Hits",3,1,3,3]
[null,null,null,null,null,"# of PA",null,{"$f":"SUM(J27:AA27)","v":16},"PA",5,3,3,5]
[null,null,null,"f",null,"Avg",null,{"$f":"IF(H25=0,\"\",H26/H25)","v":0.625},"Avg",{"$f":"IF(J25=\"\",\"\",J26/J25)","v":0.6},0.33333333333333331,1,0.6,"","","","","","","","","","","","","",""]
[5,{"$f":"$D$1","v":"BCBC"},"L-Name","Ben",null,"# of AB's",null,{"$f":"SUM(J29:AA29)","v":13},"AB's",5,null,3,5]
[null,null,"F-Name","Magnum",null,"# of Hits",null,{"$f":"SUM(J30:AA30)","v":9},"Hits",4,null,2,3]
[null,null,null,null,null,"# of PA",null,{"$f":"SUM(J31:AA31)","v":13},"PA",5,null,3,5]
[null,null,null,"m",null,"Avg",null,{"$f":"IF(H29=0,\"\",H30/H29)","v":0.69230769230769229},"Avg",{"$f":"IF(J29=\"\",\"\",J30/J29)","v":0.8},"",0.66666666666666663,0.6,"","","","","","","","","","","","","",""]
[6,{"$f":"$D$1","v":"BCBC"},"L-Name","Sunni",null,"# of AB's",null,{"$f":"SUM(J33:AA33)","v":14},"AB's",5,2,3,4]
[null,null,"F-Name","Jackson",null,"# of Hits",null,{"$f":"SUM(J34:AA34)","v":8},"Hits",3,1,2,2]
[null,null,null,null,null,"# of PA",null,{"$f":"SUM(J35:AA35)","v":15},"PA",5,2,3,5]
[null,null,null,"f",null,"Avg",null,{"$f":"IF(H33=0,\"\",H34/H33)","v":0.5714285714285714},"Avg",{"$f":"IF(J33=\"\",\"\",J34/J33)","v":0.6},0.5,0.66666666666666663,0.5,"","","","","","","","","","","","","",""]
[7,{"$f":"$D$1","v":"BCBC"},"L-Name","Jeff",null,"# of AB's",null,{"$f":"SUM(J37:AA37)","v":13},"AB's",4,2,3,4]
[null,null,"F-Name","Nielsen",null,"# of Hits",null,{"$f":"SUM(J38:AA38)","v":4},"Hits",1,1,0,2]
[null,null,null,null,null,"# of PA",null,{"$f":"SUM(J39:AA39)","v":15},"PA",4,2,3,6]
[null,null,null,"m",null,"Avg",null,{"$f":"IF(H37=0,\"\",H38/H37)","v":0.30769230769230771},"Avg",{"$f":"IF(J37=\"\",\"\",J38/J37)","v":0.25},0.5,0,0.5,"","","","","","","","","","","","","",""]
[8,{"$f":"$D$1","v":"BCBC"},"L-Name","Casey",null,"# of AB's",null,{"$f":"SUM(J41:AA41)","v":10},"AB's",4,3,3]
[null,null,"F-Name","Velarde",null,"# of Hits",null,{"$f":"SUM(J42:AA42)","v":5},"Hits",2,1,2]
[null,null,null,null,null,"# of PA",null,{"$f":"SUM(J43:AA43)","v":10},"PA",4,3,3]
[null,null,null,"f",null,"Avg",null,{"$f":"IF(H41=0,\"\",H42/H41)","v":0.5},"Avg",{"$f":"IF(J41=\"\",\"\",J42/J41)","v":0.5},0.33333333333333331,0.66666666666666663,"","","","","","","","","","","","","","",""]
[9,{"$f":"$D$1","v":"BCBC"},"L-Name","Dustin",null,"# of AB's",null,{"$f":"SUM(J45:AA45)","v":15},"AB's",4,3,3,5]
[null,null,"F-Name","Hunter",null,"# of Hits",null,{"$f":"SUM(J46:AA46)","v":13},"Hits",4,3,2,4]
[null,null,null,null,null,"# of PA",null,{"$f":"SUM(J47:AA47)","v":15},"PA",4,3,3,5]
[null,null,null,"m",null,"Avg",null,{"$f":"IF(H45=0,\"\",H46/H45)","v":0.8666666666666667},"Avg",{"$f":"IF(J45=\"\",\"\",J46/J45)","v":1},1,0.66666666666666663,0.8,"","","","","","","","","","","","","",""]
[10,{"$f":"$D$1","v":"BCBC"},null,"Robyne",null,"# of AB's",null,{"$f":"SUM(J49:AA49)","v":14},"AB's",4,2,3,5]
[null,null,null,"Oostveen",null,"# of Hits",null,{"$f":"SUM(J50:AA50)","v":5},"Hits",2,0,0,3]
[null,null,null,null,null,"# of PA",null,{"$f":"SUM(J51:AA51)","v":14},"PA",4,2,3,5]
[null,null,null,"f",null,"Avg",null,{"$f":"IF(H49=0,\"\",H50/H49)","v":0.35714285714285715},"Avg",{"$f":"IF(J49=\"\",\"\",J50/J49)","v":0.5},0,0,0.6,"","","","","","","","","","","","","",""]
[11,{"$f":"$D$1","v":"BCBC"},"L-Name","Jace",null,"# of AB's",null,{"$f":"SUM(J53:AA53)","v":10},"AB's",4,3,3]
[null,null,"F-Name","Rogers",null,"# of Hits",null,{"$f":"SUM(J54:AA54)","v":6},"Hits",2,1,3]
[null,null,null,null,null,"# of PA",null,{"$f":"SUM(J55:AA55)","v":10},"PA",4,3,3]
[null,null,null,"m",null,"Avg",null,{"$f":"IF(H53=0,\"\",H54/H53)","v":0.6},"Avg",{"$f":"IF(J53=\"\",\"\",J54/J53)","v":0.5},0.33333333333333331,1,"","","","","","","","","","","","","","",""]
[12,{"$f":"$D$1","v":"BCBC"},"Ha","Mel",null,"# of AB's",null,{"$f":"SUM(J57:AA57)","v":13},"AB's",4,2,2,5]
[null,null,"F-Name","Maile",null,"# of Hits",null,{"$f":"SUM(J58:AA58)","v":7},"Hits",4,1,0,2]
[null,null,null,null,null,"# of PA",null,{"$f":"SUM(J59:AA59)","v":13},"PA",4,2,2,5]
[null,null,null,"f",null,"Avg",null,{"$f":"IF(H57=0,\"\",H58/H57)","v":0.53846153846153844},"Avg",{"$f":"IF(J57=\"\",\"\",J58/J57)","v":1},0.5,0,0.4,"","","","","","","","","","","","","",""]
[13,{"$f":"$D$1","v":"BCBC"},"L-Name","Scotty",null,"# of AB's",null,{"$f":"SUM(J61:AA61)","v":2},"AB's",null,2]
[null,null,"F-Name","Garfield",null,"# of Hits",null,{"$f":"SUM(J62:AA62)","v":1},"Hits",null,1]
[null,null,null,null,null,"# of PA",null,{"$f":"SUM(J63:AA63)","v":2},"PA",null,2]
[null,null,null,"m",null,"Avg",null,{"$f":"IF(H61=0,\"\",H62/H61)","v":0.5},"Avg",{"$f":"IF(J61=\"\",\"\",J62/J61)","v":""},0.5,"","","","","","","","","","","","","","","",""]
[14,{"$f":"$D$1","v":"BCBC"},"L-Name","Tiffany",null,"# of AB's",null,{"$f":"SUM(J65:AA65)","v":11},"AB's",null,3,3,5]
[null,null,"F-Name","Morton",null,"# of Hits",null,{"$f":"SUM(J66:AA66)","v":4},"Hits",null,1,2,1]
[null,null,null,null,null,"# of PA",null,{"$f":"SUM(J67:AA67)","v":11},"PA",null,3,3,5]
[null,null,null,"f",null,"Avg",null,{"$f":"IF(H65=0,\"\",H66/H65)","v":0.36363636363636365},"Avg",{"$f":"IF(J65=\"\",\"\",J66/J65)","v":""},0.33333333333333331,0.66666666666666663,0.2,"","","","","","","","","","","","","",""]
[15,{"$f":"$D$1","v":"BCBC"},"L-Name","Vinnie",null,"# of AB's",null,{"$f":"SUM(J69:AA69)","v":4},"AB's",null,null,null,4]
[null,null,"F-Name","Dilworth",null,"# of Hits",null,{"$f":"SUM(J70:AA70)","v":4},"Hits",null,null,null,4]
[null,null,null,null,null,"# of PA",null,{"$f":"SUM(J71:AA71)","v":5},"PA",null,null,null,5]
[null,null,null,"m",null,"Avg",null,{"$f":"IF(H69=0,\"\",H70/H69)","v":1},"Avg",{"$f":"IF(J69=\"\",\"\",J70/J69)","v":""},"","",1,"","","","","","","","","","","","","",""]
[16,{"$f":"$D$1","v":"BCBC"},"L-Name",null,null,"# of AB's",null,{"$f":"SUM(J73:AA73)","v":0},"AB's"]
[null,null,"F-Name",null,null,"# of Hits",null,{"$f":"SUM(J74:AA74)","v":0},"Hits"]
[null,null,null,null,null,"# of PA",null,{"$f":"SUM(J75:AA75)","v":0},"PA"]
[null,null,null,"f",null,"Avg",null,{"$f":"IF(H73=0,\"\",H74/H73)","v":""},"Avg",{"$f":"IF(J73=\"\",\"\",J74/J73)","v":""},"","","","","","","","","","","","","","","","",""]
[17,{"$f":"$D$1","v":"BCBC"},"L-Name",null,null,"# of AB's",null,{"$f":"SUM(J77:AA77)","v":0},"AB's"]
[null,null,"F-Name",null,null,"# of Hits",null,{"$f":"SUM(J78:AA78)","v":0},"Hits"]
[null,null,null,null,null,"# of PA",null,{"$f":"SUM(J79:AA79)","v":0},"PA"]
[null,null,null,"m",null,"Avg",null,{"$f":"IF(H77=0,\"\",H78/H77)","v":""},"Avg",{"$f":"IF(J77=\"\",\"\",J78/J77)","v":""},"","","","","","","","","","","","","","","","",""]
[18,{"$f":"$D$1","v":"BCBC"},"L-Name",null,null,"# of AB's",null,{"$f":"SUM(J81:AA81)","v":0},"AB's"]
[null,null,"F-Name",null,null,"# of Hits",null,{"$f":"SUM(J82:AA82)","v":0},"Hits"]
[null,null,null,null,null,"# of PA",null,{"$f":"SUM(J83:AA83)","v":0},"PA"]
[null,null,null,"f",null,"Avg",null,{"$f":"IF(H81=0,\"\",H82/H81)","v":""},"Avg",{"$f":"IF(J81=\"\",\"\",J82/J81)","v":""},"","","","","","","","","","","","","","","","",""]
[19,{"$f":"$D$1","v":"BCBC"},"L-Name",null,null,"# of AB's",null,{"$f":"SUM(J85:AA85)","v":0},"AB's"]
[null,null,"F-Name",null,null,"# of Hits",null,{"$f":"SUM(J86:AA86)","v":0},"Hits"]
[null,null,null,null,null,"# of PA",null,{"$f":"SUM(J87:AA87)","v":0},"PA"]
[null,null,null,"m",null,"Avg",null,{"$f":"IF(H85=0,\"\",H86/H85)","v":""},"Avg",{"$f":"IF(J85=\"\",\"\",J86/J85)","v":""},"","","","","","","","","","","","","","","","",""]
[20,{"$f":"$D$1","v":"BCBC"},"L-Name",null,null,"# of AB's",null,{"$f":"SUM(J89:AA89)","v":0},"AB's"]
[null,null,"F-Name",null,null,"# of Hits",null,{"$f":"SUM(J90:AA90)","v":0},"Hits"]
[null,null,null,null,null,"# of PA",null,{"$f":"SUM(J91:AA91)","v":0},"PA"]
[null,null,null,"f",null,"Avg",null,{"$f":"IF(H89=0,\"\",H90/H89)","v":""},"Avg",{"$f":"IF(J89=\"\",\"\",J90/J89)","v":""},"","","","","","","","","","","","","","","","",""]
[21,{"$f":"$D$1","v":"BCBC"},"L-Name",null,null,"# of AB's",null,{"$f":"SUM(J93:AA93)","v":0},"AB's"]
[null,null,"F-Name",null,null,"# of Hits",null,{"$f":"SUM(J94:AA94)","v":0},"Hits"]
[null,null,null,null,null,"# of PA",null,{"$f":"SUM(J95:AA95)","v":0},"PA"]
[null,null,null,"m",null,"Avg",null,{"$f":"IF(H93=0,\"\",H94/H93)","v":""},"Avg",{"$f":"IF(J93=\"\",\"\",J94/J93)","v":""},"","","","","","","","","","","","","","","","",""]
[22,{"$f":"$D$1","v":"BCBC"},"L-Name",null,null,"# of AB's",null,{"$f":"SUM(J97:AA97)","v":0},"AB's"]
[null,null,"F-Name",null,null,"# of Hits",null,{"$f":"SUM(J98:AA98)","v":0},"Hits"]
[null,null,null,null,null,"# of PA",null,{"$f":"SUM(J99:AA99)","v":0},"PA"]
[null,null,null,"f",null,"Avg",null,{"$f":"IF(H97=0,\"\",H98/H97)","v":""},"Avg",{"$f":"IF(J97=\"\",\"\",J98/J97)","v":""},"","","","","","","","","","","","","","","","",""]
[23,{"$f":"$D$1","v":"BCBC"},"L-Name",null,null,"# of AB's",null,{"$f":"SUM(J101:AA101)","v":0},"AB's"]
[null,null,"F-Name",null,null,"# of Hits",null,{"$f":"SUM(J102:AA102)","v":0},"Hits"]
[null,null,null,null,null,"# of PA",null,{"$f":"SUM(J103:AA103)","v":0},"PA"]
[null,null,null,"m",null,"Avg",null,{"$f":"IF(H101=0,\"\",H102/H101)","v":""},"Avg",{"$f":"IF(J101=\"\",\"\",J102/J101)","v":""},"","","","","","","","","","","","","","","","",""]
[24,{"$f":"$D$1","v":"BCBC"},"L-Name",null,null,"# of AB's",null,{"$f":"SUM(J105:AA105)","v":0},"AB's"]
[null,null,"F-Name",null,null,"# of Hits",null,{"$f":"SUM(J106:AA106)","v":0},"Hits"]
[null,null,null,null,null,"# of PA",null,{"$f":"SUM(J107:AA107)","v":0},"PA"]
[null,null,null,"f",null,"Avg",null,{"$f":"IF(H105=0,\"\",H106/H105)","v":""},"Avg",{"$f":"IF(J105=\"\",\"\",J106/J105)","v":""},"","","","","","","","","","","","","","","","",""]
[25,{"$f":"$D$1","v":"BCBC"},"L-Name",null,null,"# of AB's",null,{"$f":"SUM(J109:AA109)","v":0},"AB's"]
[null,null,"F-Name",null,null,"# of Hits",null,{"$f":"SUM(J110:AA110)","v":0},"Hits"]
[null,null,null,null,null,"# of PA",null,{"$f":"SUM(J111:AA111)","v":0},"PA"]
[null,null,null,"m",null,"Avg",null,{"$f":"IF(H109=0,\"\",H110/H109)","v":""},"Avg",{"$f":"IF(J109=\"\",\"\",J110/J109)","v":""},"","","","","","","","","","","","","","","","",""]
[null,{"$f":"$D$1","v":"BCBC"},null,"TEAM",null,"# of AB's",null,{"$f":"SUM(J113:AA113)","v":167},"AB's",{"$f":"IF(SUM(J109,J105,J101,J97,J93,J89,J85,J81,J77,J73,J69,J65,J61,J57,J53,J49,J45,J41,J37,J33,J29,J25,J21,J17,J13)=0,\"\",SUM(J13,J17,J21,J25,J29,J33,J37,J41,J45,J49,J53,J57,J61,J65,J69,J73,J77,J81,J85,J89,J93,J97,J101,J105,J109))","v":54},31,35,47,"","","","","","","","","","","","","",""]
[null,null,null,"Summary",null,"# of Hits",null,{"$f":"SUM(J114:AA114)","v":97},"Hits",{"$f":"IF(SUM(J110,J106,J102,J98,J94,J90,J86,J82,J78,J74,J70,J66,J62,J58,J54,J50,J46,J42,J38,J34,J30,J26,J22,J18,J14)=0,\"\",SUM(J14,J18,J22,J26,J30,J34,J38,J42,J46,J50,J54,J58,J62,J66,J70,J74,J78,J82,J86,J90,J94,J98,J102,J106,J110))","v":34},14,21,28,"","","","","","","","","","","","","",""]
[null,null,null,null,null,"Avg",null,{"$f":"IF(H113=0,\"N/A\",H114/H113)","v":0.58083832335329344},"Avg",{"$f":"IF(J113=\"\",\"\",J114/J113)","v":0.62962962962962965},0.45161290322580644,0.6,0.5957446808510638,"","","","","","","","","","","","","",""]

{"sheet":"Ghetto Bombers","index":3,"n_rows":115,"n_cols":27,"rows_kept":115,"cut":false,"hidden":false,"merged":[]}
[null,null,"Team Name","Ghetto Bombers",null,null,null,null,"Score",17,17,14,16]
[null,null,null,null,null,null,null,null,"Opponents Score",28,2,15,19]
[null,null,null,"Wins",null,{"$f":"SUM(J6:AA6)","v":1},null,null,"W or L",{"$f":"IF(SUM(J1,J2)=0,\"\",IF(J1<J2,\"L\",\"W\"))","v":"L"},"W","L","L","","","","","","","","","","","","","",""]
[null,null,null,"Losses",null,{"$f":"SUM(J7:AA7)","v":3},null,"Forfeit","FW or FL"]
[null,null,null,null,"games played excluding Forfeit Wins",null,null,null,null,{"$f":"IF(J3=\"\",\"\",IF(J4=\"FW\",\"\",1))","v":1},1,1,1,"","","","","","","","","","","","","",""]
[null,null,null,null,null,null,null,{"$f":"IF(H4=\"w\",1,\"\")","v":""},"win",{"$f":"IF(J3=\"w\",1,\"\")","v":""},1,"","","","","","","","","","","","","","","",""]
[null,null,null,null,null,null,null,{"$f":"IF(H4=\"l\",1,\"\")","v":""},"loss",{"$f":"IF(J3=\"l\",1,\"\")","v":1},"",1,1,"","","","","","","","","","","","","",""]
[null,null,null,"Games Played Excluding Forfeit Wins",null,{"$f":"SUM(J5:AA5)","v":4},null,"Opponents Team Name",null,"BCBC","Hit Squad","Sticks","Bad Pitches",null,"No Games",null,null,"No Games"]
[null,null,null,"League Run Diff     ",null,{"$f":"SUM(J9:AA9)","v":0},null,null,"Game Run Diff",{"$f":"IF(J1=\"\",\"\",J1-J2)","v":-11},15,-1,-3,"","","","","","","","","","","","","",""]
[null,null,null,"Team Batting Avg   ",null,{"$f":"$H$115","v":0.50322580645161286},null,null,"Game Date","2023-04-20","2023-04-27","2023-05-04","2023-05-04","2023-05-11","2023-05-18","2023-05-25","2023-05-25","2023-06-01","2023-06-08"]
[]
[null,null,null,null,null,null,null,"STATS",null,1,2,3,4,5,6,7,8,9,10,11,12,13,14,15,16,17,18]
[1,{"$f":"$D$1","v":"Ghetto Bombers"},"L-Name","Mac",null,"# of AB's",null,{"$f":"SUM(J13:AA13)","v":15},"AB's",4,4,4,3]
[null,null,"F-Name","Estrada",null,"# of Hits",null,{"$f":"SUM(J14:AA14)","v":12},"Hits",3,4,3,2]
[null,null,null,null,null,"# of PA",null,{"$f":"SUM(J15:AA15)","v":15},"PA",4,4,4,3]
[null,null,null,"m",null,"Avg",null,{"$f":"IF(H13=0,\"\",(H14/H13))","v":0.8},"Avg",{"$f":"IF(J13=\"\",\"\",J14/J13)","v":0.75},1,0.75,0.66666666666666663,"","","","","","","","","","","","","",""]
[2,{"$f":"$D$1","v":"Ghetto Bombers"},"L-Name","Calleigh",null,"# of AB's",null,{"$f":"SUM(J17:AA17)","v":8},"AB's",3,null,2,3]
[null,null,"F-Name","DeYoung",null,"# of Hits",null,{"$f":"SUM(J18:AA18)","v":7},"Hits",2,null,2,3]
[null,null,null,null,null,"# of PA",null,{"$f":"SUM(J19:AA19)","v":12},"PA",4,null,4,4]
[null,null,null,"f",null,"Avg",null,{"$f":"IF(H17=0,\"\",H18/H17)","v":0.875},"Avg",{"$f":"IF(J17=\"\",\"\",J18/J17)","v":0.66666666666666663},"",1,1,"","","","","","","","","","","","","",""]
[3,{"$f":"$D$1","v":"Ghetto Bombers"},"L-Name","Chet",null,"# of AB's",null,{"$f":"SUM(J21:AA21)","v":16},"AB's",4,4,4,4]
[null,null,"F-Name","Wanlass",null,"# of Hits",null,{"$f":"SUM(J22:AA22)","v":11},"Hits",2,3,3,3]
[null,null,null,null,null,"# of PA",null,{"$f":"SUM(J23:AA23)","v":16},"PA",4,4,4,4]
[null,null,null,"m",null,"Avg",null,{"$f":"IF(H21=0,\"\",H22/H21)","v":0.6875},"Avg",{"$f":"IF(J21=\"\",\"\",J22/J21)","v":0.5},0.75,0.75,0.75,"","","","","","","","","","","","","",""]
[4,{"$f":"$D$1","v":"Ghetto Bombers"},"L-Name","JoJo",null,"# of AB's",null,{"$f":"SUM(J25:AA25)","v":16},"AB's",4,4,4,4]
[null,null,"F-Name","Carlson",null,"# of Hits",null,{"$f":"SUM(J26:AA26)","v":5},"Hits",1,4,0,0]
[null,null,null,null,null,"# of PA",null,{"$f":"SUM(J27:AA27)","v":16},"PA",4,4,4,4]
[null,null,null,"f",null,"Avg",null,{"$f":"IF(H25=0,\"\",H26/H25)","v":0.3125},"Avg",{"$f":"IF(J25=\"\",\"\",J26/J25)","v":0.25},1,0,0,"","","","","","","","","","","","","",""]
[5,{"$f":"$D$1","v":"Ghetto Bombers"},"L-Name","Jon ",null,"# of AB's",null,{"$f":"SUM(J29:AA29)","v":14},"AB's",4,4,3,3]
[null,null,"F-Name","Staley",null,"# of Hits",null,{"$f":"SUM(J30:AA30)","v":8},"Hits",3,2,2,1]
[null,null,null,null,null,"# of PA",null,{"$f":"SUM(J31:AA31)","v":14},"PA",4,4,3,3]
[null,null,null,"m",null,"Avg",null,{"$f":"IF(H29=0,\"\",H30/H29)","v":0.5714285714285714},"Avg",{"$f":"IF(J29=\"\",\"\",J30/J29)","v":0.75},0.5,0.66666666666666663,0.33333333333333331,"","","","","","","","","","","","","",""]
[6,{"$f":"$D$1","v":"Ghetto Bombers"},"L-Name","Angela",null,"# of AB's",null,{"$f":"SUM(J33:AA33)","v":10},"AB's",4,null,3,3]
[null,null,"F-Name","Ahmadpour",null,"# of Hits",null,{"$f":"SUM(J34:AA34)","v":1},"Hits",0,null,1,0]
[null,null,null,null,null,"# of PA",null,{"$f":"SUM(J35:AA35)","v":10},"PA",4,null,3,3]
[null,null,null,"f",null,"Avg",null,{"$f":"IF(H33=0,\"\",H34/H33)","v":0.1},"Avg",{"$f":"IF(J33=\"\",\"\",J34/J33)","v":0},"",0.33333333333333331,0,"","","","","","","","","","","","","",""]
[7,{"$f":"$D$1","v":"Ghetto Bombers"},"L-Name","Derek",null,"# of AB's",null,{"$f":"SUM(J37:AA37)","v":14},"AB's",4,4,3,3]
[null,null,"F-Name","Smith",null,"# of Hits",null,{"$f":"SUM(J38:AA38)","v":6},"Hits",1,1,2,2]
[null,null,null,null,null,"# of PA",null,{"$f":"SUM(J39:AA39)","v":14},"PA",4,4,3,3]
[null,null,null,"m",null,"Avg",null,{"$f":"IF(H37=0,\"\",H38/H37)","v":0.42857142857142855},"Avg",{"$f":"IF(J37=\"\",\"\",J38/J37)","v":0.25},0.25,0.66666666666666663,0.66666666666666663,"","","","","","","","","","","","","",""]
[8,{"$f":"$D$1","v":"Ghetto Bombers"},"L-Name","Brandi",null,"# of AB's",null,{"$f":"SUM(J41:AA41)","v":13},"AB's",3,4,3,3]
[null,null,"F-Name","Hall",null,"# of Hits",null,{"$f":"SUM(J42:AA42)","v":6},"Hits",1,3,1,1]
[null,null,null,null,null,"# of PA",null,{"$f":"SUM(J43:AA43)","v":13},"PA",3,4,3,3]
[null,null,null,"f",null,"Avg",null,{"$f":"IF(H41=0,\"\",H42/H41)","v":0.46153846153846156},"Avg",null,null,null,null,null,null,null,null,{"$f":"IF(R41=\"\",\"\",R42/R41)","v":""},"","","","","","","","",""]
[9,{"$f":"$D$1","v":"Ghetto Bombers"},"L-Name","Dave",null,"# of AB's",null,{"$f":"SUM(J45:AA45)","v":9},"AB's",1,3,3,2]
[null,null,"F-Name","Vu",null,"# of Hits",null,{"$f":"SUM(J46:AA46)","v":4},"Hits",1,1,1,1]
[null,null,null,null,null,"# of PA",null,{"$f":"SUM(J47:AA47)","v":13},"PA",3,4,3,3]
[null,null,null,"m",null,"Avg",null,{"$f":"IF(H45=0,\"\",H46/H45)","v":0.44444444444444442},"Avg",{"$f":"IF(J45=\"\",\"\",J46/J45)","v":1},0.33333333333333331,0.33333333333333331,0.5,"","","","","","","","","","","","","",""]
[10,{"$f":"$D$1","v":"Ghetto Bombers"},"L-Name","Hope",null,"# of AB's",null,{"$f":"SUM(J49:AA49)","v":1},"AB's",1]
[null,null,"F-Name","Curtis",null,"# of Hits",null,{"$f":"SUM(J50:AA50)","v":0},"Hits",0]
[null,null,null,null,null,"# of PA",null,{"$f":"SUM(J51:AA51)","v":3},"PA",3]
[null,null,null,"f",null,"Avg",null,{"$f":"IF(H49=0,\"\",H50/H49)","v":0},"Avg",{"$f":"IF(J49=\"\",\"\",J50/J49)","v":0},"","","",null,"","","","","","","","","","","","",""]
[11,{"$f":"$D$1","v":"Ghetto Bombers"},"L-Name","Tyler",null,"# of AB's",null,{"$f":"SUM(J53:AA53)","v":3},"AB's",3]
[null,null,"F-Name","Curtis",null,"# of Hits",null,{"$f":"SUM(J54:AA54)","v":2},"Hits",2]
[null,null,null,null,null,"# of PA",null,{"$f":"SUM(J55:AA55)","v":3},"PA",3]
[null,null,null,"m",null,"Avg",null,{"$f":"IF(H53=0,\"\",H54/H53)","v":0.66666666666666663},"Avg",{"$f":"IF(J53=\"\",\"\",J54/J53)","v":0.66666666666666663},"","","","","","","","","","","","","","","","",""]
[12,{"$f":"$D$1","v":"Ghetto Bombers"},"L-Name","Ali",null,"# of AB's",null,{"$f":"SUM(J57:AA57)","v":11},"AB's",3,4,1,3]
[null,null,"F-Name","Smith",null,"# of Hits",null,{"$f":"SUM(J58:AA58)","v":3},"Hits",0,3,0,0]
[null,null,null,null,null,"# of PA",null,{"$f":"SUM(J59:AA59)","v":13},"PA",3,4,3,3]
[null,null,null,"f",null,"Avg",null,{"$f":"IF(H57=0,\"\",H58/H57)","v":0.27272727272727271},"Avg",{"$f":"IF(J57=\"\",\"\",J58/J57)","v":0},0.75,0,0,"","","","","","","","","","","","","",""]
[13,{"$f":"$D$1","v":"Ghetto Bombers"},"L-Name","Ryan",null,"# of AB's",null,{"$f":"SUM(J61:AA61)","v":11},"AB's",null,4,4,3]
[null,null,"F-Name","Newbold",null,"# of Hits",null,{"$f":"SUM(J62:AA62)","v":10},"Hits",null,3,4,3]
[null,null,null,null,null,"# of PA",null,{"$f":"SUM(J63:AA63)","v":11},"PA",null,4,4,3]
[null,null,null,"m",null,"Avg",null,{"$f":"IF(H61=0,\"\",H62/H61)","v":0.90909090909090906},"Avg",{"$f":"IF(J61=\"\",\"\",J62/J61)","v":""},0.75,1,1,"","","","","","","","","","","","","",""]
[14,{"$f":"$D$1","v":"Ghetto Bombers"},"L-Name","Alllie",null,"# of AB's",null,{"$f":"SUM(J65:AA65)","v":4},"AB's",null,4]
[null,null,"F-Name","Newbold",null,"# of Hits",null,{"$f":"SUM(J66:AA66)","v":0},"Hits",null,0]
[null,null,null,null,null,"# of PA",null,{"$f":"SUM(J67:AA67)","v":4},"PA",null,4]
[null,null,null,"m",null,"Avg",null,{"$f":"IF(H65=0,\"\",H66/H65)","v":0},"Avg",{"$f":"IF(J65=\"\",\"\",J66/J65)","v":""},0,"","","","","","","","","","","","","","","",""]
[15,{"$f":"$D$1","v":"Ghetto Bombers"},"L-Name","Heidi",null,"# of AB's",null,{"$f":"SUM(J69:AA69)","v":9},"AB's",null,3,3,3]
[null,null,"F-Name","Talor",null,"# of Hits",null,{"$f":"SUM(J70:AA70)","v":2},"Hits",null,2,0,0]
[null,null,null,null,null,"# of PA",null,{"$f":"SUM(J71:AA71)","v":9},"PA",null,3,3,3]
[null,null,null,"f",null,"Avg",null,{"$f":"IF(H69=0,\"\",H70/H69)","v":0.22222222222222221},"Avg",{"$f":"IF(J69=\"\",\"\",J70/J69)","v":""},0.66666666666666663,0,0,"","","","","","","","","","","","","",""]
[16,{"$f":"$D$1","v":"Ghetto Bombers"},"L-Name","Matt",null,"# of AB's",null,{"$f":"SUM(J73:AA73)","v":1},"AB's",null,null,null,1]
[null,null,"F-Name","Newbold",null,"# of Hits",null,{"$f":"SUM(J74:AA74)","v":1},"Hits",null,null,null,1]
[null,null,null,null,null,"# of PA",null,{"$f":"SUM(J75:AA75)","v":1},"PA",null,null,null,1]
[null,null,null,"m",null,"Avg",null,{"$f":"IF(H73=0,\"\",H74/H73)","v":1},"Avg",{"$f":"IF(J73=\"\",\"\",J74/J73)","v":""},"","",1,"","","","","","","","","","","","","",""]
[17,{"$f":"$D$1","v":"Ghetto Bombers"},"L-Name",null,null,"# of AB's",null,{"$f":"SUM(J77:AA77)","v":0},"AB's"]
[null,null,"F-Name",null,null,"# of Hits",null,{"$f":"SUM(J78:AA78)","v":0},"Hits"]
[null,null,null,null,null,"# of PA",null,{"$f":"SUM(J79:AA79)","v":0},"PA"]
[null,null,null,"m",null,"Avg",null,{"$f":"IF(H77=0,\"\",H78/H77)","v":""},"Avg",{"$f":"IF(J77=\"\",\"\",J78/J77)","v":""},"","","","","","","","","","","","","","","","",""]
[18,{"$f":"$D$1","v":"Ghetto Bombers"},"L-Name",null,null,"# of AB's",null,{"$f":"SUM(J81:AA81)","v":0},"AB's"]
[null,null,"F-Name",null,null,"# of Hits",null,{"$f":"SUM(J82:AA82)","v":0},"Hits"]
[null,null,null,null,null,"# of PA",null,{"$f":"SUM(J83:AA83)","v":0},"PA"]
[null,null,null,"f",null,"Avg",null,{"$f":"IF(H81=0,\"\",H82/H81)","v":""},"Avg",{"$f":"IF(J81=\"\",\"\",J82/J81)","v":""},"","","","","","","","","","","","","","","","",""]
[19,{"$f":"$D$1","v":"Ghetto Bombers"},"L-Name",null,null,"# of AB's",null,{"$f":"SUM(J85:AA85)","v":0},"AB's"]
[null,null,"F-Name",null,null,"# of Hits",null,{"$f":"SUM(J86:AA86)","v":0},"Hits"]
[null,null,null,null,null,"# of PA",null,{"$f":"SUM(J87:AA87)","v":0},"PA"]
[null,null,null,"m",null,"Avg",null,{"$f":"IF(H85=0,\"\",H86/H85)","v":""},"Avg",{"$f":"IF(J85=\"\",\"\",J86/J85)","v":""},"","","","","","","","","","","","","","","","",""]
[20,{"$f":"$D$1","v":"Ghetto Bombers"},"L-Name",null,null,"# of AB's",null,{"$f":"SUM(J89:AA89)","v":0},"AB's"]
[null,null,"F-Name",null,null,"# of Hits",null,{"$f":"SUM(J90:AA90)","v":0},"Hits"]
[null,null,null,null,null,"# of PA",null,{"$f":"SUM(J91:AA91)","v":0},"PA"]
[null,null,null,"f",null,"Avg",null,{"$f":"IF(H89=0,\"\",H90/H89)","v":""},"Avg",{"$f":"IF(J89=\"\",\"\",J90/J89)","v":""},"","","","","","","","","","","","","","","","",""]
[21,{"$f":"$D$1","v":"Ghetto Bombers"},"L-Name",null,null,"# of AB's",null,{"$f":"SUM(J93:AA93)","v":0},"AB's"]
[null,null,"F-Name",null,null,"# of Hits",null,{"$f":"SUM(J94:AA94)","v":0},"Hits"]
[null,null,null,null,null,"# of PA",null,{"$f":"SUM(J95:AA95)","v":0},"PA"]
[null,null,null,"m",null,"Avg",null,{"$f":"IF(H93=0,\"\",H94/H93)","v":""},"Avg",{"$f":"IF(J93=\"\",\"\",J94/J93)","v":""},"","","","","","","","","","","","","","","","",""]
[22,{"$f":"$D$1","v":"Ghetto Bombers"},"L-Name",null,null,"# of AB's",null,{"$f":"SUM(J97:AA97)","v":0},"AB's"]
[null,null,"F-Name",null,null,"# of Hits",null,{"$f":"SUM(J98:AA98)","v":0},"Hits"]
[null,null,null,null,null,"# of PA",null,{"$f":"SUM(J99:AA99)","v":0},"PA"]
[null,null,null,"f",null,"Avg",null,{"$f":"IF(H97=0,\"\",H98/H97)","v":""},"Avg",{"$f":"IF(J97=\"\",\"\",J98/J97)","v":""},"","","","","","","","","","","","","","","","",""]
[23,{"$f":"$D$1","v":"Ghetto Bombers"},"L-Name",null,null,"# of AB's",null,{"$f":"SUM(J101:AA101)","v":0},"AB's"]
[null,null,"F-Name",null,null,"# of Hits",null,{"$f":"SUM(J102:AA102)","v":0},"Hits"]
[null,null,null,null,null,"# of PA",null,{"$f":"SUM(J103:AA103)","v":0},"PA"]
[null,null,null,"f",null,"Avg",null,{"$f":"IF(H101=0,\"\",H102/H101)","v":""},"Avg",{"$f":"IF(J101=\"\",\"\",J102/J101)","v":""},"","","","","","","","","","","","","","","","",""]
[24,{"$f":"$D$1","v":"Ghetto Bombers"},"L-Name",null,null,"# of AB's",null,{"$f":"SUM(J105:AA105)","v":0},"AB's"]
[null,null,"F-Name",null,null,"# of Hits",null,{"$f":"SUM(J106:AA106)","v":0},"Hits"]
[null,null,null,null,null,"# of PA",null,{"$f":"SUM(J107:AA107)","v":0},"PA"]
[null,null,null,"f",null,"Avg",null,{"$f":"IF(H105=0,\"\",H106/H105)","v":""},"Avg",{"$f":"IF(J105=\"\",\"\",J106/J105)","v":""},"","","","","","","","","","","","","","","","",""]
[25,{"$f":"$D$1","v":"Ghetto Bombers"},"L-Name",null,null,"# of AB's",null,{"$f":"SUM(J109:AA109)","v":0},"AB's"]
[null,null,"F-Name",null,null,"# of Hits",null,{"$f":"SUM(J110:AA110)","v":0},"Hits"]
[null,null,null,null,null,"# of PA",null,{"$f":"SUM(J111:AA111)","v":0},"PA"]
[null,null,null,"f",null,"Avg",null,{"$f":"IF(H109=0,\"\",H110/H109)","v":""},"Avg",{"$f":"IF(J109=\"\",\"\",J110/J109)","v":""},"","","","","","","","","","","","","","","","",""]
[null,{"$f":"$D$1","v":"Ghetto Bombers"},null,"TEAM",null,"# of AB's",null,{"$f":"SUM(J113:AA113)","v":155},"AB's",{"$f":"IF(SUM(J109,J105,J101,J97,J93,J89,J85,J81,J77,J73,J69,J65,J61,J57,J53,J49,J45,J41,J37,J33,J29,J25,J21,J17,J13)=0,\"\",SUM(J13,J17,J21,J25,J29,J33,J37,J41,J45,J49,J53,J57,J61,J65,J69,J73,J77,J81,J85,J89,J93,J97,J101,J105,J109))","v":38},42,37,38,"","","","","","","","","","","","","",""]
[null,null,null,"Summary",null,"# of Hits",null,{"$f":"SUM(J114:AA114)","v":78},"Hits",{"$f":"IF(SUM(J110,J106,J102,J98,J94,J90,J86,J82,J78,J74,J70,J66,J62,J58,J54,J50,J46,J42,J38,J34,J30,J26,J22,J18,J14)=0,\"\",SUM(J14,J18,J22,J26,J30,J34,J38,J42,J46,J50,J54,J58,J62,J66,J70,J74,J78,J82,J86,J90,J94,J98,J102,J106,J110))","v":16},26,19,17,"","","","","","","","","","","","","",""]
[null,null,null,null,null,"Avg",null,{"$f":"IF(H113=0,\"N/A\",H114/H113)","v":0.50322580645161286},"Avg",{"$f":"IF(J113=\"\",\"\",J114/J113)","v":0.42105263157894735},0.61904761904761907,0.51351351351351349,0.44736842105263158,"","","","","","","","","","","","","",""]

{"sheet":"Hit Squad","index":4,"n_rows":115,"n_cols":27,"rows_kept":115,"cut":false,"hidden":false,"merged":[]}
[null,null,"Team Name","Hit Squad",null,null,null,null,"Score",4,2,11]
[null,null,null,null,null,null,null,null,"Opponents Score",20,17,28]
[null,null,null,"Wins",null,{"$f":"SUM(J6:AA6)","v":0},null,null,"W or L",{"$f":"IF(SUM(J1,J2)=0,\"\",IF(J1<J2,\"L\",\"W\"))","v":"L"},"L","L","","","","",{"$f":"IF(SUM(Q1,Q2)=0,\"\",IF(Q1<Q2,\"L\",\"W\"))","v":""},"","","","","","","","","",""]
[null,null,null,"Losses",null,{"$f":"SUM(J7:AA7)","v":3},null,"Forfeit","FW or FL",null,null,null,null,null,null,null,null,"  "]
[null,null,null,null,"games played excluding Forfeit Wins",null,null,null,null,{"$f":"IF(J3=\"\",\"\",IF(J4=\"FW\",\"\",1))","v":1},1,1,"","","","",{"$f":"IF(Q3=\"\",\"\",IF(Q4=\"FW\",\"\",1))","v":""},"","","","","","","","","",""]
[null,null,null,null,null,null,null,{"$f":"IF(H4=\"w\",1,\"\")","v":""},"win",{"$f":"IF(J3=\"w\",1,\"\")","v":""},"","","","","","",{"$f":"IF(Q3=\"w\",1,\"\")","v":""},"","","","","","","","","",""]
[null,null,null,null,null,null,null,{"$f":"IF(H4=\"l\",1,\"\")","v":""},"loss",{"$f":"IF(J3=\"l\",1,\"\")","v":1},1,1,"","","","",{"$f":"IF(Q3=\"l\",1,\"\")","v":""},"","","","","","","","","",""]
[null,null,null,"Games Played Excluding Forfeit Wins",null,{"$f":"SUM(J5:AA5)","v":3},null,"Opponents Team Name",null,"Sticks","Getto Bombers","BCBC",null,null,"No Games",null,"No Games"]
[null,null,null,"League Run Diff     ",null,{"$f":"SUM(J9:AA9)","v":-48},null,null,"Game Run Diff",{"$f":"IF(J1=\"\",\"\",J1-J2)","v":-16},-15,-17,"","","","",{"$f":"IF(Q1=\"\",\"\",Q1-Q2)","v":""},"","","","","","","","","",""]
[null,null,null,"Team Batting Avg   ",null,{"$f":"$H$115","v":0.39759036144578314},null,null,"Game Date","2023-04-20","2023-04-27","2023-05-04","2023-05-11","2023-05-11","2023-05-18","2023-05-25","2023-06-01","2023-06-08","2023-06-08"]
[]
[null,null,null,null,null,null,null,"STATS",null,1,2,3,4,5,6,7,8,9,10,11,12,13,14,15,16,17,18]
[1,{"$f":"$D$1","v":"Hit Squad"},"L-Name","Ryan ",null,"# of AB's",null,{"$f":"SUM(J13:AA13)","v":8},"AB's",3,2,3]
[null,null,"F-Name","Cusick",null,"# of Hits",null,{"$f":"SUM(J14:AA14)","v":7},"Hits",3,2,2]
[null,null,null,null,null,"# of PA",null,{"$f":"SUM(J15:AA15)","v":8},"PA",3,2,3]
[null,null,null,"m",null,"Avg",null,{"$f":"IF(H13=0,\"\",(H14/H13))","v":0.875},"Avg",{"$f":"IF(J13=\"\",\"\",J14/J13)","v":1},1,0.66666666666666663,"","","","",{"$f":"IF(Q13=\"\",\"\",Q14/Q13)","v":""},"","","","","","","","","",""]
[2,{"$f":"$D$1","v":"Hit Squad"},"L-Name","Miche",null,"# of AB's",null,{"$f":"SUM(J17:AA17)","v":7},"AB's",3,2,2]
[null,null,"F-Name","Ferrin",null,"# of Hits",null,{"$f":"SUM(J18:AA18)","v":1},"Hits",0,1,0]
[null,null,null,null,null,"# of PA",null,{"$f":"SUM(J19:AA19)","v":7},"PA",3,2,2]
[null,null,null,"f",null,"Avg",null,{"$f":"IF(H17=0,\"\",H18/H17)","v":0.14285714285714285},"Avg",{"$f":"IF(J17=\"\",\"\",J18/J17)","v":0},0.5,0,"","","","",{"$f":"IF(Q17=\"\",\"\",Q18/Q17)","v":""},"","","","","","","","","",""]
[3,{"$f":"$D$1","v":"Hit Squad"},"L-Name","David",null,"# of AB's",null,{"$f":"SUM(J21:AA21)","v":7},"AB's",2,2,3]
[null,null,"F-Name","Stevens",null,"# of Hits",null,{"$f":"SUM(J22:AA22)","v":5},"Hits",2,2,1]
[null,null,null,null,null,"# of PA",null,{"$f":"SUM(J23:AA23)","v":7},"PA",2,2,3]
[null,null,null,"m",null,"Avg",null,{"$f":"IF(H21=0,\"\",H22/H21)","v":0.7142857142857143},"Avg",{"$f":"IF(J21=\"\",\"\",J22/J21)","v":1},1,0.33333333333333331,"","","","",{"$f":"IF(Q21=\"\",\"\",Q22/Q21)","v":""},"","","","","","","","","",""]
[4,{"$f":"$D$1","v":"Hit Squad"},"L-Name","Amber ",null,"# of AB's",null,{"$f":"SUM(J25:AA25)","v":7},"AB's",2,2,3]
[null,null,"F-Name","Romero",null,"# of Hits",null,{"$f":"SUM(J26:AA26)","v":2},"Hits",1,0,1]
[null,null,null,null,null,"# of PA",null,{"$f":"SUM(J27:AA27)","v":7},"PA",2,2,3]
[null,null,null,"f",null,"Avg",null,{"$f":"IF(H25=0,\"\",H26/H25)","v":0.2857142857142857},"Avg",{"$f":"IF(J25=\"\",\"\",J26/J25)","v":0.5},0,0.33333333333333331,"","","","",{"$f":"IF(Q25=\"\",\"\",Q26/Q25)","v":""},"","","","","","","","","",""]
[5,{"$f":"$D$1","v":"Hit Squad"},"L-Name","Jeff",null,"# of AB's",null,{"$f":"SUM(J29:AA29)","v":5},"AB's",2,3]
[null,null,"F-Name","Snedekar",null,"# of Hits",null,{"$f":"SUM(J30:AA30)","v":2},"Hits",2,0]
[null,null,null,null,null,"# of PA",null,{"$f":"SUM(J31:AA31)","v":5},"PA",2,3]
[null,null,null,"m",null,"Avg",null,{"$f":"IF(H29=0,\"\",H30/H29)","v":0.4},"Avg",{"$f":"IF(J29=\"\",\"\",J30/J29)","v":1},0,"","","","","",{"$f":"IF(Q29=\"\",\"\",Q30/Q29)","v":""},"","","","","","","","","",""]
[6,{"$f":"$D$1","v":"Hit Squad"},"L-Name","Michelle",null,"# of AB's",null,{"$f":"SUM(J33:AA33)","v":7},"AB's",2,2,3]
[null,null,"F-Name","Mears",null,"# of Hits",null,{"$f":"SUM(J34:AA34)","v":0},"Hits",0,0,0]
[null,null,null,null,null,"# of PA",null,{"$f":"SUM(J35:AA35)","v":7},"PA",2,2,3]
[null,null,null,"f",null,"Avg",null,{"$f":"IF(H33=0,\"\",H34/H33)","v":0},"Avg",{"$f":"IF(J33=\"\",\"\",J34/J33)","v":0},0,0,"","","","",{"$f":"IF(Q33=\"\",\"\",Q34/Q33)","v":""},"","","","","","","","","",""]
[7,{"$f":"$D$1","v":"Hit Squad"},"L-Name","Dusty",null,"# of AB's",null,{"$f":"SUM(J37:AA37)","v":7},"AB's",2,2,3]
[null,null,"F-Name","Jorgenson",null,"# of Hits",null,{"$f":"SUM(J38:AA38)","v":1},"Hits",1,0,0]
[null,null,null,null,null,"# of PA",null,{"$f":"SUM(J39:AA39)","v":7},"PA",2,2,3]
[null,null,null,"m",null,"Avg",null,{"$f":"IF(H37=0,\"\",H38/H37)","v":0.14285714285714285},"Avg",{"$f":"IF(J37=\"\",\"\",J38/J37)","v":0.5},0,0,"","","","",{"$f":"IF(Q37=\"\",\"\",Q38/Q37)","v":""},"","","","","","","","","",""]
[8,{"$f":"$D$1","v":"Hit Squad"},"L-Name","Kelly",null,"# of AB's",null,{"$f":"SUM(J41:AA41)","v":5},"AB's",2,3]
[null,null,"F-Name","Noakes",null,"# of Hits",null,{"$f":"SUM(J42:AA42)","v":1},"Hits",0,1]
[null,null,null,null,null,"# of PA",null,{"$f":"SUM(J43:AA43)","v":5},"PA",2,3]
[null,null,null,"f",null,"Avg",null,{"$f":"IF(H41=0,\"\",H42/H41)","v":0.2},"Avg",{"$f":"IF(J41=\"\",\"\",J42/J41)","v":0},0.33333333333333331,"","","","","",{"$f":"IF(Q41=\"\",\"\",Q42/Q41)","v":""},"","","","","","","","","",""]
[9,{"$f":"$D$1","v":"Hit Squad"},"L-Name","Chris",null,"# of AB's",null,{"$f":"SUM(J45:AA45)","v":7},"AB's",2,2,3]
[null,null,"F-Name","Schippers",null,"# of Hits",null,{"$f":"SUM(J46:AA46)","v":5},"Hits",1,2,2]
[null,null,null,null,null,"# of PA",null,{"$f":"SUM(J47:AA47)","v":7},"PA",2,2,3]
[null,null,null,"m",null,"Avg",null,{"$f":"IF(H45=0,\"\",H46/H45)","v":0.7142857142857143},"Avg",{"$f":"IF(J45=\"\",\"\",J46/J45)","v":0.5},1,0.66666666666666663,"","","","",{"$f":"IF(Q45=\"\",\"\",Q46/Q45)","v":""},"","","","","","","","","",""]
[10,{"$f":"$D$1","v":"Hit Squad"},"L-Name","Tasha",null,"# of AB's",null,{"$f":"SUM(J49:AA49)","v":7},"AB's",2,2,3]
[null,null,"F-Name","Harbaugh",null,"# of Hits",null,{"$f":"SUM(J50:AA50)","v":3},"Hits",1,0,2]
[null,null,null,null,null,"# of PA",null,{"$f":"SUM(J51:AA51)","v":7},"PA",2,2,3]
[null,null,null,"f",null,"Avg",null,{"$f":"IF(H49=0,\"\",H50/H49)","v":0.42857142857142855},"Avg",{"$f":"IF(J49=\"\",\"\",J50/J49)","v":0.5},{"$f":"IF(K49=\"\",\"\",K50/K49)","v":0},0.66666666666666663,"","","","",{"$f":"IF(Q49=\"\",\"\",Q50/Q49)","v":""},"","","","","","","","","",""]
[11,{"$f":"$D$1","v":"Hit Squad"},"L-Name","Dan ",null,"# of AB's",null,{"$f":"SUM(J53:AA53)","v":6},"AB's",2,2,2]
[null,null,"F-Name","Stevens",null,"# of Hits",null,{"$f":"SUM(J54:AA54)","v":2},"Hits",0,1,1]
[null,null,null,null,null,"# of PA",null,{"$f":"SUM(J55:AA55)","v":6},"PA",2,2,2]
[null,null,null,"m",null,"Avg",null,{"$f":"IF(H53=0,\"\",H54/H53)","v":0.33333333333333331},"Avg",{"$f":"IF(J53=\"\",\"\",J54/J53)","v":0},{"$f":"IF(K53=\"\",\"\",K54/K53)","v":0.5},0.5,"","","","",{"$f":"IF(Q53=\"\",\"\",Q54/Q53)","v":""},"","","","","","","","","",""]
[12,{"$f":"$D$1","v":"Hit Squad"},"L-Name","Kelli",null,"# of AB's",null,{"$f":"SUM(J57:AA57)","v":2},"AB's",2]
[null,null,"F-Name","Hansen",null,"# of Hits",null,{"$f":"SUM(J58:AA58)","v":0},"Hits",0]
[null,null,null,null,null,"# of PA",null,{"$f":"SUM(J59:AA59)","v":2},"PA",2]
[null,null,null,"f",null,"Avg",null,{"$f":"IF(H57=0,\"\",H58/H57)","v":0},"Avg",{"$f":"IF(J57=\"\",\"\",J58/J57)","v":0},"","","","","","",{"$f":"IF(Q57=\"\",\"\",Q58/Q57)","v":""},"","","","","","","","","",""]
[13,{"$f":"$D$1","v":"Hit Squad"},"L-Name","Kellie",null,"# of AB's",null,{"$f":"SUM(J61:AA61)","v":1},"AB's",null,1]
[null,null,"F-Name","Molis",null,"# of Hits",null,{"$f":"SUM(J62:AA62)","v":0},"Hits",null,0]
[null,null,null,null,null,"# of PA",null,{"$f":"SUM(J63:AA63)","v":1},"PA",null,1]
[null,null,null,"f",null,"Avg",null,{"$f":"IF(H61=0,\"\",H62/H61)","v":0},"Avg",{"$f":"IF(J61=\"\",\"\",J62/J61)","v":""},0,"","","","","",{"$f":"IF(Q61=\"\",\"\",Q62/Q61)","v":""},"","","","","","","","","",""]
[14,{"$f":"$D$1","v":"Hit Squad"},"L-Name","Shannon",null,"# of AB's",null,{"$f":"SUM(J65:AA65)","v":3},"AB's",null,null,3]
[null,null,"F-Name","Adair",null,"# of Hits",null,{"$f":"SUM(J66:AA66)","v":2},"Hits",null,null,2]
[null,null,null,null,null,"# of PA",null,{"$f":"SUM(J67:AA67)","v":3},"PA",null,null,3]
[null,null,null,"f",null,"Avg",null,{"$f":"IF(H65=0,\"\",H66/H65)","v":0.66666666666666663},"Avg",{"$f":"IF(J65=\"\",\"\",J66/J65)","v":""},"",0.66666666666666663,"","","","",{"$f":"IF(Q65=\"\",\"\",Q66/Q65)","v":""},"","","","","","","","","",""]
[15,{"$f":"$D$1","v":"Hit Squad"},"L-Name","Rachel ",null,"# of AB's",null,{"$f":"SUM(J69:AA69)","v":2},"AB's",null,null,2]
[null,null,"F-Name","Russell",null,"# of Hits",null,{"$f":"SUM(J70:AA70)","v":0},"Hits",null,null,0]
[null,null,null,null,null,"# of PA",null,{"$f":"SUM(J71:AA71)","v":2},"PA",null,null,2]
[null,null,null,"f",null,"Avg",null,{"$f":"IF(H69=0,\"\",H70/H69)","v":0},"Avg",{"$f":"IF(J69=\"\",\"\",J70/J69)","v":""},"",0,"","","","",{"$f":"IF(Q69=\"\",\"\",Q70/Q69)","v":""},"","","","","","","","","",""]
[16,{"$f":"$D$1","v":"Hit Squad"},"L-Name","Lars",null,"# of AB's",null,{"$f":"SUM(J73:AA73)","v":2},"AB's",null,null,2]
[null,null,"F-Name","Peterson",null,"# of Hits",null,{"$f":"SUM(J74:AA74)","v":2},"Hits",null,null,2]
[null,null,null,null,null,"# of PA",null,{"$f":"SUM(J75:AA75)","v":2},"PA",null,null,2]
[null,null,null,"m",null,"Avg",null,{"$f":"IF(H73=0,\"\",H74/H73)","v":1},"Avg",{"$f":"IF(J73=\"\",\"\",J74/J73)","v":""},"",1,"","","","",{"$f":"IF(Q73=\"\",\"\",Q74/Q73)","v":""},"","","","","",null,{"$f":"IF(X73=\"\",\"\",X74/X73)","v":""},{"$f":"IF(Y73=\"\",\"\",Y74/Y73)","v":""},{"$f":"IF(Z73=\"\",\"\",Z74/Z73)","v":""},{"$f":"IF(AA73=\"\",\"\",AA74/AA73)","v":""}]
[17,{"$f":"$D$1","v":"Hit Squad"},"L-Name",null,null,"# of AB's",null,{"$f":"SUM(J77:AA77)","v":0},"AB's"]
[null,null,"F-Name",null,null,"# of Hits",null,{"$f":"SUM(J78:AA78)","v":0},"Hits"]
[null,null,null,null,null,"# of PA",null,{"$f":"SUM(J79:AA79)","v":0},"PA"]
[null,null,null,"m",null,"Avg",null,{"$f":"IF(H77=0,\"\",H78/H77)","v":""},"Avg",{"$f":"IF(J77=\"\",\"\",J78/J77)","v":""},"","","","","","",{"$f":"IF(Q77=\"\",\"\",Q78/Q77)","v":""},"","","","","","","","","",""]
[18,{"$f":"$D$1","v":"Hit Squad"},"L-Name",null,null,"# of AB's",null,{"$f":"SUM(J81:AA81)","v":0},"AB's"]
[null,null,"F-Name",null,null,"# of Hits",null,{"$f":"SUM(J82:AA82)","v":0},"Hits"]
[null,null,null,null,null,"# of PA",null,{"$f":"SUM(J83:AA83)","v":0},"PA"]
[null,null,null,"m",null,"Avg",null,{"$f":"IF(H81=0,\"\",H82/H81)","v":""},"Avg",{"$f":"IF(J81=\"\",\"\",J82/J81)","v":""},"","","","","","",{"$f":"IF(Q81=\"\",\"\",Q82/Q81)","v":""},"","","","","","","","","",""]
[19,{"$f":"$D$1","v":"Hit Squad"},"L-Name",null,null,"# of AB's",null,{"$f":"SUM(J85:AA85)","v":0},"AB's"]
[null,null,"F-Name",null,null,"# of Hits",null,{"$f":"SUM(J86:AA86)","v":0},"Hits"]
[null,null,null,null,null,"# of PA",null,{"$f":"SUM(J87:AA87)","v":0},"PA"]
[null,null,null,"f",null,"Avg",null,{"$f":"IF(H85=0,\"\",H86/H85)","v":""},"Avg",{"$f":"IF(J85=\"\",\"\",J86/J85)","v":""},"","","","","","",{"$f":"IF(Q85=\"\",\"\",Q86/Q85)","v":""},"","","","","","","","","",""]
[20,{"$f":"$D$1","v":"Hit Squad"},"L-Name",null,null,"# of AB's",null,{"$f":"SUM(J89:AA89)","v":0},"AB's"]
[null,null,"F-Name",null,null,"# of Hits",null,{"$f":"SUM(J90:AA90)","v":0},"Hits"]
[null,null,null,null,null,"# of PA",null,{"$f":"SUM(J91:AA91)","v":0},"PA"]
[null,null,null,"f",null,"Avg",null,{"$f":"IF(H89=0,\"\",H90/H89)","v":""},"Avg",{"$f":"IF(J89=\"\",\"\",J90/J89)","v":""},"","","","","","",{"$f":"IF(Q89=\"\",\"\",Q90/Q89)","v":""},"","","","","","","","","",""]
[21,{"$f":"$D$1","v":"Hit Squad"},"L-Name",null,null,"# of AB's",null,{"$f":"SUM(J93:AA93)","v":0},"AB's"]
[null,null,"F-Name",null,null,"# of Hits",null,{"$f":"SUM(J94:AA94)","v":0},"Hits"]
[null,null,null,null,null,"# of PA",null,{"$f":"SUM(J95:AA95)","v":0},"PA"]
[null,null,null,"f",null,"Avg",null,{"$f":"IF(H93=0,\"\",H94/H93)","v":""},"Avg",{"$f":"IF(J93=\"\",\"\",J94/J93)","v":""},"","","","","","",{"$f":"IF(Q93=\"\",\"\",Q94/Q93)","v":""},"","","","","","","","","",""]
[22,{"$f":"$D$1","v":"Hit Squad"},"L-Name",null,null,"# of AB's",null,{"$f":"SUM(J97:AA97)","v":0},"AB's"]
[null,null,"F-Name",null,null,"# of Hits",null,{"$f":"SUM(J98:AA98)","v":0},"Hits"]
[null,null,null,null,null,"# of PA",null,{"$f":"SUM(J99:AA99)","v":0},"PA"]
[null,null,null,"f",null,"Avg",null,{"$f":"IF(H97=0,\"\",H98/H97)","v":""},"Avg",{"$f":"IF(J97=\"\",\"\",J98/J97)","v":""},"","","","","","",{"$f":"IF(Q97=\"\",\"\",Q98/Q97)","v":""},"","","","","","","","","",""]
[23,{"$f":"$D$1","v":"Hit Squad"},"L-Name",null,null,"# of AB's",null,{"$f":"SUM(J101:AA101)","v":0},"AB's"]
[null,null,"F-Name",null,null,"# of Hits",null,{"$f":"SUM(J102:AA102)","v":0},"Hits"]
[null,null,null,null,null,"# of PA",null,{"$f":"SUM(J103:AA103)","v":0},"PA"]
[null,null,null,"f",null,"Avg",null,{"$f":"IF(H101=0,\"\",H102/H101)","v":""},"Avg",{"$f":"IF(J101=\"\",\"\",J102/J101)","v":""},"","","","","","",{"$f":"IF(Q101=\"\",\"\",Q102/Q101)","v":""},"","","","","","","","","",""]
[24,{"$f":"$D$1","v":"Hit Squad"},"L-Name",null,null,"# of AB's",null,{"$f":"SUM(J105:AA105)","v":0},"AB's"]
[null,null,"F-Name",null,null,"# of Hits",null,{"$f":"SUM(J106:AA106)","v":0},"Hits"]
[null,null,null,null,null,"# of PA",null,{"$f":"SUM(J107:AA107)","v":0},"PA"]
[null,null,null,"f",null,"Avg",null,{"$f":"IF(H105=0,\"\",H106/H105)","v":""},"Avg",{"$f":"IF(J105=\"\",\"\",J106/J105)","v":""},"","","","","","",{"$f":"IF(Q105=\"\",\"\",Q106/Q105)","v":""},"","","","","","","","","",""]
[25,{"$f":"$D$1","v":"Hit Squad"},"L-Name",null,null,"# of AB's",null,{"$f":"SUM(J109:AA109)","v":0},"AB's"]
[null,null,"F-Name",null,null,"# of Hits",null,{"$f":"SUM(J110:AA110)","v":0},"Hits"]
[null,null,null,null,null,"# of PA",null,{"$f":"SUM(J111:AA111)","v":0},"PA"]
[null,null,null,"f",null,"Avg",null,{"$f":"IF(H109=0,\"\",H110/H109)","v":""},"Avg",{"$f":"IF(J109=\"\",\"\",J110/J109)","v":""},"","","","","","",{"$f":"IF(Q109=\"\",\"\",Q110/Q109)","v":""},"","","","","","","","","",""]
[null,{"$f":"$D$1","v":"Hit Squad"},null,"TEAM",null,"# of AB's",null,{"$f":"SUM(J113:AA113)","v":83},"AB's",{"$f":"IF(SUM(J109,J105,J101,J97,J93,J89,J85,J81,J77,J73,J69,J65,J61,J57,J53,J49,J45,J41,J37,J33,J29,J25,J21,J17,J13)=0,\"\",SUM(J13,J17,J21,J25,J29,J33,J37,J41,J45,J49,J53,J57,J61,J65,J69,J73,J77,J81,J85,J89,J93,J97,J101,J105,J109))","v":26},25,32,"","","","",{"$f":"IF(SUM(Q109,Q105,Q101,Q97,Q93,Q89,Q85,Q81,Q77,Q73,Q69,Q65,Q61,Q57,Q53,Q49,Q45,Q41,Q37,Q33,Q29,Q25,Q21,Q17,Q13)=0,\"\",SUM(Q13,Q17,Q21,Q25,Q29,Q33,Q37,Q41,Q45,Q49,Q53,Q57,Q61,Q65,Q69,Q73,Q77,Q81,Q85,Q89,Q93,Q97,Q101,Q105,Q109))","v":""},"","","","","","","","","",""]
[null,null,null,"Summary",null,"# of Hits",null,{"$f":"SUM(J114:AA114)","v":33},"Hits",{"$f":"IF(SUM(J110,J106,J102,J98,J94,J90,J86,J82,J78,J74,J70,J66,J62,J58,J54,J50,J46,J42,J38,J34,J30,J26,J22,J18,J14)=0,\"\",SUM(J14,J18,J22,J26,J30,J34,J38,J42,J46,J50,J54,J58,J62,J66,J70,J74,J78,J82,J86,J90,J94,J98,J102,J106,J110))","v":11},9,13,"","","","",{"$f":"IF(SUM(Q110,Q106,Q102,Q98,Q94,Q90,Q86,Q82,Q78,Q74,Q70,Q66,Q62,Q58,Q54,Q50,Q46,Q42,Q38,Q34,Q30,Q26,Q22,Q18,Q14)=0,\"\",SUM(Q14,Q18,Q22,Q26,Q30,Q34,Q38,Q42,Q46,Q50,Q54,Q58,Q62,Q66,Q70,Q74,Q78,Q82,Q86,Q90,Q94,Q98,Q102,Q106,Q110))","v":""},"","","","","","","","","",""]
[null,null,null,null,null,"Avg",null,{"$f":"IF(H113=0,\"N/A\",H114/H113)","v":0.39759036144578314},"Avg",{"$f":"IF(J113=\"\",\"\",J114/J113)","v":0.42307692307692307},0.36,0.40625,"","","","",{"$f":"IF(Q113=\"\",\"\",Q114/Q113)","v":""},"","","","","","","","","",""]

{"sheet":"Sticks","index":5,"n_rows":115,"n_cols":27,"rows_kept":115,"cut":false,"hidden":false,"merged":[]}
[null,null,"Team Name","Sticks",null,null,null,null,"Score",11,20,14,15]
[null,null,null,null,null,null,null,null,"Opponents Score",14,4,15,14]
[null,null,null,"Wins",null,{"$f":"SUM(J6:AA6)","v":2},null,null,"W or L",{"$f":"IF(SUM(J1,J2)=0,\"\",IF(J1<J2,\"L\",\"W\"))","v":"L"},"W","L","W","","","","","","","","","","","","","",""]
[null,null,null,"Losses",null,{"$f":"SUM(J7:AA7)","v":2},null,"Forfeit","FW or FL"]
[null,null,null,null,"games played excluding Forfeit Wins",null,null,null,null,{"$f":"IF(J3=\"\",\"\",IF(J4=\"FW\",\"\",1))","v":1},1,1,1,"","","","","","","","","","","","","",""]
[null,null,null,null,null,null,null,{"$f":"IF(H4=\"w\",1,\"\")","v":""},"win",{"$f":"IF(J3=\"w\",1,\"\")","v":""},1,"",1,"","","","","","","","","","","","","",""]
[null,null,null,null,null,null,null,{"$f":"IF(H4=\"l\",1,\"\")","v":""},"loss",{"$f":"IF(J3=\"l\",1,\"\")","v":1},"",1,"","","","","","","","","","","","","","",""]
[null,null,null,"Games Played Excluding Forfeit Wins",null,{"$f":"SUM(J5:AA5)","v":4},null,"Opponents Team Name",null,"Bad Pitches","Hit Squad","BCBC","Geto Bombers",null,"No Games",null,"No Games"]
[null,null,null,"League Run Diff     ",null,{"$f":"SUM(J9:AA9)","v":13},null,null,"Game Run Diff",{"$f":"IF(J1=\"\",\"\",J1-J2)","v":-3},16,-1,1,"","","","","","","","","","","","","",""]
[null,null,null,"Team Batting Avg   ",null,{"$f":"$H$115","v":0.53424657534246578},null,null,"Game Date","2023-04-20","2023-04-20","2023-04-27","2023-05-04","2023-05-11","2023-05-18","2023-05-25","2023-06-01","2023-06-08","2023-06-08"]
[]
[null,null,null,null,null,null,null,"STATS",null,1,2,3,4,5,6,7,8,9,10,11,12,13,14,15,16,17,18]
[1,{"$f":"$D$1","v":"Sticks"},"L-Name","Kacee",null,"# of AB's",null,{"$f":"SUM(J13:AA13)","v":15},"AB's",4,4,3,4]
[null,null,"F-Name","Robinson",null,"# of Hits",null,{"$f":"SUM(J14:AA14)","v":7},"Hits",2,1,1,3]
[null,null,null,null,null,"# of PA",null,{"$f":"SUM(J15:AA15)","v":16},"PA",4,4,4,4]
[null,null,null,"f",null,"Avg",null,{"$f":"IF(H13=0,\"\",(H14/H13))","v":0.46666666666666667},"Avg",{"$f":"IF(J13=\"\",\"\",J14/J13)","v":0.5},0.25,0.33333333333333331,0.75,"","","","","","","","","","","","","",""]
[2,{"$f":"$D$1","v":"Sticks"},"L-Name","Tommy",null,"# of AB's",null,{"$f":"SUM(J17:AA17)","v":14},"AB's",3,4,4,3]
[null,null,"F-Name","Gonzales",null,"# of Hits",null,{"$f":"SUM(J18:AA18)","v":12},"Hits",2,4,3,3]
[null,null,null,null,null,"# of PA",null,{"$f":"SUM(J19:AA19)","v":14},"PA",3,4,4,3]
[null,null,null,"m",null,"Avg",null,{"$f":"IF(H17=0,\"\",H18/H17)","v":0.8571428571428571},"Avg",{"$f":"IF(J17=\"\",\"\",J18/J17)","v":0.66666666666666663},1,0.75,1,"","","","","","","","","","","","","",""]
[3,{"$f":"$D$1","v":"Sticks"},"L-Name","Whitney",null,"# of AB's",null,{"$f":"SUM(J21:AA21)","v":12},"AB's",2,4,3,3]
[null,null,"F-Name","Larson",null,"# of Hits",null,{"$f":"SUM(J22:AA22)","v":3},"Hits",0,2,0,1]
[null,null,null,null,null,"# of PA",null,{"$f":"SUM(J23:AA23)","v":12},"Avg",2,4,3,3]
[null,null,null,"f",null,"Avg",null,{"$f":"IF(H21=0,\"\",H22/H21)","v":0.25},"Avg",{"$f":"IF(J21=\"\",\"\",J22/J21)","v":0},0.5,0,0.33333333333333331,"","","","","","","","","","","","","",""]
[4,{"$f":"$D$1","v":"Sticks"},"L-Name","Nic",null,"# of AB's",null,{"$f":"SUM(J25:AA25)","v":12},"AB's",3,4,3,2]
[null,null,"F-Name","Johnston",null,"# of Hits",null,{"$f":"SUM(J26:AA26)","v":8},"Hits",3,1,2,2]
[null,null,null,null,null,"# of PA",null,{"$f":"SUM(J27:AA27)","v":12},"PA",3,4,3,2]
[null,null,null,"m",null,"Avg",null,{"$f":"IF(H25=0,\"\",H26/H25)","v":0.66666666666666663},"Avg",{"$f":"IF(J25=\"\",\"\",J26/J25)","v":1},0.25,0.66666666666666663,1,"","","","","","","","","","","","","",""]
[5,{"$f":"$D$1","v":"Sticks"},"L-Name","Taylor",null,"# of AB's",null,{"$f":"SUM(J29:AA29)","v":6},"AB's",3,3]
[null,null,"F-Name","Hensley",null,"# of Hits",null,{"$f":"SUM(J30:AA30)","v":4},"Hits",2,2]
[null,null,null,null,null,"# of PA",null,{"$f":"SUM(J31:AA31)","v":7},"PA",3,4]
[null,null,null,"f",null,"Avg",null,{"$f":"IF(H29=0,\"\",H30/H29)","v":0.66666666666666663},"Avg",{"$f":"IF(J29=\"\",\"\",J30/J29)","v":0.66666666666666663},0.66666666666666663,"","","","","","","","","","","","","","","",""]
[6,{"$f":"$D$1","v":"Sticks"},"L-Name","Sean",null,"# of AB's",null,{"$f":"SUM(J33:AA33)","v":12},"AB's",3,4,3,2]
[null,null,"F-Name","Adams",null,"# of Hits",null,{"$f":"SUM(J34:AA34)","v":10},"Hits",2,3,3,2]
[null,null,null,null,null,"# of PA",null,{"$f":"SUM(J35:AA35)","v":13},"PA",3,4,3,3]
[null,null,null,"m",null,"Avg",null,{"$f":"IF(H33=0,\"\",H34/H33)","v":0.83333333333333337},"Avg",{"$f":"IF(J33=\"\",\"\",J34/J33)","v":0.66666666666666663},0.75,1,1,"","","","","","","","","","","","","",""]
[7,{"$f":"$D$1","v":"Sticks"},"L-Name","Shar",null,"# of AB's",null,{"$f":"SUM(J37:AA37)","v":12},"AB's",3,3,3,3]
[null,null,"F-Name","Norton",null,"# of Hits",null,{"$f":"SUM(J38:AA38)","v":4},"Hits",0,1,1,2]
[null,null,null,null,null,"# of PA",null,{"$f":"SUM(J39:AA39)","v":13},"PA",3,4,3,3]
[null,null,null,"f",null,"Avg",null,{"$f":"IF(H37=0,\"\",H38/H37)","v":0.33333333333333331},"Avg",{"$f":"IF(J37=\"\",\"\",J38/J37)","v":0},0.33333333333333331,0.33333333333333331,0.66666666666666663,"","","","","","","","","","","","","",""]
[8,{"$f":"$D$1","v":"Sticks"},"L-Name","Tim",null,"# of AB's",null,{"$f":"SUM(J41:AA41)","v":12},"AB's",3,3,2,4]
[null,null,"F-Name","Arnold",null,"# of Hits",null,{"$f":"SUM(J42:AA42)","v":10},"Hits",2,3,1,4]
[null,null,null,null,null,"# of PA",null,{"$f":"SUM(J43:AA43)","v":13},"PA",3,3,3,4]
[null,null,null,"m",null,"Avg",null,{"$f":"IF(H41=0,\"\",H42/H41)","v":0.83333333333333337},"Avg",{"$f":"IF(J41=\"\",\"\",J42/J41)","v":0.66666666666666663},1,0.5,1,"","","","","","","","","","","","","",""]
[9,{"$f":"$D$1","v":"Sticks"},"L-Name","Whitney",null,"# of AB's",null,{"$f":"SUM(J45:AA45)","v":9},"AB's",3,3,3]
[null,null,"F-Name","Bean",null,"# of Hits",null,{"$f":"SUM(J46:AA46)","v":4},"Hits",1,2,1]
[null,null,null,null,null,"# of PA",null,{"$f":"SUM(J47:AA47)","v":9},"PA",3,3,3]
[null,null,null,"f",null,"Avg",null,{"$f":"IF(H45=0,\"\",H46/H45)","v":0.44444444444444442},"Avg",{"$f":"IF(J45=\"\",\"\",J46/J45)","v":0.33333333333333331},0.66666666666666663,0.33333333333333331,"","","","","","","","","","","","","","",""]
[10,{"$f":"$D$1","v":"Sticks"},"L-Name","Tyler",null,"# of AB's",null,{"$f":"SUM(J49:AA49)","v":11},"AB's",3,3,3,2]
[null,null,"F-Name","Wardle",null,"# of Hits",null,{"$f":"SUM(J50:AA50)","v":7},"Hits",2,2,2,1]
[null,null,null,null,null,"# of PA",null,{"$f":"SUM(J51:AA51)","v":12},"PA",3,3,3,3]
[null,null,null,"m",null,"Avg",null,{"$f":"IF(H49=0,\"\",H50/H49)","v":0.63636363636363635},"Avg",{"$f":"IF(J49=\"\",\"\",J50/J49)","v":0.66666666666666663},0.66666666666666663,0.66666666666666663,0.5,"","","","","","","","","","","","","",""]
[11,{"$f":"$D$1","v":"Sticks"},"L-Name","Melinda",null,"# of AB's",null,{"$f":"SUM(J53:AA53)","v":10},"AB's",2,2,3,3]
[null,null,"F-Name","Adams",null,"# of Hits",null,{"$f":"SUM(J54:AA54)","v":2},"Hits",0,0,1,1]
[null,null,null,null,null,"# of PA",null,{"$f":"SUM(J55:AA55)","v":12},"PA",3,3,3,3]
[null,null,null,"f",null,"Avg",null,{"$f":"IF(H53=0,\"\",H54/H53)","v":0.2},"Avg",{"$f":"IF(J53=\"\",\"\",J54/J53)","v":0},0,0.33333333333333331,0.33333333333333331,"","","","","","","","","","","","","",""]
[12,{"$f":"$D$1","v":"Sticks"},"L-Name","Troy",null,"# of AB's",null,{"$f":"SUM(J57:AA57)","v":11},"AB's",3,3,2,3]
[null,null,"F-Name","Horne",null,"# of Hits",null,{"$f":"SUM(J58:AA58)","v":5},"Hits",1,0,2,2]
[null,null,null,null,null,"# of PA",null,{"$f":"SUM(J59:AA59)","v":12},"PA",3,3,3,3]
[null,null,null,"m",null,"Avg",null,{"$f":"IF(H57=0,\"\",H58/H57)","v":0.45454545454545453},"Avg",{"$f":"IF(J57=\"\",\"\",J58/J57)","v":0.33333333333333331},0,1,0.66666666666666663,"","","","","","","","","","","","","",""]
[13,{"$f":"$D$1","v":"Sticks"},"L-Name","Kate",null,"# of AB's",null,{"$f":"SUM(J61:AA61)","v":7},"AB's",null,null,4,3]
[null,null,"F-Name","Nygaard",null,"# of Hits",null,{"$f":"SUM(J62:AA62)","v":2},"Hits",null,null,0,2]
[null,null,null,null,null,"# of PA",null,{"$f":"SUM(J63:AA63)","v":7},"PA",null,null,4,3]
[null,null,null,"f",null,"Avg",null,{"$f":"IF(H61=0,\"\",H62/H61)","v":0.2857142857142857},"Avg",{"$f":"IF(J61=\"\",\"\",J62/J61)","v":""},"",0,0.66666666666666663,"","","","","","","","","","","","","",""]
[14,{"$f":"$D$1","v":"Sticks"},"L-Name","Jaime",null,"# of AB's",null,{"$f":"SUM(J65:AA65)","v":3},"AB's",null,null,null,3]
[null,null,"F-Name","Holdaway",null,"# of Hits",null,{"$f":"SUM(J66:AA66)","v":0},"Hits",null,null,null,0]
[null,null,null,null,null,"# of PA",null,{"$f":"SUM(J67:AA67)","v":3},"PA",null,null,null,3]
[null,null,null,"f",null,"Avg",null,{"$f":"IF(H65=0,\"\",H66/H65)","v":0},"Avg",{"$f":"IF(J65=\"\",\"\",J66/J65)","v":""},"","",0,"","","","","","","","","","","","","",""]
[15,{"$f":"$D$1","v":"Sticks"},"L-Name",null,null,"# of AB's",null,{"$f":"SUM(J69:AA69)","v":0},"AB's"]
[null,null,"F-Name",null,null,"# of Hits",null,{"$f":"SUM(J70:AA70)","v":0},"Hits"]
[null,null,null,null,null,"# of PA",null,{"$f":"SUM(J71:AA71)","v":0},"PA"]
[null,null,null,"f",null,"Avg",null,{"$f":"IF(H69=0,\"\",H70/H69)","v":""},"Avg",{"$f":"IF(J69=\"\",\"\",J70/J69)","v":""},"","","","","","","","","","","","","","","","",""]
[16,{"$f":"$D$1","v":"Sticks"},"L-Name",null,null,"# of AB's",null,{"$f":"SUM(J73:AA73)","v":0},"AB's"]
[null,null,"F-Name",null,null,"# of Hits",null,{"$f":"SUM(J74:AA74)","v":0},"Hits"]
[null,null,null,null,null,"# of PA",null,{"$f":"SUM(J75:AA75)","v":0},"PA"]
[null,null,null,"m",null,"Avg",null,{"$f":"IF(H73=0,\"\",H74/H73)","v":""},"Avg",{"$f":"IF(J73=\"\",\"\",J74/J73)","v":""},"","","","","","","","","","","","","","","","",""]
[17,{"$f":"$D$1","v":"Sticks"},"L-Name",null,null,"# of AB's",null,{"$f":"SUM(J77:AA77)","v":0},"AB's"]
[null,null,"F-Name",null,null,"# of Hits",null,{"$f":"SUM(J78:AA78)","v":0},"Hits"]
[null,null,null,null,null,"# of PA",null,{"$f":"SUM(J79:AA79)","v":0},"PA"]
[null,null,null,"f",null,"Avg",null,{"$f":"IF(H77=0,\"\",H78/H77)","v":""},"Avg",{"$f":"IF(J77=\"\",\"\",J78/J77)","v":""},"","","","","","","","","","","","","","","","",""]
[18,{"$f":"$D$1","v":"Sticks"},"L-Name",null,null,"# of AB's",null,{"$f":"SUM(J81:AA81)","v":0},"AB's"]
[null,null,"F-Name",null,null,"# of Hits",null,{"$f":"SUM(J82:AA82)","v":0},"Hits"]
[null,null,null,null,null,"# of PA",null,{"$f":"SUM(J83:AA83)","v":0},"PA"]
[null,null,null,"f",null,"Avg",null,{"$f":"IF(H81=0,\"\",H82/H81)","v":""},"Avg",{"$f":"IF(J81=\"\",\"\",J82/J81)","v":""},"","","","","","","","","","","","","","","","",""]
[19,{"$f":"$D$1","v":"Sticks"},"L-Name",null,null,"# of AB's",null,{"$f":"SUM(J85:AA85)","v":0},"AB's"]
[null,null,"F-Name",null,null,"# of Hits",null,{"$f":"SUM(J86:AA86)","v":0},"Hits"]
[null,null,null,null,null,"# of PA",null,{"$f":"SUM(J87:AA87)","v":0},"PA"]
[null,null,null,"m",null,"Avg",null,{"$f":"IF(H85=0,\"\",H86/H85)","v":""},"Avg",{"$f":"IF(J85=\"\",\"\",J86/J85)","v":""},"","","","","","","","","","","","","","","","",""]
[20,{"$f":"$D$1","v":"Sticks"},"L-Name",null,null,"# of AB's",null,{"$f":"SUM(J89:AA89)","v":0},"AB's"]
[null,null,"F-Name",null,null,"# of Hits",null,{"$f":"SUM(J90:AA90)","v":0},"Hits"]
[null,null,null,null,null,"# of PA",null,{"$f":"SUM(J91:AA91)","v":0},"PA"]
[null,null,null,"f",null,"Avg",null,{"$f":"IF(H89=0,\"\",H90/H89)","v":""},"Avg",{"$f":"IF(J89=\"\",\"\",J90/J89)","v":""},"","","","","","","","","","","","","","","","",""]
[21,{"$f":"$D$1","v":"Sticks"},"L-Name",null,null,"# of AB's",null,{"$f":"SUM(J93:AA93)","v":0},"AB's"]
[null,null,"F-Name",null,null,"# of Hits",null,{"$f":"SUM(J94:AA94)","v":0},"Hits"]
[null,null,null,null,null,"# of PA",null,{"$f":"SUM(J95:AA95)","v":0},"PA"]
[null,null,null,"m",null,"Avg",null,{"$f":"IF(H93=0,\"\",H94/H93)","v":""},"Avg",{"$f":"IF(J93=\"\",\"\",J94/J93)","v":""},"","","","","","","","","","","","","","","","",""]
[22,{"$f":"$D$1","v":"Sticks"},"L-Name",null,null,"# of AB's",null,{"$f":"SUM(J97:AA97)","v":0},"AB's"]
[null,null,"F-Name",null,null,"# of Hits",null,{"$f":"SUM(J98:AA98)","v":0},"Hits"]
[null,null,null,null,null,"# of PA",null,{"$f":"SUM(J99:AA99)","v":0},"PA"]
[null,null,null,"f",null,"Avg",null,{"$f":"IF(H97=0,\"\",H98/H97)","v":""},"Avg",{"$f":"IF(J97=\"\",\"\",J98/J97)","v":""},"","","","","","","","","","","","","","","","",""]
[23,{"$f":"$D$1","v":"Sticks"},"L-Name",null,null,"# of AB's",null,{"$f":"SUM(J101:AA101)","v":0},"AB's"]
[null,null,"F-Name",null,null,"# of Hits",null,{"$f":"SUM(J102:AA102)","v":0},"Hits"]
[null,null,null,null,null,"# of PA",null,{"$f":"SUM(J103:AA103)","v":0},"PA"]
[null,null,null,"f",null,"Avg",null,{"$f":"IF(H101=0,\"\",H102/H101)","v":""},"Avg",{"$f":"IF(J101=\"\",\"\",J102/J101)","v":""},"","","","","","","","","","","","","","","","",""]
[24,{"$f":"$D$1","v":"Sticks"},"L-Name",null,null,"# of AB's",null,{"$f":"SUM(J105:AA105)","v":0},"AB's"]
[null,null,"F-Name",null,null,"# of Hits",null,{"$f":"SUM(J106:AA106)","v":0},"Hits"]
[null,null,null,null,null,"# of PA",null,{"$f":"SUM(J107:AA107)","v":0},"PA"]
[null,null,null,"f",null,"Avg",null,{"$f":"IF(H105=0,\"\",H106/H105)","v":""},"Avg",{"$f":"IF(J105=\"\",\"\",J106/J105)","v":""},"","","","","","","","","","","","","","","","",""]
[25,{"$f":"$D$1","v":"Sticks"},"L-Name",null,null,"# of AB's",null,{"$f":"SUM(J109:AA109)","v":0},"AB's"]
[null,null,"F-Name",null,null,"# of Hits",null,{"$f":"SUM(J110:AA110)","v":0},"Hits"]
[null,null,null,null,null,"# of PA",null,{"$f":"SUM(J111:AA111)","v":0},"PA"]
[null,null,null,"f",null,"Avg",null,{"$f":"IF(H109=0,\"\",H110/H109)","v":""},"Avg",{"$f":"IF(J109=\"\",\"\",J110/J109)","v":""},"","","","","","","","","","","","","","","","",""]
[null,{"$f":"$D$1","v":"Sticks"},null,"TEAM",null,"# of AB's",null,{"$f":"SUM(J113:AA113)","v":146},"AB's",{"$f":"IF(SUM(J109,J105,J101,J97,J93,J89,J85,J81,J77,J73,J69,J65,J61,J57,J53,J49,J45,J41,J37,J33,J29,J25,J21,J17,J13)=0,\"\",SUM(J13,J17,J21,J25,J29,J33,J37,J41,J45,J49,J53,J57,J61,J65,J69,J73,J77,J81,J85,J89,J93,J97,J101,J105,J109))","v":35},40,36,35,"","","","","","","","","","","","","",""]
[null,null,null,"Summary",null,"# of Hits",null,{"$f":"SUM(J114:AA114)","v":78},"Hits",{"$f":"IF(SUM(J110,J106,J102,J98,J94,J90,J86,J82,J78,J74,J70,J66,J62,J58,J54,J50,J46,J42,J38,J34,J30,J26,J22,J18,J14)=0,\"\",SUM(J14,J18,J22,J26,J30,J34,J38,J42,J46,J50,J54,J58,J62,J66,J70,J74,J78,J82,J86,J90,J94,J98,J102,J106,J110))","v":17},21,17,23,"","","","","","","","","","","","","",""]
[null,null,null,null,null,"Avg",null,{"$f":"IF(H113=0,\"N/A\",H114/H113)","v":0.53424657534246578},"Avg",{"$f":"IF(J113=\"\",\"\",J114/J113)","v":0.48571428571428571},0.52500000000000002,0.47222222222222221,0.65714285714285714,"","","","","","","","","","","","","",""]

{"sheet":"Team 6","index":6,"n_rows":115,"n_cols":27,"rows_kept":115,"cut":false,"hidden":false,"merged":[]}
[null,null,"Team Name","Team 6",null,null,null,null,"Score",1,1,1,1,null,1,1,null,1,1]
[null,null,null," ",null,null,null,null,"Opponents Score",7,7,7,7,null,7,7,null,7,7]
[null,null,null,"Wins",null,{"$f":"SUM(J6:AA6)","v":0},null,null,"W or L",{"$f":"IF(SUM(J1,J2)=0,\"\",IF(J1<J2,\"L\",\"W\"))","v":"L"},"L","L","L","","L","L","","L","L","","","","","","","",""]
[null,null,null,"Losses",null,{"$f":"SUM(J7:AA7)","v":8},null,"Forfeit","FW or FL"]
[null,null,null,null,"games played excluding Forfeit Wins",null,null,null,null,{"$f":"IF(J3=\"\",\"\",IF(J4=\"FW\",\"\",1))","v":1},1,1,1,"",1,1,"",1,1,"","","","","","","",""]
[null,null,null,null,null,null,null,{"$f":"IF(H4=\"w\",1,\"\")","v":""},"win",{"$f":"IF(J3=\"w\",1,\"\")","v":""},"","","","","","","","","","","","","","","","",""]
[null,null,null,null,null,null,null,{"$f":"IF(H4=\"l\",1,\"\")","v":""},"loss",{"$f":"IF(J3=\"l\",1,\"\")","v":1},1,1,1,"",1,1,"",1,1,"","","","","","","",""]
[null,null,null,"Games Played Excluding Forfeit Wins",null,{"$f":"SUM(J5:AA5)","v":8},null,"Opponents Team Name",null,null,null,null,null,"No Games",null,null,"No Games"]
[null,null,null,"League Run Diff     ",null,{"$f":"SUM(J9:AA9)","v":-48},null,null,"Game Run Diff",{"$f":"IF(J1=\"\",\"\",J1-J2)","v":-6},-6,-6,-6,"",-6,-6,"",-6,-6,"","","","","","","",""]
[null,null,null,"Team Batting Avg   ",null,{"$f":"$H$115","v":0},null,null,"Game Date"]
[]
[null,null,null,null,null,null,null,"STATS",null,1,2,3,4,5,6,7,8,9,10,11,12,13,14,15,16,17,18]
[1,{"$f":"$D$1","v":"Team 6"},"L-Name","John",null,"# of AB's",null,{"$f":"SUM(J13:AA13)","v":10},"AB's",1,1,1,1,1,1,1,1,1,1]
[null,null,"F-Name",null,null,"# of Hits",null,{"$f":"SUM(J14:AA14)","v":0},"Hits",0,0,0,0,0,0,0,0,0,0]
[null,null,null,null,null,"# of PA",null,{"$f":"SUM(J15:AA15)","v":10},"PA",1,1,1,1,1,1,1,1,1,1]
[null,null,null,"m",null,"Avg",null,{"$f":"IF(H13=0,\"\",(H14/H13))","v":0},"Avg",{"$f":"IF(J13=\"\",\"\",J14/J13)","v":0},0,0,0,0,0,0,0,0,0,"","","","","","","",""]
[2,{"$f":"$D$1","v":"Team 6"},"L-Name","Mary",null,"# of AB's",null,{"$f":"SUM(J17:AA17)","v":10},"AB's",1,1,1,1,1,1,1,1,1,1]
[null,null,"F-Name",null,null,"# of Hits",null,{"$f":"SUM(J18:AA18)","v":0},"Hits",0,0,0,0,0,0,0,0,0,0]
[null,null,null,null,null,"# of PA",null,{"$f":"SUM(J19:AA19)","v":10},"PA",1,1,1,1,1,1,1,1,1,1]
[null,null,null,"f",null,"Avg",null,{"$f":"IF(H17=0,\"\",H18/H17)","v":0},"Avg",{"$f":"IF(J17=\"\",\"\",J18/J17)","v":0},0,0,0,0,0,0,0,0,0,"","","","","","","",""]
[3,{"$f":"$D$1","v":"Team 6"},"L-Name","Ron",null,"# of AB's",null,{"$f":"SUM(J21:AA21)","v":10},"AB's",1,1,1,1,1,1,1,1,1,1]
[null,null,"F-Name",null,null,"# of Hits",null,{"$f":"SUM(J22:AA22)","v":0},"Hits",0,0,0,0,0,0,0,0,0,0]
[null,null,null,null,null,"# of PA",null,{"$f":"SUM(J23:AA23)","v":10},"PA",1,1,1,1,1,1,1,1,1,1]
[null,null,null,"m",null,"Avg",null,{"$f":"IF(H21=0,\"\",H22/H21)","v":0},"Avg",{"$f":"IF(J21=\"\",\"\",J22/J21)","v":0},0,0,0,0,0,0,0,0,0,"","","","","","","",""]
[4,{"$f":"$D$1","v":"Team 6"},"L-Name","Pat",null,"# of AB's",null,{"$f":"SUM(J25:AA25)","v":10},"AB's",1,1,1,1,1,1,1,1,1,1]
[null,null,"F-Name",null,null,"# of Hits",null,{"$f":"SUM(J26:AA26)","v":0},"Hits",0,0,0,0,0,0,0,0,0,0]
[null,null,null,null,null,"# of PA",null,{"$f":"SUM(J27:AA27)","v":10},"PA",1,1,1,1,1,1,1,1,1,1]
[null,null,null,"f",null,"Avg",null,{"$f":"IF(H25=0,\"\",H26/H25)","v":0},"Avg",{"$f":"IF(J25=\"\",\"\",J26/J25)","v":0},{"$f":"IF(K25=\"\",\"\",K26/K25)","v":0},0,0,0,0,0,0,0,0,"","","","","","","",""]
[5,{"$f":"$D$1","v":"Team 6"},"L-Name","Mike",null,"# of AB's",null,{"$f":"SUM(J29:AA29)","v":10},"AB's",1,1,1,1,1,1,1,1,1,1]
[null,null,"F-Name",null,null,"# of Hits",null,{"$f":"SUM(J30:AA30)","v":0},"Hits",0,0,0,0,0,0,0,0,0,0]
[null,null,null,null,null,"# of PA",null,{"$f":"SUM(J31:AA31)","v":10},"PA",1,1,1,1,1,1,1,1,1,1]
[null,null,null,"m",null,"Avg",null,{"$f":"IF(H29=0,\"\",H30/H29)","v":0},"Avg",{"$f":"IF(J29=\"\",\"\",J30/J29)","v":0},{"$f":"IF(K29=\"\",\"\",K30/K29)","v":0},0,0,0,0,0,0,0,0,"","","","","","","",""]
[6,{"$f":"$D$1","v":"Team 6"},"L-Name","Heidi",null,"# of AB's",null,{"$f":"SUM(J33:AA33)","v":10},"AB's",1,1,1,1,1,1,1,1,1,1]
[null,null,"F-Name",null,null,"# of Hits",null,{"$f":"SUM(J34:AA34)","v":0},"Hits",0,0,0,0,0,0,0,0,0,0]
[null,null,null,null,null,"# of PA",null,{"$f":"SUM(J35:AA35)","v":10},"PA",1,1,1,1,1,1,1,1,1,1]
[null,null,null,"f",null,"Avg",null,{"$f":"IF(H33=0,\"\",H34/H33)","v":0},"Avg",{"$f":"IF(J33=\"\",\"\",J34/J33)","v":0},{"$f":"IF(K33=\"\",\"\",K34/K33)","v":0},0,0,0,0,0,0,0,0,"","","","","","","",""]
[7,{"$f":"$D$1","v":"Team 6"},"L-Name","Trent",null,"# of AB's",null,{"$f":"SUM(J37:AA37)","v":10},"AB's",1,1,1,1,1,1,1,1,1,1]
[null,null,"F-Name",null,null,"# of Hits",null,{"$f":"SUM(J38:AA38)","v":0},"Hits",0,0,0,0,0,0,0,0,0,0]
[null,null,null,null,null,"# of PA",null,{"$f":"SUM(J39:AA39)","v":10},"PA",1,1,1,1,1,1,1,1,1,1]
[null,null,null,"m",null,"Avg",null,{"$f":"IF(H37=0,\"\",H38/H37)","v":0},"Avg",{"$f":"IF(J37=\"\",\"\",J38/J37)","v":0},{"$f":"IF(K37=\"\",\"\",K38/K37)","v":0},0,0,0,0,0,0,0,0,"","","","","","","",""]
[8,{"$f":"$D$1","v":"Team 6"},"L-Name","Christine",null,"# of AB's",null,{"$f":"SUM(J41:AA41)","v":10},"AB's",1,1,1,1,1,1,1,1,1,1]
[null,null,"F-Name",null,null,"# of Hits",null,{"$f":"SUM(J42:AA42)","v":0},"Hits",0,0,0,0,0,0,0,0,0,0]
[null,null,null,null,null,"# of PA",null,{"$f":"SUM(J43:AA43)","v":10},"PA",1,1,1,1,1,1,1,1,1,1]
[null,null,null,"f",null,"Avg",null,{"$f":"IF(H41=0,\"\",H42/H41)","v":0},"Avg",{"$f":"IF(J41=\"\",\"\",J42/J41)","v":0},{"$f":"IF(K41=\"\",\"\",K42/K41)","v":0},0,0,0,0,0,0,0,0,"","","","","","","",""]
[9,{"$f":"$D$1","v":"Team 6"},"L-Name","Isaac",null,"# of AB's",null,{"$f":"SUM(J45:AA45)","v":10},"AB's",1,1,1,1,1,1,1,1,1,1]
[null,null,"F-Name",null,null,"# of Hits",null,{"$f":"SUM(J46:AA46)","v":0},"Hits",0,0,0,0,0,0,0,0,0,0]
[null,null,null,null,null,"# of PA",null,{"$f":"SUM(J47:AA47)","v":10},"PA",1,1,1,1,1,1,1,1,1,1]
[null,null,null,"m",null,"Avg",null,{"$f":"IF(H45=0,\"\",H46/H45)","v":0},"Avg",{"$f":"IF(J45=\"\",\"\",J46/J45)","v":0},{"$f":"IF(K45=\"\",\"\",K46/K45)","v":0},0,0,0,0,0,0,0,0,"","","","","","","",""]
[10,{"$f":"$D$1","v":"Team 6"},"L-Name","Laurie",null,"# of AB's",null,{"$f":"SUM(J49:AA49)","v":10},"AB's",1,1,1,1,1,1,1,1,1,1]
[null,null,"F-Name",null,null,"# of Hits",null,{"$f":"SUM(J50:AA50)","v":0},"Hits",0,0,0,0,0,0,0,0,0,0]
[null,null,null,null,null,"# of PA",null,{"$f":"SUM(J51:AA51)","v":10},"PA",1,1,1,1,1,1,1,1,1,1]
[null,null,null,"f",null,"Avg",null,{"$f":"IF(H49=0,\"\",H50/H49)","v":0},"Avg",{"$f":"IF(J49=\"\",\"\",J50/J49)","v":0},0,0,0,0,0,0,0,0,0,"","","","","","","",""]
[11,{"$f":"$D$1","v":"Team 6"},"L-Name",null,null,"# of AB's",null,{"$f":"SUM(J53:AA53)","v":0},"AB's"]
[null,null,"F-Name",null,null,"# of Hits",null,{"$f":"SUM(J54:AA54)","v":0},"Hits"]
[null,null,null,null,null,"# of PA",null,{"$f":"SUM(J55:AA55)","v":0},"PA"]
[null,null,null,"m",null,"Avg",null,{"$f":"IF(H53=0,\"\",H54/H53)","v":""},"Avg",{"$f":"IF(J53=\"\",\"\",J54/J53)","v":""},"","","","","","","","","","","","","","","","",""]
[12,{"$f":"$D$1","v":"Team 6"},"L-Name",null,null,"# of AB's",null,{"$f":"SUM(J57:AA57)","v":0},"AB's"]
[null,null,"F-Name",null,null,"# of Hits",null,{"$f":"SUM(J58:AA58)","v":0},"Hits"]
[null,null,null,null,null,"# of PA",null,{"$f":"SUM(J59:AA59)","v":0},"PA"]
[null,null,null,"f",null,"Avg",null,{"$f":"IF(H57=0,\"\",H58/H57)","v":""},"Avg",{"$f":"IF(J57=\"\",\"\",J58/J57)","v":""},"","","","","","","","","","","","","","","","",""]
[13,{"$f":"$D$1","v":"Team 6"},"L-Name",null,null,"# of AB's",null,{"$f":"SUM(J61:AA61)","v":0},"AB's"]
[null,null,"F-Name",null,null,"# of Hits",null,{"$f":"SUM(J62:AA62)","v":0},"Hits"]
[null,null,null,null,null,"# of PA",null,{"$f":"SUM(J63:AA63)","v":0},"PA"]
[null,null,null,"m",null,"Avg",null,{"$f":"IF(H61=0,\"\",H62/H61)","v":""},"Avg",{"$f":"IF(J61=\"\",\"\",J62/J61)","v":""},"","","","","","","","","","","","","","","","",""]
[14,{"$f":"$D$1","v":"Team 6"},"L-Name",null,null,"# of AB's",null,{"$f":"SUM(J65:AA65)","v":0},"AB's"]
[null,null,"F-Name",null,null,"# of Hits",null,{"$f":"SUM(J66:AA66)","v":0},"Hits"]
[null,null,null,null,null,"# of PA",null,{"$f":"SUM(J67:AA67)","v":0},"PA"]
[null,null,null,"m",null,"Avg",null,{"$f":"IF(H65=0,\"\",H66/H65)","v":""},"Avg",{"$f":"IF(J65=\"\",\"\",J66/J65)","v":""},"","","","","","","","","","","","","","","","",""]
[15,{"$f":"$D$1","v":"Team 6"},"L-Name",null,null,"# of AB's",null,{"$f":"SUM(J69:AA69)","v":0},"AB's"]
[null,null,"F-Name",null,null,"# of Hits",null,{"$f":"SUM(J70:AA70)","v":0},"Hits"]
[null,null,null,null,null,"# of PA",null,{"$f":"SUM(J71:AA71)","v":0},"PA"]
[null,null,null,"m",null,"Avg",null,{"$f":"IF(H69=0,\"\",H70/H69)","v":""},"Avg",{"$f":"IF(J69=\"\",\"\",J70/J69)","v":""},"","","","","","","","","","","","","","","","",""]
[16,{"$f":"$D$1","v":"Team 6"},"B",null,null,"# of AB's",null,{"$f":"SUM(J73:AA73)","v":0},"AB's"]
[null,null,"F-Name",null,null,"# of Hits",null,{"$f":"SUM(J74:AA74)","v":0},"Hits"]
[null,null,null,null,null,"# of PA",null,{"$f":"SUM(J75:AA75)","v":0},"PA"]
[null,null,null,"f",null,"Avg",null,{"$f":"IF(H73=0,\"\",H74/H73)","v":""},"Avg",{"$f":"IF(J73=\"\",\"\",J74/J73)","v":""},"","","","","","","","","","","","","","","","",""]
[17,{"$f":"$D$1","v":"Team 6"},"L-Name",null,null,"# of AB's",null,{"$f":"SUM(J77:AA77)","v":0},"AB's"]
[null,null,"F-Name",null,null,"# of Hits",null,{"$f":"SUM(J78:AA78)","v":0},"Hits"]
[null,null,null,null,null,"# of PA",null,{"$f":"SUM(J79:AA79)","v":0},"PA"]
[null,null,null,"m",null,"Avg",null,{"$f":"IF(H77=0,\"\",H78/H77)","v":""},"Avg",{"$f":"IF(J77=\"\",\"\",J78/J77)","v":""},"","","","","","","","","","","","","","","","",""]
[18,{"$f":"$D$1","v":"Team 6"},"L-Name",null,null,"# of AB's",null,{"$f":"SUM(J81:AA81)","v":0},"AB's"]
[null,null,"F-Name",null,null,"# of Hits",null,{"$f":"SUM(J82:AA82)","v":0},"Hits"]
[null,null,null,null,null,"# of PA",null,{"$f":"SUM(J83:AA83)","v":0},"PA"]
[null,null,null,"f",null,"Avg",null,{"$f":"IF(H81=0,\"\",H82/H81)","v":""},"Avg",{"$f":"IF(J81=\"\",\"\",J82/J81)","v":""},"","","","","","","","","","","","","","","","",""]
[19,{"$f":"$D$1","v":"Team 6"},"L-Name",null,null,"# of AB's",null,{"$f":"SUM(J85:AA85)","v":0},"AB's"]
[null,null,"F-Name",null,null,"# of Hits",null,{"$f":"SUM(J86:AA86)","v":0},"Hits"]
[null,null,null,null,null,"# of PA",null,{"$f":"SUM(J87:AA87)","v":0},"PA"]
[null,null,null,"m",null,"Avg",null,{"$f":"IF(H85=0,\"\",H86/H85)","v":""},"Avg",{"$f":"IF(J85=\"\",\"\",J86/J85)","v":""},"","","","","","","","","","","","","","","","",""]
[20,{"$f":"$D$1","v":"Team 6"},"L-Name",null,null,"# of AB's",null,{"$f":"SUM(J89:AA89)","v":0},"AB's"]
[null,null,"F-Name",null,null,"# of Hits",null,{"$f":"SUM(J90:AA90)","v":0},"Hits"]
[null,null,null,null,null,"# of PA",null,{"$f":"SUM(J91:AA91)","v":0},"PA"]
[null,null,null,"f",null,"Avg",null,{"$f":"IF(H89=0,\"\",H90/H89)","v":""},"Avg",{"$f":"IF(J89=\"\",\"\",J90/J89)","v":""},"","","","","","","","","","","","","","","","",""]
[21,{"$f":"$D$1","v":"Team 6"},"L-Name",null,null,"# of AB's",null,{"$f":"SUM(J93:AA93)","v":0},"AB's"]
[null,null,"F-Name",null,null,"# of Hits",null,{"$f":"SUM(J94:AA94)","v":0},"Hits"]
[null,null,null,null,null,"# of PA",null,{"$f":"SUM(J95:AA95)","v":0},"PA"]
[null,null,null,"m",null,"Avg",null,{"$f":"IF(H93=0,\"\",H94/H93)","v":""},"Avg",{"$f":"IF(J93=\"\",\"\",J94/J93)","v":""},"","","","","","","","","","","","","","","","",""]
[22,{"$f":"$D$1","v":"Team 6"},"L-Name",null,null,"# of AB's",null,{"$f":"SUM(J97:AA97)","v":0},"AB's"]
[null,null,"F-Name",null,null,"# of Hits",null,{"$f":"SUM(J98:AA98)","v":0},"Hits"]
[null,null,null,null,null,"# of PA",null,{"$f":"SUM(J99:AA99)","v":0},"PA"]
[null,null,null,"m",null,"Avg",null,{"$f":"IF(H97=0,\"\",H98/H97)","v":""},"Avg",{"$f":"IF(J97=\"\",\"\",J98/J97)","v":""},"","","","","","","","","","","","","","","","",""]
[23,{"$f":"$D$1","v":"Team 6"},"L-Name",null,null,"# of AB's",null,{"$f":"SUM(J101:AA101)","v":0},"AB's"]
[null,null,"F-Name",null,null,"# of Hits",null,{"$f":"SUM(J102:AA102)","v":0},"Hits"]
[null,null,null,null,null,"# of PA",null,{"$f":"SUM(J103:AA103)","v":0},"PA"]
[null,null,null,"f",null,"Avg",null,{"$f":"IF(H101=0,\"\",H102/H101)","v":""},"Avg",{"$f":"IF(J101=\"\",\"\",J102/J101)","v":""},"","","","","","","","","","","","","","","","",""]
[24,{"$f":"$D$1","v":"Team 6"},"L-Name",null,null,"# of AB's",null,{"$f":"SUM(J105:AA105)","v":0},"AB's"]
[null,null,"F-Name",null,null,"# of Hits",null,{"$f":"SUM(J106:AA106)","v":0},"Hits"]
[null,null,null,null,null,"# of PA",null,{"$f":"SUM(J107:AA107)","v":0},"PA"]
[null,null,null,"m",null,"Avg",null,{"$f":"IF(H105=0,\"\",H106/H105)","v":""},"Avg",{"$f":"IF(J105=\"\",\"\",J106/J105)","v":""},"","","","","","","","","","","","","","","","",""]
[25,{"$f":"$D$1","v":"Team 6"},"L-Name",null,null,"# of AB's",null,{"$f":"SUM(J109:AA109)","v":0},"AB's"]
[null,null,"F-Name",null,null,"# of Hits",null,{"$f":"SUM(J110:AA110)","v":0},"Hits"]
[null,null,null,null,null,"# of PA",null,{"$f":"SUM(J111:AA111)","v":0},"PA"]
[null,null,null,"f",null,"Avg",null,{"$f":"IF(H109=0,\"\",H110/H109)","v":""},"Avg",{"$f":"IF(J109=\"\",\"\",J110/J109)","v":""},"","","","","","","","","","","","","","","","",""]
[null,{"$f":"$D$1","v":"Team 6"},null,"TEAM",null,"# of AB's",null,{"$f":"SUM(J113:AA113)","v":100},"AB's",{"$f":"IF(SUM(J109,J105,J101,J97,J93,J89,J85,J81,J77,J73,J69,J65,J61,J57,J53,J49,J45,J41,J37,J33,J29,J25,J21,J17,J13)=0,\"\",SUM(J13,J17,J21,J25,J29,J33,J37,J41,J45,J49,J53,J57,J61,J65,J69,J73,J77,J81,J85,J89,J93,J97,J101,J105,J109))","v":10},10,10,10,10,10,10,10,10,10,"","","","","","","",""]
[null,null,null,"Summary",null,"# of Hits",null,{"$f":"SUM(J114:AA114)","v":0},"Hits",{"$f":"IF(SUM(J110,J106,J102,J98,J94,J90,J86,J82,J78,J74,J70,J66,J62,J58,J54,J50,J46,J42,J38,J34,J30,J26,J22,J18,J14)=0,\"\",SUM(J14,J18,J22,J26,J30,J34,J38,J42,J46,J50,J54,J58,J62,J66,J70,J74,J78,J82,J86,J90,J94,J98,J102,J106,J110))","v":""},"","","","","","","","","","","","","","","","",""]
[null,null,null,null,null,"Avg",null,{"$f":"IF(H113=0,\"N/A\",H114/H113)","v":0},"Avg",{"$f":"IF(J113=\"\",\"\",J114/J113)","v":{"$error":"#VALUE!"}},{"$error":"#VALUE!"},{"$error":"#VALUE!"},{"$error":"#VALUE!"},{"$error":"#VALUE!"},{"$error":"#VALUE!"},{"$error":"#VALUE!"},{"$error":"#VALUE!"},{"$error":"#VALUE!"},{"$error":"#VALUE!"},"","","","","","","",""]

{"sheet":"Team 7","index":7,"n_rows":115,"n_cols":27,"rows_kept":115,"cut":false,"hidden":false,"merged":[]}
[null,null,"Team Name"," ",null,null,null,null,"Score",2,2,2,2,2,null,2,2,null,2]
[null,null,null,null,null,null,null,null,"Opponents Score",7,7,7,7,7,null,7,7,null,7]
[null,null,null,"Wins",null,{"$f":"SUM(J6:AA6)","v":0},null,null,"W or L",{"$f":"IF(SUM(J1,J2)=0,\"\",IF(J1<J2,\"L\",\"W\"))","v":"L"},"L","L","L","L","","L","L","","L","","","","","","","",""]
[null,null,null,"Losses",null,{"$f":"SUM(J7:AA7)","v":8},null,"Forfeit","FW or FL"]
[null,null,null,null,"games played excluding Forfeit Wins",null,null,null,null,{"$f":"IF(J3=\"\",\"\",IF(J4=\"FW\",\"\",1))","v":1},1,1,1,1,"",1,1,"",1,"","","","","","","",""]
[null,null,null,null,null,null,null,{"$f":"IF(H4=\"w\",1,\"\")","v":""},"win",{"$f":"IF(J3=\"w\",1,\"\")","v":""},"","","","","","","","","","","","","","","","",""]
[null,null,null,null,null,null,null,{"$f":"IF(H4=\"l\",1,\"\")","v":""},"loss",{"$f":"IF(J3=\"l\",1,\"\")","v":1},1,1,1,1,"",1,1,"",1,"","","","","","","",""]
[null,null,null,"Games Played Excluding Forfeit Wins",null,{"$f":"SUM(J5:AA5)","v":8},null,"Opponents Team Name",null,null,null,null,null,null,"No Games",null,null,"No Games"]
[null,null,null,"League Run Diff     ",null,{"$f":"SUM(J9:AA9)","v":-40},null,null,"Game Run Diff",{"$f":"IF(J1=\"\",\"\",J1-J2)","v":-5},-5,-5,-5,-5,"",-5,-5,"",-5,"","","","","","","",""]
[null,null,null,"Team Batting Avg   ",null,{"$f":"$H$115","v":0},null,null,"Game Date"]
[]
[null,null,null,null,null,null,null,"STATS",null,1,2,3,4,5,6,7,8,9,10,11,12,13,14,15,16,17,18]
[1,{"$f":"$D$1","v":" "},"L-Name","Bob",null,"# of AB's",null,{"$f":"SUM(J13:AA13)","v":10},"AB's",1,1,1,1,1,1,1,1,1,1]
[null,null,"F-Name",null,null,"# of Hits",null,{"$f":"SUM(J14:AA14)","v":0},"Hits",0,0,0,0,0,0,0,0,0,0]
[null,null,null,null,null,"# of PA",null,{"$f":"SUM(J15:AA15)","v":10},"PA",1,1,1,1,1,1,1,1,1,1]
[null,null,null,"m",null,"Avg",null,{"$f":"IF(H13=0,\"\",(H14/H13))","v":0},"Avg",{"$f":"IF(J13=\"\",\"\",J14/J13)","v":0},0,0,0,0,0,0,0,0,0,"","","","","","","",""]
[2,{"$f":"$D$1","v":" "},"L-Name","Dorothy",null,"# of AB's",null,{"$f":"SUM(J17:AA17)","v":10},"AB's",1,1,1,1,1,1,1,1,1,1]
[null,null,"F-Name",null,null,"# of Hits",null,{"$f":"SUM(J18:AA18)","v":0},"Hits",0,0,0,0,0,0,0,0,0,0]
[null,null,null,null,null,"# of PA",null,{"$f":"SUM(J19:AA19)","v":10},"PA",1,1,1,1,1,1,1,1,1,1]
[null,null,null,"f",null,"Avg",null,{"$f":"IF(H17=0,\"\",H18/H17)","v":0},"Avg",{"$f":"IF(J17=\"\",\"\",J18/J17)","v":0},0,0,0,0,0,0,0,0,0,"","","","","","","",""]
[3,{"$f":"$D$1","v":" "},"L-Name","Cam",null,"# of AB's",null,{"$f":"SUM(J21:AA21)","v":10},"AB's",1,1,1,1,1,1,1,1,1,1]
[null,null,"F-Name",null,null,"# of Hits",null,{"$f":"SUM(J22:AA22)","v":0},"Hits",0,0,0,0,0,0,0,0,0,0]
[null,null,null,null,null,"# of PA",null,{"$f":"SUM(J23:AA23)","v":10},"PA",1,1,1,1,1,1,1,1,1,1]
[null,null,null,"m",null,"Avg",null,{"$f":"IF(H21=0,\"\",H22/H21)","v":0},"Avg",{"$f":"IF(J21=\"\",\"\",J22/J21)","v":0},0,0,0,0,0,0,0,0,0,"","","","","","","",""]
[4,{"$f":"$D$1","v":" "},"L-Name","Jill",null,"# of AB's",null,{"$f":"SUM(J25:AA25)","v":10},"AB's",1,1,1,1,1,1,1,1,1,1]
[null,null,"F-Name",null,null,"# of Hits",null,{"$f":"SUM(J26:AA26)","v":0},"Hits",0,0,0,0,0,0,0,0,0,0]
[null,null,null,null,null,"# of PA",null,{"$f":"SUM(J27:AA27)","v":10},"PA",1,1,1,1,1,1,1,1,1,1]
[null,null,null,"f",null,"Avg",null,{"$f":"IF(H25=0,\"\",H26/H25)","v":0},"Avg",{"$f":"IF(J25=\"\",\"\",J26/J25)","v":0},0,0,0,0,0,0,0,0,0,"","","","","","","",""]
[5,{"$f":"$D$1","v":" "},"L-Name","Mark",null,"# of AB's",null,{"$f":"SUM(J29:AA29)","v":10},"AB's",1,1,1,1,1,1,1,1,1,1]
[null,null,"F-Name",null,null,"# of Hits",null,{"$f":"SUM(J30:AA30)","v":0},"Hits",0,0,0,0,0,0,0,0,0,0]
[null,null,null,null,null,"# of PA",null,{"$f":"SUM(J31:AA31)","v":10},"PA",1,1,1,1,1,1,1,1,1,1]
[null,null,null,"m",null,"Avg",null,{"$f":"IF(H29=0,\"\",H30/H29)","v":0},"Avg",{"$f":"IF(J29=\"\",\"\",J30/J29)","v":0},0,0,0,0,0,0,0,0,0,"","","","","","","",""]
[6,{"$f":"$D$1","v":" "},"L-Name","Julie",null,"# of AB's",null,{"$f":"SUM(J33:AA33)","v":10},"AB's",1,1,1,1,1,1,1,1,1,1]
[null,null,"F-Name",null,null,"# of Hits",null,{"$f":"SUM(J34:AA34)","v":0},"Hits",0,0,0,0,0,0,0,0,0,0]
[null,null,null,null,null,"# of PA",null,{"$f":"SUM(J35:AA35)","v":10},"PA",1,1,1,1,1,1,1,1,1,1]
[null,null,null,"f",null,"Avg",null,{"$f":"IF(H33=0,\"\",H34/H33)","v":0},"Avg",{"$f":"IF(J33=\"\",\"\",J34/J33)","v":0},0,0,0,0,0,0,0,0,0,"","","","","","","",""]
[7,{"$f":"$D$1","v":" "},"L-Name","Kent",null,"# of AB's",null,{"$f":"SUM(J37:AA37)","v":10},"AB's",1,1,1,1,1,1,1,1,1,1]
[null,null,"F-Name",null,null,"# of Hits",null,{"$f":"SUM(J38:AA38)","v":0},"Hits",0,0,0,0,0,0,0,0,0,0]
[null,null,null,null,null,"# of PA",null,{"$f":"SUM(J39:AA39)","v":10},"PA",1,1,1,1,1,1,1,1,1,1]
[null,null,null,"m",null,"Avg",null,{"$f":"IF(H37=0,\"\",H38/H37)","v":0},"Avg",{"$f":"IF(J37=\"\",\"\",J38/J37)","v":0},0,0,0,0,0,0,0,0,0,"","","","","","","",""]
[8,{"$f":"$D$1","v":" "},"L-Name","Sheri",null,"# of AB's",null,{"$f":"SUM(J41:AA41)","v":10},"AB's",1,1,1,1,1,1,1,1,1,1]
[null,null,"F-Name",null,null,"# of Hits",null,{"$f":"SUM(J42:AA42)","v":0},"Hits",0,0,0,0,0,0,0,0,0,0]
[null,null,null,null,null,"# of PA",null,{"$f":"SUM(J43:AA43)","v":10},"PA",1,1,1,1,1,1,1,1,1,1]
[null,null,null,"f",null,"Avg",null,{"$f":"IF(H41=0,\"\",H42/H41)","v":0},"Avg",{"$f":"IF(J41=\"\",\"\",J42/J41)","v":0},0,0,0,0,0,0,0,0,0,"","","","","","","",""]
[9,{"$f":"$D$1","v":" "},"L-Name","George",null,"# of AB's",null,{"$f":"SUM(J45:AA45)","v":10},"AB's",1,1,1,1,1,1,1,1,1,1]
[null,null,"F-Name",null,null,"# of Hits",null,{"$f":"SUM(J46:AA46)","v":0},"Hits",0,0,0,0,0,0,0,0,0,0]
[null,null,null,null,null,"# of PA",null,{"$f":"SUM(J47:AA47)","v":10},"PA",1,1,1,1,1,1,1,1,1,1]
[null,null,null,"m",null,"Avg",null,{"$f":"IF(H45=0,\"\",H46/H45)","v":0},"Avg",{"$f":"IF(J45=\"\",\"\",J46/J45)","v":0},0,0,0,0,0,0,0,0,0,"","","","","","","",""]
[10,{"$f":"$D$1","v":" "},"L-Name","Trish",null,"# of AB's",null,{"$f":"SUM(J49:AA49)","v":10},"AB's",1,1,1,1,1,1,1,1,1,1]
[null,null,"F-Name",null,null,"# of Hits",null,{"$f":"SUM(J50:AA50)","v":0},"Hits",0,0,0,0,0,0,0,0,0,0]
[null,null,null,null,null,"# of PA",null,{"$f":"SUM(J51:AA51)","v":10},"PA",1,1,1,1,1,1,1,1,1,1]
[null,null,null,"f",null,"Avg",null,{"$f":"IF(H49=0,\"\",H50/H49)","v":0},"Avg",{"$f":"IF(J49=\"\",\"\",J50/J49)","v":0},0,0,0,0,0,0,0,0,0,"","","","","","","",""]
[11,{"$f":"$D$1","v":" "},"L-Name",null,null,"# of AB's",null,{"$f":"SUM(J53:AA53)","v":10},"AB's",1,1,1,1,1,1,1,1,1,1]
[null,null,"F-Name",null,null,"# of Hits",null,{"$f":"SUM(J54:AA54)","v":0},"Hits",0,0,0,0,0,0,0,0,0,0]
[null,null,null,null,null,"# of PA",null,{"$f":"SUM(J55:AA55)","v":10},"PA",1,1,1,1,1,1,1,1,1,1]
[null,null,null,"f",null,"Avg",null,{"$f":"IF(H53=0,\"\",H54/H53)","v":0},"Avg",{"$f":"IF(J53=\"\",\"\",J54/J53)","v":0},0,0,0,0,0,0,0,0,0,"","","","","","","",""]
[12,{"$f":"$D$1","v":" "},"L-Name",null,null,"# of AB's",null,{"$f":"SUM(J57:AA57)","v":0},"AB's"]
[null,null,"F-Name",null,null,"# of Hits",null,{"$f":"SUM(J58:AA58)","v":0},"Hits"]
[null,null,null,null,null,"# of PA",null,{"$f":"SUM(J59:AA59)","v":0},"PA"]
[null,null,null,"f",null,"Avg",null,{"$f":"IF(H57=0,\"\",H58/H57)","v":""},"Avg",{"$f":"IF(J57=\"\",\"\",J58/J57)","v":""},"","","","","",null,{"$f":"IF(Q57=\"\",\"\",Q58/Q57)","v":""},"","","","","","","","","",""]
[13,{"$f":"$D$1","v":" "},"B",null,null,"# of AB's",null,{"$f":"SUM(J61:AA61)","v":0},"AB's"]
[null,null,"F-Name",null,null,"# of Hits",null,{"$f":"SUM(J62:AA62)","v":0},"Hits"]
[null,null,null,null,null,"# of PA",null,{"$f":"SUM(J63:AA63)","v":0},"PA"]
[null,null,null,"f",null,"Avg",null,{"$f":"IF(H61=0,\"\",H62/H61)","v":""},"Avg",{"$f":"IF(J61=\"\",\"\",J62/J61)","v":""},"","","","","","","","","","","","","","","","",""]
[14,{"$f":"$D$1","v":" "},"L-Name",null,null,"# of AB's",null,{"$f":"SUM(J65:AA65)","v":0},"AB's"]
[null,null,"F-Name",null,null,"# of Hits",null,{"$f":"SUM(J66:AA66)","v":0},"Hits"]
[null,null,null,null,null,"# of PA",null,{"$f":"SUM(J67:AA67)","v":0},"PA"]
[null,null,null,"f",null,"Avg",null,{"$f":"IF(H65=0,\"\",H66/H65)","v":""},"Avg",{"$f":"IF(J65=\"\",\"\",J66/J65)","v":""},"","","","","","","","","","","","","","","","",""]
[15,{"$f":"$D$1","v":" "},"L-Name",null,null,"# of AB's",null,{"$f":"SUM(J69:AA69)","v":0},"AB's"]
[null,null,"F-Name",null,null,"# of Hits",null,{"$f":"SUM(J70:AA70)","v":0},"Hits"]
[null,null,null,null,null,"# of PA",null,{"$f":"SUM(J71:AA71)","v":0},"PA"]
[null,null,null,"f",null,"Avg",null,{"$f":"IF(H69=0,\"\",H70/H69)","v":""},"Avg",{"$f":"IF(J69=\"\",\"\",J70/J69)","v":""},"","","","","","","","",null,{"$f":"IF(T69=\"\",\"\",T70/T69)","v":""},"","","","","","",""]
[16,{"$f":"$D$1","v":" "},"R",null,null,"# of AB's",null,{"$f":"SUM(J73:AA73)","v":0},"AB's"]
[null,null,"F-Name",null,null,"# of Hits",null,{"$f":"SUM(J74:AA74)","v":0},"Hits"]
[null,null,null,null,null,"# of PA",null,{"$f":"SUM(J75:AA75)","v":0},"PA"]
[null,null,null,"f",null,"Avg",null,{"$f":"IF(H73=0,\"\",H74/H73)","v":""},"Avg",{"$f":"IF(J73=\"\",\"\",J74/J73)","v":""},"","","","","","","","","","","","","","","","",""]
[17,{"$f":"$D$1","v":" "},"L-Name",null,null,"# of AB's",null,{"$f":"SUM(J77:AA77)","v":0},"AB's"]
[null,null,"F-Name",null,null,"# of Hits",null,{"$f":"SUM(J78:AA78)","v":0},"Hits"]
[null,null,null,null,null,"# of PA",null,{"$f":"SUM(J79:AA79)","v":0},"PA"]
[null,null,null,"f",null,"Avg",null,{"$f":"IF(H77=0,\"\",H78/H77)","v":""},"Avg",{"$f":"IF(J77=\"\",\"\",J78/J77)","v":""},"","","","","","","","","","","","","","","","",""]
[18,{"$f":"$D$1","v":" "},"L-Name",null,null,"# of AB's",null,{"$f":"SUM(J81:AA81)","v":0},"AB's"]
[null,null,"F-Name",null,null,"# of Hits",null,{"$f":"SUM(J82:AA82)","v":0},"Hits"]
[null,null,null,null,null,"# of PA",null,{"$f":"SUM(J83:AA83)","v":0},"PA"]
[null,null,null,"f",null,"Avg",null,{"$f":"IF(H81=0,\"\",H82/H81)","v":""},"Avg",{"$f":"IF(J81=\"\",\"\",J82/J81)","v":""},"","","","","","","","","","","","","","","","",""]
[19,{"$f":"$D$1","v":" "},"L-Name",null,null,"# of AB's",null,{"$f":"SUM(J85:AA85)","v":0},"AB's"]
[null,null,"F-Name",null,null,"# of Hits",null,{"$f":"SUM(J86:AA86)","v":0},"Hits"]
[null,null,null,null,null,"# of PA",null,{"$f":"SUM(J87:AA87)","v":0},"PA"]
[null,null,null,"f",null,"Avg",null,{"$f":"IF(H85=0,\"\",H86/H85)","v":""},"Avg",{"$f":"IF(J85=\"\",\"\",J86/J85)","v":""},"","","","","","","","","","","","","","","","",""]
[20,{"$f":"$D$1","v":" "},"L-Name",null,null,"# of AB's",null,{"$f":"SUM(J89:AA89)","v":0},"AB's"]
[null,null,"F-Name",null,null,"# of Hits",null,{"$f":"SUM(J90:AA90)","v":0},"Hits"]
[null,null,null,null,null,"# of PA",null,{"$f":"SUM(J91:AA91)","v":0},"PA"]
[null,null,null,"f",null,"Avg",null,{"$f":"IF(H89=0,\"\",H90/H89)","v":""},"Avg",{"$f":"IF(J89=\"\",\"\",J90/J89)","v":""},"","","","","","","","","","","","","","","","",""]
[21,{"$f":"$D$1","v":" "},"L-Name",null,null,"# of AB's",null,{"$f":"SUM(J93:AA93)","v":0},"AB's"]
[null,null,"F-Name",null,null,"# of Hits",null,{"$f":"SUM(J94:AA94)","v":0},"Hits"]
[null,null,null,null,null,"# of PA",null,{"$f":"SUM(J95:AA95)","v":0},"PA"]
[null,null,null,"f",null,"Avg",null,{"$f":"IF(H93=0,\"\",H94/H93)","v":""},"Avg",{"$f":"IF(J93=\"\",\"\",J94/J93)","v":""},"","","","","","","","","","","","","","","","",""]
[22,{"$f":"$D$1","v":" "},"L-Name",null,null,"# of AB's",null,{"$f":"SUM(J97:AA97)","v":0},"AB's"]
[null,null,"F-Name",null,null,"# of Hits",null,{"$f":"SUM(J98:AA98)","v":0},"Hits"]
[null,null,null,null,null,"# of PA",null,{"$f":"SUM(J99:AA99)","v":0},"PA"]
[null,null,null,"f",null,"Avg",null,{"$f":"IF(H97=0,\"\",H98/H97)","v":""},"Avg",{"$f":"IF(J97=\"\",\"\",J98/J97)","v":""},"","","","","","","","","","","","","","","","",""]
[23,{"$f":"$D$1","v":" "},"L-Name",null,null,"# of AB's",null,{"$f":"SUM(J101:AA101)","v":0},"AB's"]
[null,null,"F-Name",null,null,"# of Hits",null,{"$f":"SUM(J102:AA102)","v":0},"Hits"]
[null,null,null,null,null,"# of PA",null,{"$f":"SUM(J103:AA103)","v":0},"PA"]
[null,null,null,"f",null,"Avg",null,{"$f":"IF(H101=0,\"\",H102/H101)","v":""},"Avg",{"$f":"IF(J101=\"\",\"\",J102/J101)","v":""},"","","","","","","","","","","","","","","","",""]
[24,{"$f":"$D$1","v":" "},"L-Name",null,null,"# of AB's",null,{"$f":"SUM(J105:AA105)","v":0},"AB's"]
[null,null,"F-Name",null,null,"# of Hits",null,{"$f":"SUM(J106:AA106)","v":0},"Hits"]
[null,null,null,null,null,"# of PA",null,{"$f":"SUM(J107:AA107)","v":0},"PA"]
[null,null,null,"f",null,"Avg",null,{"$f":"IF(H105=0,\"\",H106/H105)","v":""},"Avg",{"$f":"IF(J105=\"\",\"\",J106/J105)","v":""},"","","","","","","","","","","","","","","","",""]
[25,{"$f":"$D$1","v":" "},"L-Name",null,null,"# of AB's",null,{"$f":"SUM(J109:AA109)","v":0},"AB's"]
[null,null,"F-Name",null,null,"# of Hits",null,{"$f":"SUM(J110:AA110)","v":0},"Hits"]
[null,null,null,null,null,"# of PA",null,{"$f":"SUM(J111:AA111)","v":0},"PA"]
[null,null,null,"f",null,"Avg",null,{"$f":"IF(H109=0,\"\",H110/H109)","v":""},"Avg",{"$f":"IF(J109=\"\",\"\",J110/J109)","v":""},"","","","","","","","","","","","","","","","",""]
[null,{"$f":"$D$1","v":" "},null,"TEAM",null,"# of AB's",null,{"$f":"SUM(J113:AA113)","v":110},"AB's",{"$f":"IF(SUM(J109,J105,J101,J97,J93,J89,J85,J81,J77,J73,J69,J65,J61,J57,J53,J49,J45,J41,J37,J33,J29,J25,J21,J17,J13)=0,\"\",SUM(J13,J17,J21,J25,J29,J33,J37,J41,J45,J49,J53,J57,J61,J65,J69,J73,J77,J81,J85,J89,J93,J97,J101,J105,J109))","v":11},11,11,11,11,11,11,11,11,11,"","","","","","","",""]
[null,null,null,"Summary",null,"# of Hits",null,{"$f":"SUM(J114:AA114)","v":0},"Hits",{"$f":"IF(SUM(J110,J106,J102,J98,J94,J90,J86,J82,J78,J74,J70,J66,J62,J58,J54,J50,J46,J42,J38,J34,J30,J26,J22,J18,J14)=0,\"\",SUM(J14,J18,J22,J26,J30,J34,J38,J42,J46,J50,J54,J58,J62,J66,J70,J74,J78,J82,J86,J90,J94,J98,J102,J106,J110))","v":""},"","","","","","","","","","","","","","","","",""]
[null,null,null,null,null,"Avg",null,{"$f":"IF(H113=0,\"N/A\",H114/H113)","v":0},"Avg",{"$f":"IF(J113=\"\",\"\",J114/J113)","v":{"$error":"#VALUE!"}},{"$error":"#VALUE!"},{"$error":"#VALUE!"},{"$error":"#VALUE!"},{"$error":"#VALUE!"},{"$error":"#VALUE!"},{"$error":"#VALUE!"},{"$error":"#VALUE!"},{"$error":"#VALUE!"},{"$error":"#VALUE!"},"","","","","","","",""]

{"sheet":"Team 8","index":8,"n_rows":115,"n_cols":27,"rows_kept":115,"cut":false,"hidden":false,"merged":[]}
[null,null,"Team Name"," ",null,null,null,null,"Score",0,0,0,0,0,null,0,null,0,0]
[null,null,null,null,null,null,null,null,"Opponents Score",7,7,7,7,7,null,7,null,7,7]
[null,null,null,"Wins",null,{"$f":"SUM(J6:AA6)","v":0},null,null,"W or L",{"$f":"IF(SUM(J1,J2)=0,\"\",IF(J1<J2,\"L\",\"W\"))","v":"L"},"L","L","L","L","","L","","L","L","","","","","","","",""]
[null,null,null,"Losses",null,{"$f":"SUM(J7:AA7)","v":8},null,"Forfeit","FW or FL",null,null,null,null,null,null," "]
[null,null,null,null,"games played excluding Forfeit Wins",null,null,null,null,{"$f":"IF(J3=\"\",\"\",IF(J4=\"FW\",\"\",1))","v":1},1,1,1,1,"",1,"",1,1,"","","","","","","",""]
[null,null,null,null,null,null,null,{"$f":"IF(H4=\"w\",1,\"\")","v":""},"win",{"$f":"IF(J3=\"w\",1,\"\")","v":""},"","","","","","","","","","","","","","","","",""]
[null,null,null,null,null,null,null,{"$f":"IF(H4=\"l\",1,\"\")","v":""},"loss",{"$f":"IF(J3=\"l\",1,\"\")","v":1},1,1,1,1,"",1,"",1,1,"","","","","","","",""]
[null,null,null,"Games Played Excluding Forfeit Wins",null,{"$f":"SUM(J5:AA5)","v":8},null,"Opponents Team Name",null,null,null,null,null,null,"No Games",null,"No Games"]
[null,null,null,"League Run Diff     ",null,{"$f":"SUM(J9:AA9)","v":-56},null,null,"Game Run Diff",{"$f":"IF(J1=\"\",\"\",J1-J2)","v":-7},-7,-7,-7,-7,"",-7,"",-7,-7,"","","","","","","",""]
[null,null,null,"Team Batting Avg   ",null,{"$f":"$H$115","v":0},null,null,"Game Date"]
[]
[null,null,null,null,null,null,null,"STATS",null,1,2,3,4,5,6,7,8,9,10,11,12,13,14,15,16,17,18]
[1,{"$f":"$D$1","v":" "},"L-Name","Linda",null,"# of AB's",null,{"$f":"SUM(J13:AA13)","v":10},"AB's",1,1,1,1,1,1,1,1,1,1]
[null,null,"F-Name",null,null,"# of Hits",null,{"$f":"SUM(J14:AA14)","v":0},"Hits",0,0,0,0,0,0,0,0,0,0]
[null,null,null,null,null,"# of PA",null,{"$f":"SUM(J15:AA15)","v":10},"PA",1,1,1,1,1,1,1,1,1,1]
[null,null,null,"f",null,"Avg",null,{"$f":"IF(H13=0,\"\",(H14/H13))","v":0},"Avg",{"$f":"IF(J13=\"\",\"\",J14/J13)","v":0},0,0,0,0,0,0,0,0,0,"","","","","","","",""]
[2,{"$f":"$D$1","v":" "},"L-Name","David",null,"# of AB's",null,{"$f":"SUM(J17:AA17)","v":10},"AB's",1,1,1,1,1,1,1,1,1,1]
[null,null,"F-Name",null,null,"# of Hits",null,{"$f":"SUM(J18:AA18)","v":0},"Hits",0,0,0,0,0,0,0,0,0,0]
[null,null,null,null,null,"# of PA",null,{"$f":"SUM(J19:AA19)","v":10},"PA",1,1,1,1,1,1,1,1,1,1]
[null,null,null,"m",null,"Avg",null,{"$f":"IF(H17=0,\"\",H18/H17)","v":0},"Avg",{"$f":"IF(J17=\"\",\"\",J18/J17)","v":0},0,0,0,0,0,0,0,0,0,"","","","","","","",""]
[3,{"$f":"$D$1","v":" "},"L-Name","Kylie",null,"# of AB's",null,{"$f":"SUM(J21:AA21)","v":10},"AB's",1,1,1,1,1,1,1,1,1,1]
[null,null,"F-Name",null,null,"# of Hits",null,{"$f":"SUM(J22:AA22)","v":0},"Hits",0,0,0,0,0,0,0,0,0,0]
[null,null,null,null,null,"# of PA",null,{"$f":"SUM(J23:AA23)","v":10},"PA",1,1,1,1,1,1,1,1,1,1]
[null,null,null,"f",null,"Avg",null,{"$f":"IF(H21=0,\"\",H22/H21)","v":0},"Avg",{"$f":"IF(J21=\"\",\"\",J22/J21)","v":0},0,0,0,0,0,0,0,0,0,"","","","","","","",""]
[4,{"$f":"$D$1","v":" "},"L-Name","Dallen",null,"# of AB's",null,{"$f":"SUM(J25:AA25)","v":10},"AB's",1,1,1,1,1,1,1,1,1,1]
[null,null,"F-Name",null,null,"# of Hits",null,{"$f":"SUM(J26:AA26)","v":0},"Hits",0,0,0,0,0,0,0,0,0,0]
[null,null,null,null,null,"# of PA",null,{"$f":"SUM(J27:AA27)","v":10},"PA",1,1,1,1,1,1,1,1,1,1]
[null,null,null,"m",null,"Avg",null,{"$f":"IF(H25=0,\"\",H26/H25)","v":0},"Avg",{"$f":"IF(J25=\"\",\"\",J26/J25)","v":0},0,0,0,0,0,0,0,0,0,"","","","","","","",""]
[5,{"$f":"$D$1","v":" "},"L-Name","Lori",null,"# of AB's",null,{"$f":"SUM(J29:AA29)","v":10},"AB's",1,1,1,1,1,1,1,1,1,1]
[null,null,"F-Name",null,null,"# of Hits",null,{"$f":"SUM(J30:AA30)","v":0},"Hits",0,0,0,0,0,0,0,0,0,0]
[null,null,null,null,null,"# of PA",null,{"$f":"SUM(J31:AA31)","v":10},"PA",1,1,1,1,1,1,1,1,1,1]
[null,null,null,"f",null,"Avg",null,{"$f":"IF(H29=0,\"\",H30/H29)","v":0},"Avg",{"$f":"IF(J29=\"\",\"\",J30/J29)","v":0},0,0,0,0,0,0,0,0,0,"","","","","","","",""]
[6,{"$f":"$D$1","v":" "},"L-Name","Jack",null,"# of AB's",null,{"$f":"SUM(J33:AA33)","v":10},"AB's",1,1,1,1,1,1,1,1,1,1]
[null,null,"F-Name",null,null,"# of Hits",null,{"$f":"SUM(J34:AA34)","v":0},"Hits",0,0,0,0,0,0,0,0,0,0]
[null,null,null,null,null,"# of PA",null,{"$f":"SUM(J35:AA35)","v":10},"PA",1,1,1,1,1,1,1,1,1,1]
[null,null,null,"m",null,"Avg",null,{"$f":"IF(H33=0,\"\",H34/H33)","v":0},"Avg",{"$f":"IF(J33=\"\",\"\",J34/J33)","v":0},0,0,0,0,0,0,0,0,0,"","","","","","","",""]
[7,{"$f":"$D$1","v":" "},"L-Name","Kim",null,"# of AB's",null,{"$f":"SUM(J37:AA37)","v":10},"AB's",1,1,1,1,1,1,1,1,1,1]
[null,null,"F-Name",null,null,"# of Hits",null,{"$f":"SUM(J38:AA38)","v":0},"Hits",0,0,0,0,0,0,0,0,0,0]
[null,null,null,null,null,"# of PA",null,{"$f":"SUM(J39:AA39)","v":10},"PA",1,1,1,1,1,1,1,1,1,1]
[null,null,null,"f",null,"Avg",null,{"$f":"IF(H37=0,\"\",H38/H37)","v":0},"Avg",{"$f":"IF(J37=\"\",\"\",J38/J37)","v":0},0,0,0,0,0,0,0,0,0,"","","","","","","",""]
[8,{"$f":"$D$1","v":" "},"L-Name","Jeff",null,"# of AB's",null,{"$f":"SUM(J41:AA41)","v":10},"AB's",1,1,1,1,1,1,1,1,1,1]
[null,null,"F-Name",null,null,"# of Hits",null,{"$f":"SUM(J42:AA42)","v":0},"Hits",0,0,0,0,0,0,0,0,0,0]
[null,null,null,null,null,"# of PA",null,{"$f":"SUM(J43:AA43)","v":10},"PA",1,1,1,1,1,1,1,1,1,1]
[null,null,null,"m",null,"Avg",null,{"$f":"IF(H41=0,\"\",H42/H41)","v":0},"Avg",{"$f":"IF(J41=\"\",\"\",J42/J41)","v":0},0,0,0,0,0,0,0,0,0,"","","","","","","",""]
[9,{"$f":"$D$1","v":" "},"L-Name","Kenzie",null,"# of AB's",null,{"$f":"SUM(J45:AA45)","v":10},"AB's",1,1,1,1,1,1,1,1,1,1]
[null,null,"F-Name",null,null,"# of Hits",null,{"$f":"SUM(J46:AA46)","v":0},"Hits",0,0,0,0,0,0,0,0,0,0]
[null,null,null,null,null,"# of PA",null,{"$f":"SUM(J47:AA47)","v":10},"PA",1,1,1,1,1,1,1,1,1,1]
[null,null,null,"f",null,"Avg",null,{"$f":"IF(H45=0,\"\",H46/H45)","v":0},"Avg",{"$f":"IF(J45=\"\",\"\",J46/J45)","v":0},0,0,0,0,0,0,0,0,0,"","","","","","","",""]
[10,{"$f":"$D$1","v":" "},"L-Name","Paul",null,"# of AB's",null,{"$f":"SUM(J49:AA49)","v":10},"AB's",1,1,1,1,1,1,1,1,1,1]
[null,null,"F-Name",null,null,"# of Hits",null,{"$f":"SUM(J50:AA50)","v":0},"Hits",0,0,0,0,0,0,0,0,0,0]
[null,null,null,null,null,"# of PA",null,{"$f":"SUM(J51:AA51)","v":10},"PA",1,1,1,1,1,1,1,1,1,1]
[null,null,null,"m",null,"Avg",null,{"$f":"IF(H49=0,\"\",H50/H49)","v":0},"Avg",{"$f":"IF(J49=\"\",\"\",J50/J49)","v":0},0,0,0,0,0,0,0,0,0,"","","","","","","",""]
[11,{"$f":"$D$1","v":" "},"L-Name",null,null,"# of AB's",null,{"$f":"SUM(J53:AA53)","v":0},"AB's"]
[null,null,"F-Name",null,null,"# of Hits",null,{"$f":"SUM(J54:AA54)","v":0},"Hits"]
[null,null,null,null,null,"# of PA",null,{"$f":"SUM(J55:AA55)","v":0},"PA"]
[null,null,null,"f",null,"Avg",null,{"$f":"IF(H53=0,\"\",H54/H53)","v":""},"Avg",{"$f":"IF(J53=\"\",\"\",J54/J53)","v":""},"","","","","","","","","","","","","","","","",""]
[12,{"$f":"$D$1","v":" "},"L-Name",null,null,"# of AB's",null,{"$f":"SUM(J57:AA57)","v":0},"AB's"]
[null,null,"F-Name",null,null,"# of Hits",null,{"$f":"SUM(J58:AA58)","v":0},"Hits"]
[null,null,null,null,null,"# of PA",null,{"$f":"SUM(J59:AA59)","v":0},"PA"]
[null,null,null,"f",null,"Avg",null,{"$f":"IF(H57=0,\"\",H58/H57)","v":""},"Avg",{"$f":"IF(J57=\"\",\"\",J58/J57)","v":""},"","","","","","","","","","","","","","","","",""]
[13,{"$f":"$D$1","v":" "},"L-Name",null,null,"# of AB's",null,{"$f":"SUM(J61:AA61)","v":0},"AB's"]
[null,null,"F-Name",null,null,"# of Hits",null,{"$f":"SUM(J62:AA62)","v":0},"Hits"]
[null,null,null,null,null,"# of PA",null,{"$f":"SUM(J63:AA63)","v":0},"PA"]
[null,null,null,"f",null,"Avg",null,{"$f":"IF(H61=0,\"\",H62/H61)","v":""},"Avg",{"$f":"IF(J61=\"\",\"\",J62/J61)","v":""},"","","","","","","","","","","","","","","","",""]
[14,{"$f":"$D$1","v":" "},"L-Name",null,null,"# of AB's",null,{"$f":"SUM(J65:AA65)","v":0},"AB's"]
[null,null,"F-Name",null,null,"# of Hits",null,{"$f":"SUM(J66:AA66)","v":0},"Hits"]
[null,null,null,null,null,"# of PA",null,{"$f":"SUM(J67:AA67)","v":0},"PA"]
[null,null,null,"f",null,"Avg",null,{"$f":"IF(H65=0,\"\",H66/H65)","v":""},"Avg",{"$f":"IF(J65=\"\",\"\",J66/J65)","v":""},"","","","","","","","","","","","","","","","",""]
[15,{"$f":"$D$1","v":" "},"L-Name",null,null,"# of AB's",null,{"$f":"SUM(J69:AA69)","v":0},"AB's"]
[null,null,"F-Name",null,null,"# of Hits",null,{"$f":"SUM(J70:AA70)","v":0},"Hits"]
[null,null,null,null,null,"# of PA",null,{"$f":"SUM(J71:AA71)","v":0},"PA"]
[null,null,null,"f",null,"Avg",null,{"$f":"IF(H69=0,\"\",H70/H69)","v":""},"Avg",{"$f":"IF(J69=\"\",\"\",J70/J69)","v":""},"","","","","","","","","","","","","","","","",""]
[16,{"$f":"$D$1","v":" "},"L-Name",null,null,"# of AB's",null,{"$f":"SUM(J73:AA73)","v":0},"AB's"]
[null,null,"F-Name",null,null,"# of Hits",null,{"$f":"SUM(J74:AA74)","v":0},"Hits"]
[null,null,null,null,null,"# of PA",null,{"$f":"SUM(J75:AA75)","v":0},"PA"]
[null,null,null,"f",null,"Avg",null,{"$f":"IF(H73=0,\"\",H74/H73)","v":""},"Avg",{"$f":"IF(J73=\"\",\"\",J74/J73)","v":""},"","","","","","","","","","","","","","","","",""]
[17,{"$f":"$D$1","v":" "},"L-Name",null,null,"# of AB's",null,{"$f":"SUM(J77:AA77)","v":0},"AB's"]
[null,null,"F-Name",null,null,"# of Hits",null,{"$f":"SUM(J78:AA78)","v":0},"Hits"]
[null,null,null,null,null,"# of PA",null,{"$f":"SUM(J79:AA79)","v":0},"PA"]
[null,null,null,"f",null,"Avg",null,{"$f":"IF(H77=0,\"\",H78/H77)","v":""},"Avg",{"$f":"IF(J77=\"\",\"\",J78/J77)","v":""},"","","","","","","","","","","","","","","","",""]
[18,{"$f":"$D$1","v":" "},"L-Name",null,null,"# of AB's",null,{"$f":"SUM(J81:AA81)","v":0},"AB's"]
[null,null,"F-Name",null,null,"# of Hits",null,{"$f":"SUM(J82:AA82)","v":0},"Hits"]
[null,null,null,null,null,"# of PA",null,{"$f":"SUM(J83:AA83)","v":0},"PA"]
[null,null,null,"f",null,"Avg",null,{"$f":"IF(H81=0,\"\",H82/H81)","v":""},"Avg",{"$f":"IF(J81=\"\",\"\",J82/J81)","v":""},"","","","","","","","","","","","","","","","",""]
[19,{"$f":"$D$1","v":" "},"L-Name",null,null,"# of AB's",null,{"$f":"SUM(J85:AA85)","v":0},"AB's"]
[null,null,"F-Name",null,null,"# of Hits",null,{"$f":"SUM(J86:AA86)","v":0},"Hits"]
[null,null,null,null,null,"# of PA",null,{"$f":"SUM(J87:AA87)","v":0},"PA"]
[null,null,null,"f",null,"Avg",null,{"$f":"IF(H85=0,\"\",H86/H85)","v":""},"Avg",{"$f":"IF(J85=\"\",\"\",J86/J85)","v":""},"","","","","","","","","","","","","","","","",""]
[20,{"$f":"$D$1","v":" "},"L-Name",null,null,"# of AB's",null,{"$f":"SUM(J89:AA89)","v":0},"AB's"]
[null,null,"F-Name",null,null,"# of Hits",null,{"$f":"SUM(J90:AA90)","v":0},"Hits"]
[null,null,null,null,null,"# of PA",null,{"$f":"SUM(J91:AA91)","v":0},"PA"]
[null,null,null,"f",null,"Avg",null,{"$f":"IF(H89=0,\"\",H90/H89)","v":""},"Avg",{"$f":"IF(J89=\"\",\"\",J90/J89)","v":""},"","","","","","","","","","","","","","","","",""]
[21,{"$f":"$D$1","v":" "},"L-Name",null,null,"# of AB's",null,{"$f":"SUM(J93:AA93)","v":0},"AB's"]
[null,null,"F-Name",null,null,"# of Hits",null,{"$f":"SUM(J94:AA94)","v":0},"Hits"]
[null,null,null,null,null,"# of PA",null,{"$f":"SUM(J95:AA95)","v":0},"PA"]
[null,null,null,"f",null,"Avg",null,{"$f":"IF(H93=0,\"\",H94/H93)","v":""},"Avg",{"$f":"IF(J93=\"\",\"\",J94/J93)","v":""},"","","","","","","","","","","","","","","","",""]
[22,{"$f":"$D$1","v":" "},"L-Name",null,null,"# of AB's",null,{"$f":"SUM(J97:AA97)","v":0},"AB's"]
[null,null,"F-Name",null,null,"# of Hits",null,{"$f":"SUM(J98:AA98)","v":0},"Hits"]
[null,null,null,null,null,"# of PA",null,{"$f":"SUM(J99:AA99)","v":0},"PA"]
[null,null,null,"f",null,"Avg",null,{"$f":"IF(H97=0,\"\",H98/H97)","v":""},"Avg",{"$f":"IF(J97=\"\",\"\",J98/J97)","v":""},"","","","","","","","","","","","","","","","",""]
[23,{"$f":"$D$1","v":" "},"L-Name",null,null,"# of AB's",null,{"$f":"SUM(J101:AA101)","v":0},"AB's"]
[null,null,"F-Name",null,null,"# of Hits",null,{"$f":"SUM(J102:AA102)","v":0},"Hits"]
[null,null,null,null,null,"# of PA",null,{"$f":"SUM(J103:AA103)","v":0},"PA"]
[null,null,null,"f",null,"Avg",null,{"$f":"IF(H101=0,\"\",H102/H101)","v":""},"Avg",{"$f":"IF(J101=\"\",\"\",J102/J101)","v":""},"","","","","","","","","","","","","","","","",""]
[24,{"$f":"$D$1","v":" "},"L-Name",null,null,"# of AB's",null,{"$f":"SUM(J105:AA105)","v":0},"AB's"]
[null,null,"F-Name",null,null,"# of Hits",null,{"$f":"SUM(J106:AA106)","v":0},"Hits"]
[null,null,null,null,null,"# of PA",null,{"$f":"SUM(J107:AA107)","v":0},"PA"]
[null,null,null,"f",null,"Avg",null,{"$f":"IF(H105=0,\"\",H106/H105)","v":""},"Avg",{"$f":"IF(J105=\"\",\"\",J106/J105)","v":""},"","","","","","","","","","","","","","","","",""]
[25,{"$f":"$D$1","v":" "},"L-Name",null,null,"# of AB's",null,{"$f":"SUM(J109:AA109)","v":0},"AB's"]
[null,null,"F-Name",null,null,"# of Hits",null,{"$f":"SUM(J110:AA110)","v":0},"Hits"]
[null,null,null,null,null,"# of PA",null,{"$f":"SUM(J111:AA111)","v":0},"PA"]
[null,null,null,"f",null,"Avg",null,{"$f":"IF(H109=0,\"\",H110/H109)","v":""},"Avg",{"$f":"IF(J109=\"\",\"\",J110/J109)","v":""},"","","","","","","","","","","","","","","","",""]
[null,{"$f":"$D$1","v":" "},null,"TEAM",null,"# of AB's",null,{"$f":"SUM(J113:AA113)","v":100},"AB's",{"$f":"IF(SUM(J109,J105,J101,J97,J93,J89,J85,J81,J77,J73,J69,J65,J61,J57,J53,J49,J45,J41,J37,J33,J29,J25,J21,J17,J13)=0,\"\",SUM(J13,J17,J21,J25,J29,J33,J37,J41,J45,J49,J53,J57,J61,J65,J69,J73,J77,J81,J85,J89,J93,J97,J101,J105,J109))","v":10},10,10,10,10,10,10,10,10,10,"","","","","","","",""]
[null,null,null,"Summary",null,"# of Hits",null,{"$f":"SUM(J114:AA114)","v":0},"Hits",{"$f":"IF(SUM(J110,J106,J102,J98,J94,J90,J86,J82,J78,J74,J70,J66,J62,J58,J54,J50,J46,J42,J38,J34,J30,J26,J22,J18,J14)=0,\"\",SUM(J14,J18,J22,J26,J30,J34,J38,J42,J46,J50,J54,J58,J62,J66,J70,J74,J78,J82,J86,J90,J94,J98,J102,J106,J110))","v":""},"","","","","","","","","","","","","","","","",""]
[null,null,null,null,null,"Avg",null,{"$f":"IF(H113=0,\"N/A\",H114/H113)","v":0},"Avg",{"$f":"IF(J113=\"\",\"\",J114/J113)","v":{"$error":"#VALUE!"}},{"$error":"#VALUE!"},{"$error":"#VALUE!"},{"$error":"#VALUE!"},{"$error":"#VALUE!"},{"$error":"#VALUE!"},{"$error":"#VALUE!"},{"$error":"#VALUE!"},{"$error":"#VALUE!"},{"$error":"#VALUE!"},"","","","","","","",""]

{"sheet":"Female","index":9,"n_rows":201,"n_cols":12,"rows_kept":201,"cut":false,"hidden":false,"merged":[]}
["counter","roster #","Team Name","L-Name","F-Name","Batting Avg","# of AB's","# of Games","Enough pa's","HITS","# of PA","Male/Female"]
[8,{"$f":"'Bad Pitches'!$A$41","v":8},{"$f":"'Bad Pitches'!$D$1","v":"Bad Pitches"},{"$f":"'Bad Pitches'!$D$41","v":"Calliane"},{"$f":"'Bad Pitches'!$D$42","v":"Hodson"},{"$f":"'Bad Pitches'!$H$44","v":0.875},{"$f":"'Bad Pitches'!$H$41","v":8},{"$f":"'Bad Pitches'!$F$8","v":3},{"$f":"IF(K2<(H2*2.5),\"N\",\"Y\")","v":"Y"},{"$f":"'Bad Pitches'!$H$42","v":7},{"$f":"'Bad Pitches'!$H$43","v":8},{"$f":"'Bad Pitches'!$D$44","v":"f"}]
[52,{"$f":"'Ghetto Bombers'!$A$17","v":2},{"$f":"'Ghetto Bombers'!$D$1","v":"Ghetto Bombers"},{"$f":"'Ghetto Bombers'!$D$17","v":"Calleigh"},{"$f":"'Ghetto Bombers'!$D$18","v":"DeYoung"},{"$f":"'Ghetto Bombers'!$H$20","v":0.875},{"$f":"'Ghetto Bombers'!$H$17","v":8},{"$f":"'Ghetto Bombers'!$F$8","v":4},"Y",{"$f":"'Ghetto Bombers'!$H$18","v":7},{"$f":"'Ghetto Bombers'!$H$19","v":12},{"$f":"'Ghetto Bombers'!$D$20","v":"f"}]
[29,{"$f":"BCBC!$A$25","v":4},{"$f":"BCBC!$D$1","v":"BCBC"},{"$f":"BCBC!$D$25","v":"Maree"},{"$f":"BCBC!$D$26","v":"Achermann"},{"$f":"BCBC!$H$28","v":0.625},{"$f":"BCBC!$H$25","v":16},{"$f":"BCBC!$F$8","v":4},"Y",{"$f":"BCBC!$H$26","v":10},{"$f":"BCBC!$H$27","v":16},{"$f":"BCBC!$D$28","v":"f"}]
[31,{"$f":"BCBC!$A$33","v":6},{"$f":"BCBC!$D$1","v":"BCBC"},{"$f":"BCBC!$D$33","v":"Sunni"},{"$f":"BCBC!$D$34","v":"Jackson"},{"$f":"BCBC!$H$36","v":0.5714285714285714},{"$f":"BCBC!$H$33","v":14},{"$f":"BCBC!$F$8","v":4},"Y",{"$f":"BCBC!$H$34","v":8},{"$f":"BCBC!$H$35","v":15},{"$f":"BCBC!$D$36","v":"f"}]
[37,{"$f":"BCBC!$A$57","v":12},{"$f":"BCBC!$D$1","v":"BCBC"},{"$f":"BCBC!$D$57","v":"Mel"},{"$f":"BCBC!$D$58","v":"Maile"},{"$f":"BCBC!$H$60","v":0.53846153846153844},{"$f":"BCBC!$H$57","v":13},{"$f":"BCBC!$F$8","v":4},"Y",{"$f":"BCBC!$H$58","v":7},{"$f":"BCBC!$H$59","v":13},{"$f":"BCBC!$D$60","v":"f"}]
[33,{"$f":"BCBC!$A$41","v":8},{"$f":"BCBC!$D$1","v":"BCBC"},{"$f":"BCBC!$D$41","v":"Casey"},{"$f":"BCBC!$D$42","v":"Velarde"},{"$f":"BCBC!$H$44","v":0.5},{"$f":"BCBC!$H$41","v":10},{"$f":"BCBC!$F$8","v":4},"Y",{"$f":"BCBC!$H$42","v":5},{"$f":"BCBC!$H$43","v":10},{"$f":"BCBC!$D$44","v":"f"}]
[101,{"$f":"Sticks!$A$13","v":1},{"$f":"Sticks!$D$1","v":"Sticks"},{"$f":"Sticks!$D$13","v":"Kacee"},{"$f":"Sticks!$D$14","v":"Robinson"},{"$f":"Sticks!$H$16","v":0.46666666666666667},{"$f":"Sticks!$H$13","v":15},{"$f":"Sticks!$F$8","v":4},"Y",{"$f":"Sticks!$H$14","v":7},{"$f":"Sticks!$H$15","v":16},{"$f":"Sticks!$D$16","v":"f"}]
[58,{"$f":"'Ghetto Bombers'!$A$41","v":8},{"$f":"'Ghetto Bombers'!$D$1","v":"Ghetto Bombers"},{"$f":"'Ghetto Bombers'!$D$41","v":"Brandi"},{"$f":"'Ghetto Bombers'!$D$42","v":"Hall"},{"$f":"'Ghetto Bombers'!$H$44","v":0.46153846153846156},{"$f":"'Ghetto Bombers'!$H$41","v":13},{"$f":"'Ghetto Bombers'!$F$8","v":4},"Y",{"$f":"'Ghetto Bombers'!$H$42","v":6},{"$f":"'Ghetto Bombers'!$H$43","v":13},{"$f":"'Ghetto Bombers'!$D$44","v":"f"}]
[39,{"$f":"BCBC!$A$65","v":14},{"$f":"BCBC!$D$1","v":"BCBC"},{"$f":"BCBC!$D$65","v":"Tiffany"},{"$f":"BCBC!$D$66","v":"Morton"},{"$f":"BCBC!$H$68","v":0.36363636363636365},{"$f":"BCBC!$H$65","v":11},{"$f":"BCBC!$F$8","v":4},"Y",{"$f":"BCBC!$H$66","v":4},{"$f":"BCBC!$H$67","v":11},{"$f":"BCBC!$D$68","v":"f"}]
[35,{"$f":"BCBC!$A$49","v":10},{"$f":"BCBC!$D$1","v":"BCBC"},{"$f":"BCBC!$D$49","v":"Robyne"},{"$f":"BCBC!$D$50","v":"Oostveen"},{"$f":"BCBC!$H$52","v":0.35714285714285715},{"$f":"BCBC!$H$49","v":14},{"$f":"BCBC!$F$8","v":4},"Y",{"$f":"BCBC!$H$50","v":5},{"$f":"BCBC!$H$51","v":14},{"$f":"BCBC!$D$52","v":"f"}]
[6,{"$f":"'Bad Pitches'!$A$33","v":6},{"$f":"'Bad Pitches'!$D$1","v":"Bad Pitches"},{"$f":"'Bad Pitches'!$D$33","v":"Paige"},{"$f":"'Bad Pitches'!$D$34","v":"Reynolds"},{"$f":"'Bad Pitches'!$H$36","v":0.33333333333333331},{"$f":"'Bad Pitches'!$H$33","v":12},{"$f":"'Bad Pitches'!$F$8","v":3},"Y",{"$f":"'Bad Pitches'!$H$34","v":4},{"$f":"'Bad Pitches'!$H$35","v":12},{"$f":"'Bad Pitches'!$D$36","v":"f"}]
[107,{"$f":"Sticks!$A$37","v":7},{"$f":"Sticks!$D$1","v":"Sticks"},{"$f":"Sticks!$D$37","v":"Shar"},{"$f":"Sticks!$D$38","v":"Norton"},{"$f":"Sticks!$H$40","v":0.33333333333333331},{"$f":"Sticks!$H$37","v":12},{"$f":"Sticks!$F$8","v":4},"Y",{"$f":"Sticks!$H$38","v":4},{"$f":"Sticks!$H$39","v":13},{"$f":"Sticks!$D$40","v":"f"}]
[54,{"$f":"'Ghetto Bombers'!$A$25","v":4},{"$f":"'Ghetto Bombers'!$D$1","v":"Ghetto Bombers"},{"$f":"'Ghetto Bombers'!$D$25","v":"JoJo"},{"$f":"'Ghetto Bombers'!$D$26","v":"Carlson"},{"$f":"'Ghetto Bombers'!$H$28","v":0.3125},{"$f":"'Ghetto Bombers'!$H$25","v":16},{"$f":"'Ghetto Bombers'!$F$8","v":4},"Y",{"$f":"'Ghetto Bombers'!$H$26","v":5},{"$f":"'Ghetto Bombers'!$H$27","v":16},{"$f":"'Ghetto Bombers'!$D$28","v":"f"}]
[2,{"$f":"'Bad Pitches'!$A$17","v":2},{"$f":"'Bad Pitches'!$D$1","v":"Bad Pitches"},{"$f":"'Bad Pitches'!$D$17","v":"Tayce"},{"$f":"'Bad Pitches'!$D$18","v":"Shamo"},{"$f":"'Bad Pitches'!$H$20","v":0.30769230769230771},{"$f":"'Bad Pitches'!$H$17","v":13},{"$f":"'Bad Pitches'!$F$8","v":3},"Y",{"$f":"'Bad Pitches'!$H$18","v":4},{"$f":"'Bad Pitches'!$H$19","v":13},{"$f":"'Bad Pitches'!$D$20","v":"f"}]
[62,{"$f":"'Ghetto Bombers'!$A$57","v":12},{"$f":"'Ghetto Bombers'!$D$1","v":"Ghetto Bombers"},{"$f":"'Ghetto Bombers'!$D$57","v":"Ali"},{"$f":"'Ghetto Bombers'!$D$58","v":"Smith"},{"$f":"'Ghetto Bombers'!$H$60","v":0.27272727272727271},{"$f":"'Ghetto Bombers'!$H$57","v":11},{"$f":"'Ghetto Bombers'!$F$8","v":4},"Y",{"$f":"'Ghetto Bombers'!$H$58","v":3},{"$f":"'Ghetto Bombers'!$H$59","v":13},{"$f":"'Ghetto Bombers'!$D$60","v":"f"}]
[103,{"$f":"Sticks!$A$21","v":3},{"$f":"Sticks!$D$1","v":"Sticks"},{"$f":"Sticks!$D$21","v":"Whitney"},{"$f":"Sticks!$D$22","v":"Larson"},{"$f":"Sticks!$H$24","v":0.25},{"$f":"Sticks!$H$21","v":12},{"$f":"Sticks!$F$8","v":4},"Y",{"$f":"Sticks!$H$22","v":3},{"$f":"Sticks!$H$23","v":12},{"$f":"Sticks!$D$24","v":"f"}]
[4,{"$f":"'Bad Pitches'!$A$25","v":4},{"$f":"'Bad Pitches'!$D$1","v":"Bad Pitches"},{"$f":"'Bad Pitches'!$D$25","v":"Stephanie"},{"$f":"'Bad Pitches'!$D$26","v":"Bonham"},{"$f":"'Bad Pitches'!$H$28","v":0.25},{"$f":"'Bad Pitches'!$H$25","v":12},{"$f":"'Bad Pitches'!$F$8","v":3},"Y",{"$f":"'Bad Pitches'!$H$26","v":3},{"$f":"'Bad Pitches'!$H$27","v":12},{"$f":"'Bad Pitches'!$D$28","v":"f"}]
[111,{"$f":"Sticks!$A$53","v":11},{"$f":"Sticks!$D$1","v":"Sticks"},{"$f":"Sticks!$D$53","v":"Melinda"},{"$f":"Sticks!$D$54","v":"Adams"},{"$f":"Sticks!$H$56","v":0.2},{"$f":"Sticks!$H$53","v":10},{"$f":"Sticks!$F$8","v":4},"Y",{"$f":"Sticks!$H$54","v":2},{"$f":"Sticks!$H$55","v":12},{"$f":"Sticks!$D$56","v":"f"}]
[56,{"$f":"'Ghetto Bombers'!$A$33","v":6},{"$f":"'Ghetto Bombers'!$D$1","v":"Ghetto Bombers"},{"$f":"'Ghetto Bombers'!$D$33","v":"Angela"},{"$f":"'Ghetto Bombers'!$D$34","v":"Ahmadpour"},{"$f":"'Ghetto Bombers'!$H$36","v":0.1},{"$f":"'Ghetto Bombers'!$H$33","v":10},{"$f":"'Ghetto Bombers'!$F$8","v":4},"Y",{"$f":"'Ghetto Bombers'!$H$34","v":1},{"$f":"'Ghetto Bombers'!$H$35","v":10},{"$f":"'Ghetto Bombers'!$D$36","v":"f"}]
[45,{"$f":"BCBC!$A$89","v":20},{"$f":"BCBC!$D$1","v":"BCBC"},{"$f":"BCBC!$D$89","v":0},{"$f":"BCBC!$D$90","v":0},{"$f":"BCBC!$H$92","v":""},{"$f":"BCBC!$H$89","v":0},{"$f":"BCBC!$F$8","v":4},"N",{"$f":"BCBC!$H$90","v":0},{"$f":"BCBC!$H$91","v":0},{"$f":"BCBC!$D$92","v":"f"}]
[47,{"$f":"BCBC!$A$97","v":22},{"$f":"BCBC!$D$1","v":"BCBC"},{"$f":"BCBC!$D$97","v":0},{"$f":"BCBC!$D$98","v":0},{"$f":"BCBC!$H$100","v":""},{"$f":"BCBC!$H$97","v":0},{"$f":"BCBC!$F$8","v":4},"N",{"$f":"BCBC!$H$98","v":0},{"$f":"BCBC!$H$99","v":0},{"$f":"BCBC!$D$100","v":"f"}]
[49,{"$f":"BCBC!$A$105","v":24},{"$f":"BCBC!$D$1","v":"BCBC"},{"$f":"BCBC!$D$105","v":0},{"$f":"BCBC!$D$106","v":0},{"$f":"BCBC!$H$108","v":""},{"$f":"BCBC!$H$105","v":0},{"$f":"BCBC!$F$8","v":4},"N",{"$f":"BCBC!$H$106","v":0},{"$f":"BCBC!$H$107","v":0},{"$f":"BCBC!$D$108","v":"f"}]
[70,{"$f":"'Ghetto Bombers'!$A$89","v":20},{"$f":"'Ghetto Bombers'!$D$1","v":"Ghetto Bombers"},{"$f":"'Ghetto Bombers'!$D$89","v":0},{"$f":"'Ghetto Bombers'!$D$90","v":0},{"$f":"'Ghetto Bombers'!$H$92","v":""},{"$f":"'Ghetto Bombers'!$H$89","v":0},{"$f":"'Ghetto Bombers'!$F$8","v":4},"N",{"$f":"'Ghetto Bombers'!$H$90","v":0},{"$f":"'Ghetto Bombers'!$H$91","v":0},{"$f":"'Ghetto Bombers'!$D$92","v":"f"}]
[43,{"$f":"BCBC!$A$81","v":18},{"$f":"BCBC!$D$1","v":"BCBC"},{"$f":"BCBC!$D$81","v":0},{"$f":"BCBC!$D$82","v":0},{"$f":"BCBC!$H$84","v":""},{"$f":"BCBC!$H$81","v":0},{"$f":"BCBC!$F$8","v":4},"N",{"$f":"BCBC!$H$82","v":0},{"$f":"BCBC!$H$83","v":0},{"$f":"BCBC!$D$84","v":"f"}]
[41,{"$f":"BCBC!$A$73","v":16},{"$f":"BCBC!$D$1","v":"BCBC"},{"$f":"BCBC!$D$73","v":0},{"$f":"BCBC!$D$74","v":0},{"$f":"BCBC!$H$76","v":""},{"$f":"BCBC!$H$73","v":0},{"$f":"BCBC!$F$8","v":4},"N",{"$f":"BCBC!$H$74","v":0},{"$f":"BCBC!$H$75","v":0},{"$f":"BCBC!$D$76","v":"f"}]
[68,{"$f":"'Ghetto Bombers'!$A$81","v":18},{"$f":"'Ghetto Bombers'!$D$1","v":"Ghetto Bombers"},{"$f":"'Ghetto Bombers'!$D$81","v":0},{"$f":"'Ghetto Bombers'!$D$82","v":0},{"$f":"'Ghetto Bombers'!$H$84","v":""},{"$f":"'Ghetto Bombers'!$H$81","v":0},{"$f":"'Ghetto Bombers'!$F$8","v":4},"N",{"$f":"'Ghetto Bombers'!$H$82","v":0},{"$f":"'Ghetto Bombers'!$H$83","v":0},{"$f":"'Ghetto Bombers'!$D$84","v":"f"}]
[137,{"$f":"'Team 6'!$A$57","v":12},{"$f":"'Team 6'!$D$1","v":"Team 6"},{"$f":"'Team 6'!$D$57","v":0},{"$f":"'Team 6'!$D$58","v":0},{"$f":"'Team 6'!$H$60","v":""},{"$f":"'Team 6'!$H$57","v":0},{"$f":"'Team 6'!$F$8","v":8},"N",{"$f":"'Team 6'!$H$58","v":0},{"$f":"'Team 6'!$H$59","v":0},{"$f":"'Team 6'!$D$60","v":"f"}]
[21,{"$f":"'Bad Pitches'!$A$93","v":21},{"$f":"'Bad Pitches'!$D$1","v":"Bad Pitches"},{"$f":"'Bad Pitches'!$D$93","v":0},{"$f":"'Bad Pitches'!$D$94","v":0},{"$f":"'Bad Pitches'!$H$96","v":""},{"$f":"'Bad Pitches'!$H$93","v":0},{"$f":"'Bad Pitches'!$F$8","v":3},"N",{"$f":"'Bad Pitches'!$H$94","v":0},{"$f":"'Bad Pitches'!$H$95","v":0},{"$f":"'Bad Pitches'!$D$96","v":"f"}]
[22,{"$f":"'Bad Pitches'!$A$97","v":22},{"$f":"'Bad Pitches'!$D$1","v":"Bad Pitches"},{"$f":"'Bad Pitches'!$D$97","v":0},{"$f":"'Bad Pitches'!$D$98","v":0},{"$f":"'Bad Pitches'!$H$100","v":""},{"$f":"'Bad Pitches'!$H$97","v":0},{"$f":"'Bad Pitches'!$F$8","v":3},"N",{"$f":"'Bad Pitches'!$H$98","v":0},{"$f":"'Bad Pitches'!$H$99","v":0},{"$f":"'Bad Pitches'!$D$100","v":"f"}]
[23,{"$f":"'Bad Pitches'!$A$101","v":23},{"$f":"'Bad Pitches'!$D$1","v":"Bad Pitches"},{"$f":"'Bad Pitches'!$D$101","v":0},{"$f":"'Bad Pitches'!$D$102","v":0},{"$f":"'Bad Pitches'!$H$104","v":""},{"$f":"'Bad Pitches'!$H$101","v":0},{"$f":"'Bad Pitches'!$F$8","v":3},"N",{"$f":"'Bad Pitches'!$H$102","v":0},{"$f":"'Bad Pitches'!$H$103","v":0},{"$f":"'Bad Pitches'!$D$104","v":"f"}]
[24,{"$f":"'Bad Pitches'!$A$105","v":24},{"$f":"'Bad Pitches'!$D$1","v":"Bad Pitches"},{"$f":"'Bad Pitches'!$D$105","v":0},{"$f":"'Bad Pitches'!$D$106","v":0},{"$f":"'Bad Pitches'!$H$108","v":""},{"$f":"'Bad Pitches'!$H$105","v":0},{"$f":"'Bad Pitches'!$F$8","v":3},"N",{"$f":"'Bad Pitches'!$H$106","v":0},{"$f":"'Bad Pitches'!$H$107","v":0},{"$f":"'Bad Pitches'!$D$108","v":"f"}]
[25,{"$f":"'Bad Pitches'!$A$109","v":25},{"$f":"'Bad Pitches'!$D$1","v":"Bad Pitches"},{"$f":"'Bad Pitches'!$D$109","v":0},{"$f":"'Bad Pitches'!$D$110","v":0},{"$f":"'Bad Pitches'!$H$112","v":""},{"$f":"'Bad Pitches'!$H$109","v":0},{"$f":"'Bad Pitches'!$F$8","v":3},"N",{"$f":"'Bad Pitches'!$H$110","v":0},{"$f":"'Bad Pitches'!$H$111","v":0},{"$f":"'Bad Pitches'!$D$112","v":"f"}]
[72,{"$f":"'Ghetto Bombers'!$A$97","v":22},{"$f":"'Ghetto Bombers'!$D$1","v":"Ghetto Bombers"},{"$f":"'Ghetto Bombers'!$D$97","v":0},{"$f":"'Ghetto Bombers'!$D$98","v":0},{"$f":"'Ghetto Bombers'!$H$100","v":""},{"$f":"'Ghetto Bombers'!$H$97","v":0},{"$f":"'Ghetto Bombers'!$F$8","v":4},{"$f":"IF(K34<(H34*2.5),\"N\",\"Y\")","v":"N"},{"$f":"'Ghetto Bombers'!$H$98","v":0},{"$f":"'Ghetto Bombers'!$H$99","v":0},{"$f":"'Ghetto Bombers'!$D$100","v":"f"}]
[73,{"$f":"'Ghetto Bombers'!$A$101","v":23},{"$f":"'Ghetto Bombers'!$D$1","v":"Ghetto Bombers"},{"$f":"'Ghetto Bombers'!$D$101","v":0},{"$f":"'Ghetto Bombers'!$D$102","v":0},{"$f":"'Ghetto Bombers'!$H$104","v":""},{"$f":"'Ghetto Bombers'!$H$101","v":0},{"$f":"'Ghetto Bombers'!$F$8","v":4},"N",{"$f":"'Ghetto Bombers'!$H$102","v":0},{"$f":"'Ghetto Bombers'!$H$103","v":0},{"$f":"'Ghetto Bombers'!$D$104","v":"f"}]
[74,{"$f":"'Ghetto Bombers'!$A$105","v":24},{"$f":"'Ghetto Bombers'!$D$1","v":"Ghetto Bombers"},{"$f":"'Ghetto Bombers'!$D$105","v":0},{"$f":"'Ghetto Bombers'!$D$106","v":0},{"$f":"'Ghetto Bombers'!$H$108","v":""},{"$f":"'Ghetto Bombers'!$H$105","v":0},{"$f":"'Ghetto Bombers'!$F$8","v":4},"N",{"$f":"'Ghetto Bombers'!$H$106","v":0},{"$f":"'Ghetto Bombers'!$H$107","v":0},{"$f":"'Ghetto Bombers'!$D$108","v":"f"}]
[75,{"$f":"'Ghetto Bombers'!$A$109","v":25},{"$f":"'Ghetto Bombers'!$D$1","v":"Ghetto Bombers"},{"$f":"'Ghetto Bombers'!$D$109","v":0},{"$f":"'Ghetto Bombers'!$D$110","v":0},{"$f":"'Ghetto Bombers'!$H$112","v":""},{"$f":"'Ghetto Bombers'!$H$109","v":0},{"$f":"'Ghetto Bombers'!$F$8","v":4},"N",{"$f":"'Ghetto Bombers'!$H$110","v":0},{"$f":"'Ghetto Bombers'!$H$111","v":0},{"$f":"'Ghetto Bombers'!$D$112","v":"f"}]
[95,{"$f":"'Hit Squad'!$A$89","v":20},{"$f":"'Hit Squad'!$D$1","v":"Hit Squad"},{"$f":"'Hit Squad'!$D$89","v":0},{"$f":"'Hit Squad'!$D$90","v":0},{"$f":"'Hit Squad'!$H$92","v":""},{"$f":"'Hit Squad'!$H$89","v":0},{"$f":"'Hit Squad'!$F$8","v":3},"N",{"$f":"'Hit Squad'!$H$90","v":0},{"$f":"'Hit Squad'!$H$91","v":0},{"$f":"'Hit Squad'!$D$92","v":"f"}]
[96,{"$f":"'Hit Squad'!$A$93","v":21},{"$f":"'Hit Squad'!$D$1","v":"Hit Squad"},{"$f":"'Hit Squad'!$D$93","v":0},{"$f":"'Hit Squad'!$D$94","v":0},{"$f":"'Hit Squad'!$H$96","v":""},{"$f":"'Hit Squad'!$H$93","v":0},{"$f":"'Hit Squad'!$F$8","v":3},"N",{"$f":"'Hit Squad'!$H$94","v":0},{"$f":"'Hit Squad'!$H$95","v":0},{"$f":"'Hit Squad'!$D$96","v":"f"}]
[97,{"$f":"'Hit Squad'!$A$97","v":22},{"$f":"'Hit Squad'!$D$1","v":"Hit Squad"},{"$f":"'Hit Squad'!$D$97","v":0},{"$f":"'Hit Squad'!$D$98","v":0},{"$f":"'Hit Squad'!$H$100","v":""},{"$f":"'Hit Squad'!$H$97","v":0},{"$f":"'Hit Squad'!$F$8","v":3},"N",{"$f":"'Hit Squad'!$H$98","v":0},{"$f":"'Hit Squad'!$H$99","v":0},{"$f":"'Hit Squad'!$D$100","v":"f"}]
[98,{"$f":"'Hit Squad'!$A$101","v":23},{"$f":"'Hit Squad'!$D$1","v":"Hit Squad"},{"$f":"'Hit Squad'!$D$101","v":0},{"$f":"'Hit Squad'!$D$102","v":0},{"$f":"'Hit Squad'!$H$104","v":""},{"$f":"'Hit Squad'!$H$101","v":0},{"$f":"'Hit Squad'!$F$8","v":3},"N",{"$f":"'Hit Squad'!$H$102","v":0},{"$f":"'Hit Squad'!$H$103","v":0},{"$f":"'Hit Squad'!$D$104","v":"f"}]
[99,{"$f":"'Hit Squad'!$A$105","v":24},{"$f":"'Hit Squad'!$D$1","v":"Hit Squad"},{"$f":"'Hit Squad'!$D$105","v":0},{"$f":"'Hit Squad'!$D$106","v":0},{"$f":"'Hit Squad'!$H$108","v":""},{"$f":"'Hit Squad'!$H$105","v":0},{"$f":"'Hit Squad'!$F$8","v":3},"N",{"$f":"'Hit Squad'!$H$106","v":0},{"$f":"'Hit Squad'!$H$107","v":0},{"$f":"'Hit Squad'!$D$108","v":"f"}]
[100,{"$f":"'Hit Squad'!$A$109","v":25},{"$f":"'Hit Squad'!$D$1","v":"Hit Squad"},{"$f":"'Hit Squad'!$D$109","v":0},{"$f":"'Hit Squad'!$D$110","v":0},{"$f":"'Hit Squad'!$H$112","v":""},{"$f":"'Hit Squad'!$H$109","v":0},{"$f":"'Hit Squad'!$F$8","v":3},"N",{"$f":"'Hit Squad'!$H$110","v":0},{"$f":"'Hit Squad'!$H$111","v":0},{"$f":"'Hit Squad'!$D$112","v":"f"}]
[122,{"$f":"Sticks!$A$97","v":22},{"$f":"Sticks!$D$1","v":"Sticks"},{"$f":"Sticks!$D$97","v":0},{"$f":"Sticks!$D$98","v":0},{"$f":"Sticks!$H$100","v":""},{"$f":"Sticks!$H$97","v":0},{"$f":"Sticks!$F$8","v":4},"N",{"$f":"Sticks!$H$98","v":0},{"$f":"Sticks!$H$99","v":0},{"$f":"Sticks!$D$100","v":"f"}]
[123,{"$f":"Sticks!$A$101","v":23},{"$f":"Sticks!$D$1","v":"Sticks"},{"$f":"Sticks!$D$101","v":0},{"$f":"Sticks!$D$102","v":0},{"$f":"Sticks!$H$104","v":""},{"$f":"Sticks!$H$101","v":0},{"$f":"Sticks!$F$8","v":4},"N",{"$f":"Sticks!$H$102","v":0},{"$f":"Sticks!$H$103","v":0},{"$f":"Sticks!$D$104","v":"f"}]
[124,{"$f":"Sticks!$A$105","v":24},{"$f":"Sticks!$D$1","v":"Sticks"},{"$f":"Sticks!$D$105","v":0},{"$f":"Sticks!$D$106","v":0},{"$f":"Sticks!$H$108","v":""},{"$f":"Sticks!$H$105","v":0},{"$f":"Sticks!$F$8","v":4},"N",{"$f":"Sticks!$H$106","v":0},{"$f":"Sticks!$H$107","v":0},{"$f":"Sticks!$D$108","v":"f"}]
[125,{"$f":"Sticks!$A$109","v":25},{"$f":"Sticks!$D$1","v":"Sticks"},{"$f":"Sticks!$D$109","v":0},{"$f":"Sticks!$D$110","v":0},{"$f":"Sticks!$H$112","v":""},{"$f":"Sticks!$H$109","v":0},{"$f":"Sticks!$F$8","v":4},"N",{"$f":"Sticks!$H$110","v":0},{"$f":"Sticks!$H$111","v":0},{"$f":"Sticks!$D$112","v":"f"}]
[150,{"$f":"'Team 6'!$A$109","v":25},{"$f":"'Team 6'!$D$1","v":"Team 6"},{"$f":"'Team 6'!$D$109","v":0},{"$f":"'Team 6'!$D$110","v":0},{"$f":"'Team 6'!$H$112","v":""},{"$f":"'Team 6'!$H$109","v":0},{"$f":"'Team 6'!$F$8","v":8},"N",{"$f":"'Team 6'!$H$110","v":0},{"$f":"'Team 6'!$H$111","v":0},{"$f":"'Team 6'!$D$112","v":"f"}]
[189,{"$f":"'Team 8'!$A$65","v":14},{"$f":"'Team 8'!$D$1","v":" "},{"$f":"'Team 8'!$D$65","v":0},{"$f":"'Team 8'!$D$66","v":0},{"$f":"'Team 8'!$H$68","v":""},{"$f":"'Team 8'!$H$65","v":0},{"$f":"'Team 8'!$F$8","v":8},"N",{"$f":"'Team 8'!$H$66","v":0},{"$f":"'Team 8'!$H$67","v":0},{"$f":"'Team 8'!$D$68","v":"f"}]
[190,{"$f":"'Team 8'!$A$69","v":15},{"$f":"'Team 8'!$D$1","v":" "},{"$f":"'Team 8'!$D$69","v":0},{"$f":"'Team 8'!$D$70","v":0},{"$f":"'Team 8'!$H$72","v":""},{"$f":"'Team 8'!$H$69","v":0},{"$f":"'Team 8'!$F$8","v":8},"N",{"$f":"'Team 8'!$H$70","v":0},{"$f":"'Team 8'!$H$71","v":0},{"$f":"'Team 8'!$D$72","v":"f"}]
[191,{"$f":"'Team 8'!$A$73","v":16},{"$f":"'Team 8'!$D$1","v":" "},{"$f":"'Team 8'!$D$73","v":0},{"$f":"'Team 8'!$D$74","v":0},{"$f":"'Team 8'!$H$76","v":""},{"$f":"'Team 8'!$H$73","v":0},{"$f":"'Team 8'!$F$8","v":8},"N",{"$f":"'Team 8'!$H$74","v":0},{"$f":"'Team 8'!$H$75","v":0},{"$f":"'Team 8'!$D$76","v":"f"}]
[192,{"$f":"'Team 8'!$A$77","v":17},{"$f":"'Team 8'!$D$1","v":" "},{"$f":"'Team 8'!$D$77","v":0},{"$f":"'Team 8'!$D$78","v":0},{"$f":"'Team 8'!$H$80","v":""},{"$f":"'Team 8'!$H$77","v":0},{"$f":"'Team 8'!$F$8","v":8},"N",{"$f":"'Team 8'!$H$78","v":0},{"$f":"'Team 8'!$H$79","v":0},{"$f":"'Team 8'!$D$80","v":"f"}]
[193,{"$f":"'Team 8'!$A$81","v":18},{"$f":"'Team 8'!$D$1","v":" "},{"$f":"'Team 8'!$D$81","v":0},{"$f":"'Team 8'!$D$82","v":0},{"$f":"'Team 8'!$H$84","v":""},{"$f":"'Team 8'!$H$81","v":0},{"$f":"'Team 8'!$F$8","v":8},"N",{"$f":"'Team 8'!$H$82","v":0},{"$f":"'Team 8'!$H$83","v":0},{"$f":"'Team 8'!$D$84","v":"f"}]
[194,{"$f":"'Team 8'!$A$85","v":19},{"$f":"'Team 8'!$D$1","v":" "},{"$f":"'Team 8'!$D$85","v":0},{"$f":"'Team 8'!$D$86","v":0},{"$f":"'Team 8'!$H$88","v":""},{"$f":"'Team 8'!$H$85","v":0},{"$f":"'Team 8'!$F$8","v":8},"N",{"$f":"'Team 8'!$H$86","v":0},{"$f":"'Team 8'!$H$87","v":0},{"$f":"'Team 8'!$D$88","v":"f"}]
[195,{"$f":"'Team 8'!$A$89","v":20},{"$f":"'Team 8'!$D$1","v":" "},{"$f":"'Team 8'!$D$89","v":0},{"$f":"'Team 8'!$D$90","v":0},{"$f":"'Team 8'!$H$92","v":""},{"$f":"'Team 8'!$H$89","v":0},{"$f":"'Team 8'!$F$8","v":8},"N",{"$f":"'Team 8'!$H$90","v":0},{"$f":"'Team 8'!$H$91","v":0},{"$f":"'Team 8'!$D$92","v":"f"}]
[196,{"$f":"'Team 8'!$A$93","v":21},{"$f":"'Team 8'!$D$1","v":" "},{"$f":"'Team 8'!$D$93","v":0},{"$f":"'Team 8'!$D$94","v":0},{"$f":"'Team 8'!$H$96","v":""},{"$f":"'Team 8'!$H$93","v":0},{"$f":"'Team 8'!$F$8","v":8},"N",{"$f":"'Team 8'!$H$94","v":0},{"$f":"'Team 8'!$H$95","v":0},{"$f":"'Team 8'!$D$96","v":"f"}]
[197,{"$f":"'Team 8'!$A$97","v":22},{"$f":"'Team 8'!$D$1","v":" "},{"$f":"'Team 8'!$D$97","v":0},{"$f":"'Team 8'!$D$98","v":0},{"$f":"'Team 8'!$H$100","v":""},{"$f":"'Team 8'!$H$97","v":0},{"$f":"'Team 8'!$F$8","v":8},"N",{"$f":"'Team 8'!$H$98","v":0},{"$f":"'Team 8'!$H$99","v":0},{"$f":"'Team 8'!$D$100","v":"f"}]
[198,{"$f":"'Team 8'!$A$101","v":23},{"$f":"'Team 8'!$D$1","v":" "},{"$f":"'Team 8'!$D$101","v":0},{"$f":"'Team 8'!$D$102","v":0},{"$f":"'Team 8'!$H$104","v":""},{"$f":"'Team 8'!$H$101","v":0},{"$f":"'Team 8'!$F$8","v":8},"N",{"$f":"'Team 8'!$H$102","v":0},{"$f":"'Team 8'!$H$103","v":0},{"$f":"'Team 8'!$D$104","v":"f"}]
[199,{"$f":"'Team 8'!$A$105","v":24},{"$f":"'Team 8'!$D$1","v":" "},{"$f":"'Team 8'!$D$105","v":0},{"$f":"'Team 8'!$D$106","v":0},{"$f":"'Team 8'!$H$108","v":""},{"$f":"'Team 8'!$H$105","v":0},{"$f":"'Team 8'!$F$8","v":8},"N",{"$f":"'Team 8'!$H$106","v":0},{"$f":"'Team 8'!$H$107","v":0},{"$f":"'Team 8'!$D$108","v":"f"}]
[200,{"$f":"'Team 8'!$A$109","v":25},{"$f":"'Team 8'!$D$1","v":" "},{"$f":"'Team 8'!$D$109","v":0},{"$f":"'Team 8'!$D$110","v":0},{"$f":"'Team 8'!$H$112","v":""},{"$f":"'Team 8'!$H$109","v":0},{"$f":"'Team 8'!$F$8","v":8},"N",{"$f":"'Team 8'!$H$110","v":0},{"$f":"'Team 8'!$H$111","v":0},{"$f":"'Team 8'!$D$112","v":"f"}]
[218,{"$f":"'Team 7'!$A$81","v":18},{"$f":"'Team 7'!$D$1","v":" "},{"$f":"'Team 7'!$D$81","v":0},{"$f":"'Team 7'!$D$82","v":0},{"$f":"'Team 7'!$H$84","v":""},{"$f":"'Team 7'!$H$81","v":0},{"$f":"'Team 7'!$F$8","v":8},"N",{"$f":"'Team 7'!$H$82","v":0},{"$f":"'Team 7'!$H$83","v":0},{"$f":"'Team 7'!$D$84","v":"f"}]
[219,{"$f":"'Team 7'!$A$85","v":19},{"$f":"'Team 7'!$D$1","v":" "},{"$f":"'Team 7'!$D$85","v":0},{"$f":"'Team 7'!$D$86","v":0},{"$f":"'Team 7'!$H$88","v":""},{"$f":"'Team 7'!$H$85","v":0},{"$f":"'Team 7'!$F$8","v":8},"N",{"$f":"'Team 7'!$H$86","v":0},{"$f":"'Team 7'!$H$87","v":0},{"$f":"'Team 7'!$D$88","v":"f"}]
[220,{"$f":"'Team 7'!$A$89","v":20},{"$f":"'Team 7'!$D$1","v":" "},{"$f":"'Team 7'!$D$89","v":0},{"$f":"'Team 7'!$D$90","v":0},{"$f":"'Team 7'!$H$92","v":""},{"$f":"'Team 7'!$H$89","v":0},{"$f":"'Team 7'!$F$8","v":8},"N",{"$f":"'Team 7'!$H$90","v":0},{"$f":"'Team 7'!$H$91","v":0},{"$f":"'Team 7'!$D$92","v":"f"}]
[221,{"$f":"'Team 7'!$A$93","v":21},{"$f":"'Team 7'!$D$1","v":" "},{"$f":"'Team 7'!$D$93","v":0},{"$f":"'Team 7'!$D$94","v":0},{"$f":"'Team 7'!$H$96","v":""},{"$f":"'Team 7'!$H$93","v":0},{"$f":"'Team 7'!$F$8","v":8},"N",{"$f":"'Team 7'!$H$94","v":0},{"$f":"'Team 7'!$H$95","v":0},{"$f":"'Team 7'!$D$96","v":"f"}]
[222,{"$f":"'Team 7'!$A$97","v":22},{"$f":"'Team 7'!$D$1","v":" "},{"$f":"'Team 7'!$D$97","v":0},{"$f":"'Team 7'!$D$98","v":0},{"$f":"'Team 7'!$H$100","v":""},{"$f":"'Team 7'!$H$97","v":0},{"$f":"'Team 7'!$F$8","v":8},"N",{"$f":"'Team 7'!$H$98","v":0},{"$f":"'Team 7'!$H$99","v":0},{"$f":"'Team 7'!$D$100","v":"f"}]
[223,{"$f":"'Team 7'!$A$101","v":23},{"$f":"'Team 7'!$D$1","v":" "},{"$f":"'Team 7'!$D$101","v":0},{"$f":"'Team 7'!$D$102","v":0},{"$f":"'Team 7'!$H$104","v":""},{"$f":"'Team 7'!$H$101","v":0},{"$f":"'Team 7'!$F$8","v":8},{"$f":"IF(K66<(H66*2.5),\"N\",\"Y\")","v":"N"},{"$f":"'Team 7'!$H$102","v":0},{"$f":"'Team 7'!$H$103","v":0},{"$f":"'Team 7'!$D$104","v":"f"}]
[224,{"$f":"'Team 7'!$A$105","v":24},{"$f":"'Team 7'!$D$1","v":" "},{"$f":"'Team 7'!$D$105","v":0},{"$f":"'Team 7'!$D$106","v":0},{"$f":"'Team 7'!$H$108","v":""},{"$f":"'Team 7'!$H$105","v":0},{"$f":"'Team 7'!$F$8","v":8},"N",{"$f":"'Team 7'!$H$106","v":0},{"$f":"'Team 7'!$H$107","v":0},{"$f":"'Team 7'!$D$108","v":"f"}]
[225,{"$f":"'Team 7'!$A$109","v":25},{"$f":"'Team 7'!$D$1","v":" "},{"$f":"'Team 7'!$D$109","v":0},{"$f":"'Team 7'!$D$110","v":0},{"$f":"'Team 7'!$H$112","v":""},{"$f":"'Team 7'!$H$109","v":0},{"$f":"'Team 7'!$F$8","v":8},"N",{"$f":"'Team 7'!$H$110","v":0},{"$f":"'Team 7'!$H$111","v":0},{"$f":"'Team 7'!$D$112","v":"f"}]
[187,{"$f":"'Team 8'!$A$57","v":12},{"$f":"'Team 8'!$D$1","v":" "},{"$f":"'Team 8'!$D$57","v":0},{"$f":"'Team 8'!$D$58","v":0},{"$f":"'Team 8'!$H$60","v":""},{"$f":"'Team 8'!$H$57","v":0},{"$f":"'Team 8'!$F$8","v":8},"N",{"$f":"'Team 8'!$H$58","v":0},{"$f":"'Team 8'!$H$59","v":0},{"$f":"'Team 8'!$D$60","v":"f"}]
[188,{"$f":"'Team 8'!$A$61","v":13},{"$f":"'Team 8'!$D$1","v":" "},{"$f":"'Team 8'!$D$61","v":0},{"$f":"'Team 8'!$D$62","v":0},{"$f":"'Team 8'!$H$64","v":""},{"$f":"'Team 8'!$H$61","v":0},{"$f":"'Team 8'!$F$8","v":8},"N",{"$f":"'Team 8'!$H$62","v":0},{"$f":"'Team 8'!$H$63","v":0},{"$f":"'Team 8'!$D$64","v":"f"}]
[213,{"$f":"'Team 7'!$A$61","v":13},{"$f":"'Team 7'!$D$1","v":" "},{"$f":"'Team 7'!$D$61","v":0},{"$f":"'Team 7'!$D$62","v":0},{"$f":"'Team 7'!$H$64","v":""},{"$f":"'Team 7'!$H$61","v":0},{"$f":"'Team 7'!$F$8","v":8},"N",{"$f":"'Team 7'!$H$62","v":0},{"$f":"'Team 7'!$H$63","v":0},{"$f":"'Team 7'!$D$64","v":"f"}]
[215,{"$f":"'Team 7'!$A$69","v":15},{"$f":"'Team 7'!$D$1","v":" "},{"$f":"'Team 7'!$D$69","v":0},{"$f":"'Team 7'!$D$70","v":0},{"$f":"'Team 7'!$H$72","v":""},{"$f":"'Team 7'!$H$69","v":0},{"$f":"'Team 7'!$F$8","v":8},"N",{"$f":"'Team 7'!$H$70","v":0},{"$f":"'Team 7'!$H$71","v":0},{"$f":"'Team 7'!$D$72","v":"f"}]
[217,{"$f":"'Team 7'!$A$77","v":17},{"$f":"'Team 7'!$D$1","v":" "},{"$f":"'Team 7'!$D$77","v":0},{"$f":"'Team 7'!$D$78","v":0},{"$f":"'Team 7'!$H$80","v":""},{"$f":"'Team 7'!$H$77","v":0},{"$f":"'Team 7'!$F$8","v":8},"N",{"$f":"'Team 7'!$H$78","v":0},{"$f":"'Team 7'!$H$79","v":0},{"$f":"'Team 7'!$D$80","v":"f"}]
[216,{"$f":"'Team 7'!$A$73","v":16},{"$f":"'Team 7'!$D$1","v":" "},{"$f":"'Team 7'!$D$73","v":0},{"$f":"'Team 7'!$D$74","v":0},{"$f":"'Team 7'!$H$76","v":""},{"$f":"'Team 7'!$H$73","v":0},{"$f":"'Team 7'!$F$8","v":8},"N",{"$f":"'Team 7'!$H$74","v":0},{"$f":"'Team 7'!$H$75","v":0},{"$f":"'Team 7'!$D$76","v":"f"}]
[214,{"$f":"'Team 7'!$A$65","v":14},{"$f":"'Team 7'!$D$1","v":" "},{"$f":"'Team 7'!$D$65","v":0},{"$f":"'Team 7'!$D$66","v":0},{"$f":"'Team 7'!$H$68","v":""},{"$f":"'Team 7'!$H$65","v":0},{"$f":"'Team 7'!$F$8","v":8},"N",{"$f":"'Team 7'!$H$66","v":0},{"$f":"'Team 7'!$H$67","v":0},{"$f":"'Team 7'!$D$68","v":"f"}]
[186,{"$f":"'Team 8'!$A$53","v":11},{"$f":"'Team 8'!$D$1","v":" "},{"$f":"'Team 8'!$D$53","v":0},{"$f":"'Team 8'!$D$54","v":0},{"$f":"'Team 8'!$H$56","v":""},{"$f":"'Team 8'!$H$53","v":0},{"$f":"'Team 8'!$F$8","v":8},"N",{"$f":"'Team 8'!$H$54","v":0},{"$f":"'Team 8'!$H$55","v":0},{"$f":"'Team 8'!$D$56","v":"f"}]
[118,{"$f":"Sticks!$A$81","v":18},{"$f":"Sticks!$D$1","v":"Sticks"},{"$f":"Sticks!$D$81","v":0},{"$f":"Sticks!$D$82","v":0},{"$f":"Sticks!$H$84","v":""},{"$f":"Sticks!$H$81","v":0},{"$f":"Sticks!$F$8","v":4},"N",{"$f":"Sticks!$H$82","v":0},{"$f":"Sticks!$H$83","v":0},{"$f":"Sticks!$D$84","v":"f"}]
[17,{"$f":"'Bad Pitches'!$A$77","v":17},{"$f":"'Bad Pitches'!$D$1","v":"Bad Pitches"},{"$f":"'Bad Pitches'!$D$77","v":0},{"$f":"'Bad Pitches'!$D$78","v":0},{"$f":"'Bad Pitches'!$H$80","v":""},{"$f":"'Bad Pitches'!$H$77","v":0},{"$f":"'Bad Pitches'!$F$8","v":3},"N",{"$f":"'Bad Pitches'!$H$78","v":0},{"$f":"'Bad Pitches'!$H$79","v":0},{"$f":"'Bad Pitches'!$D$80","v":"f"}]
[120,{"$f":"Sticks!$A$89","v":20},{"$f":"Sticks!$D$1","v":"Sticks"},{"$f":"Sticks!$D$89","v":0},{"$f":"Sticks!$D$90","v":0},{"$f":"Sticks!$H$92","v":""},{"$f":"Sticks!$H$89","v":0},{"$f":"Sticks!$F$8","v":4},"N",{"$f":"Sticks!$H$90","v":0},{"$f":"Sticks!$H$91","v":0},{"$f":"Sticks!$D$92","v":"f"}]
[117,{"$f":"Sticks!$A$77","v":17},{"$f":"Sticks!$D$1","v":"Sticks"},{"$f":"Sticks!$D$77","v":0},{"$f":"Sticks!$D$78","v":0},{"$f":"Sticks!$H$80","v":""},{"$f":"Sticks!$H$77","v":0},{"$f":"Sticks!$F$8","v":4},"N",{"$f":"Sticks!$H$78","v":0},{"$f":"Sticks!$H$79","v":0},{"$f":"Sticks!$D$80","v":"f"}]
[20,{"$f":"'Bad Pitches'!$A$89","v":20},{"$f":"'Bad Pitches'!$D$1","v":"Bad Pitches"},{"$f":"'Bad Pitches'!$D$89","v":0},{"$f":"'Bad Pitches'!$D$90","v":0},{"$f":"'Bad Pitches'!$H$92","v":""},{"$f":"'Bad Pitches'!$H$89","v":0},{"$f":"'Bad Pitches'!$F$8","v":3},"N",{"$f":"'Bad Pitches'!$H$90","v":0},{"$f":"'Bad Pitches'!$H$91","v":0},{"$f":"'Bad Pitches'!$D$92","v":"f"}]
[94,{"$f":"'Hit Squad'!$A$85","v":19},{"$f":"'Hit Squad'!$D$1","v":"Hit Squad"},{"$f":"'Hit Squad'!$D$85","v":0},{"$f":"'Hit Squad'!$D$86","v":0},{"$f":"'Hit Squad'!$H$88","v":""},{"$f":"'Hit Squad'!$H$85","v":0},{"$f":"'Hit Squad'!$F$8","v":3},"N",{"$f":"'Hit Squad'!$H$86","v":0},{"$f":"'Hit Squad'!$H$87","v":0},{"$f":"'Hit Squad'!$D$88","v":"f"}]
[16,{"$f":"'Bad Pitches'!$A$73","v":16},{"$f":"'Bad Pitches'!$D$1","v":"Bad Pitches"},{"$f":"'Bad Pitches'!$D$73","v":0},{"$f":"'Bad Pitches'!$D$74","v":0},{"$f":"'Bad Pitches'!$H$76","v":""},{"$f":"'Bad Pitches'!$H$73","v":0},{"$f":"'Bad Pitches'!$F$8","v":3},"N",{"$f":"'Bad Pitches'!$H$74","v":0},{"$f":"'Bad Pitches'!$H$75","v":0},{"$f":"'Bad Pitches'!$D$76","v":"f"}]
[143,{"$f":"'Team 6'!$A$81","v":18},{"$f":"'Team 6'!$D$1","v":"Team 6"},{"$f":"'Team 6'!$D$81","v":0},{"$f":"'Team 6'!$D$82","v":0},{"$f":"'Team 6'!$H$84","v":""},{"$f":"'Team 6'!$H$81","v":0},{"$f":"'Team 6'!$F$8","v":8},"N",{"$f":"'Team 6'!$H$82","v":0},{"$f":"'Team 6'!$H$83","v":0},{"$f":"'Team 6'!$D$84","v":"f"}]
[212,{"$f":"'Team 7'!$A$57","v":12},{"$f":"'Team 7'!$D$1","v":" "},{"$f":"'Team 7'!$D$57","v":0},{"$f":"'Team 7'!$D$58","v":0},{"$f":"'Team 7'!$H$60","v":""},{"$f":"'Team 7'!$H$57","v":0},{"$f":"'Team 7'!$F$8","v":8},"N",{"$f":"'Team 7'!$H$58","v":0},{"$f":"'Team 7'!$H$59","v":0},{"$f":"'Team 7'!$D$60","v":"f"}]
[148,{"$f":"'Team 6'!$A$101","v":23},{"$f":"'Team 6'!$D$1","v":"Team 6"},{"$f":"'Team 6'!$D$101","v":0},{"$f":"'Team 6'!$D$102","v":0},{"$f":"'Team 6'!$H$104","v":""},{"$f":"'Team 6'!$H$101","v":0},{"$f":"'Team 6'!$F$8","v":8},"N",{"$f":"'Team 6'!$H$102","v":0},{"$f":"'Team 6'!$H$103","v":0},{"$f":"'Team 6'!$D$104","v":"f"}]
[145,{"$f":"'Team 6'!$A$89","v":20},{"$f":"'Team 6'!$D$1","v":"Team 6"},{"$f":"'Team 6'!$D$89","v":0},{"$f":"'Team 6'!$D$90","v":0},{"$f":"'Team 6'!$H$92","v":""},{"$f":"'Team 6'!$H$89","v":0},{"$f":"'Team 6'!$F$8","v":8},"N",{"$f":"'Team 6'!$H$90","v":0},{"$f":"'Team 6'!$H$91","v":0},{"$f":"'Team 6'!$D$92","v":"f"}]
[115,{"$f":"Sticks!$A$69","v":15},{"$f":"Sticks!$D$1","v":"Sticks"},{"$f":"Sticks!$D$69","v":0},{"$f":"Sticks!$D$70","v":0},{"$f":"Sticks!$H$72","v":""},{"$f":"Sticks!$H$69","v":0},{"$f":"Sticks!$F$8","v":4},"N",{"$f":"Sticks!$H$70","v":0},{"$f":"Sticks!$H$71","v":0},{"$f":"Sticks!$D$72","v":"f"}]
[141,{"$f":"'Team 6'!$A$73","v":16},{"$f":"'Team 6'!$D$1","v":"Team 6"},{"$f":"'Team 6'!$D$73","v":0},{"$f":"'Team 6'!$D$74","v":0},{"$f":"'Team 6'!$H$76","v":""},{"$f":"'Team 6'!$H$73","v":0},{"$f":"'Team 6'!$F$8","v":8},"N",{"$f":"'Team 6'!$H$74","v":0},{"$f":"'Team 6'!$H$75","v":0},{"$f":"'Team 6'!$D$76","v":"f"}]
[15,{"$f":"'Bad Pitches'!$A$69","v":15},{"$f":"'Bad Pitches'!$D$1","v":"Bad Pitches"},{"$f":"'Bad Pitches'!$D$69","v":0},{"$f":"'Bad Pitches'!$D$70","v":0},{"$f":"'Bad Pitches'!$H$72","v":""},{"$f":"'Bad Pitches'!$H$69","v":0},{"$f":"'Bad Pitches'!$F$8","v":3},"N",{"$f":"'Bad Pitches'!$H$70","v":0},{"$f":"'Bad Pitches'!$H$71","v":0},{"$f":"'Bad Pitches'!$D$72","v":"f"}]
[89,{"$f":"'Hit Squad'!$A$65","v":14},{"$f":"'Hit Squad'!$D$1","v":"Hit Squad"},{"$f":"'Hit Squad'!$D$65","v":"Shannon"},{"$f":"'Hit Squad'!$D$66","v":"Adair"},{"$f":"'Hit Squad'!$H$68","v":0.66666666666666663},{"$f":"'Hit Squad'!$H$65","v":3},{"$f":"'Hit Squad'!$F$8","v":3},"N",{"$f":"'Hit Squad'!$H$66","v":2},{"$f":"'Hit Squad'!$H$67","v":3},{"$f":"'Hit Squad'!$D$68","v":"f"}]
[105,{"$f":"Sticks!$A$29","v":5},{"$f":"Sticks!$D$1","v":"Sticks"},{"$f":"Sticks!$D$29","v":"Taylor"},{"$f":"Sticks!$D$30","v":"Hensley"},{"$f":"Sticks!$H$32","v":0.66666666666666663},{"$f":"Sticks!$H$29","v":6},{"$f":"Sticks!$F$8","v":4},"N",{"$f":"Sticks!$H$30","v":4},{"$f":"Sticks!$H$31","v":7},{"$f":"Sticks!$D$32","v":"f"}]
[109,{"$f":"Sticks!$A$45","v":9},{"$f":"Sticks!$D$1","v":"Sticks"},{"$f":"Sticks!$D$45","v":"Whitney"},{"$f":"Sticks!$D$46","v":"Bean"},{"$f":"Sticks!$H$48","v":0.44444444444444442},{"$f":"Sticks!$H$45","v":9},{"$f":"Sticks!$F$8","v":4},"N",{"$f":"Sticks!$H$46","v":4},{"$f":"Sticks!$H$47","v":9},{"$f":"Sticks!$D$48","v":"f"}]
[85,{"$f":"'Hit Squad'!$A$49","v":10},{"$f":"'Hit Squad'!$D$1","v":"Hit Squad"},{"$f":"'Hit Squad'!$D$49","v":"Tasha"},{"$f":"'Hit Squad'!$D$50","v":"Harbaugh"},{"$f":"'Hit Squad'!$H$52","v":0.42857142857142855},{"$f":"'Hit Squad'!$H$49","v":7},{"$f":"'Hit Squad'!$F$8","v":3},"N",{"$f":"'Hit Squad'!$H$50","v":3},{"$f":"'Hit Squad'!$H$51","v":7},{"$f":"'Hit Squad'!$D$52","v":"f"}]
[27,{"$f":"BCBC!$A$17","v":2},{"$f":"BCBC!$D$1","v":"BCBC"},{"$f":"BCBC!$D$17","v":"Karen"},{"$f":"BCBC!$D$18","v":"Springer"},{"$f":"BCBC!$H$20","v":0.4},{"$f":"BCBC!$H$17","v":5},{"$f":"BCBC!$F$8","v":4},"N",{"$f":"BCBC!$H$18","v":2},{"$f":"BCBC!$H$19","v":5},{"$f":"BCBC!$D$20","v":"f"}]
[12,{"$f":"'Bad Pitches'!$A$57","v":12},{"$f":"'Bad Pitches'!$D$1","v":"Bad Pitches"},{"$f":"'Bad Pitches'!$D$57","v":"Sandra "},{"$f":"'Bad Pitches'!$D$58","v":"Chavez"},{"$f":"'Bad Pitches'!$H$60","v":0.33333333333333331},{"$f":"'Bad Pitches'!$H$57","v":3},{"$f":"'Bad Pitches'!$F$8","v":3},"N",{"$f":"'Bad Pitches'!$H$58","v":1},{"$f":"'Bad Pitches'!$H$59","v":3},{"$f":"'Bad Pitches'!$D$60","v":"f"}]
[113,{"$f":"Sticks!$A$61","v":13},{"$f":"Sticks!$D$1","v":"Sticks"},{"$f":"Sticks!$D$61","v":"Kate"},{"$f":"Sticks!$D$62","v":"Nygaard"},{"$f":"Sticks!$H$64","v":0.2857142857142857},{"$f":"Sticks!$H$61","v":7},{"$f":"Sticks!$F$8","v":4},"N",{"$f":"Sticks!$H$62","v":2},{"$f":"Sticks!$H$63","v":7},{"$f":"Sticks!$D$64","v":"f"}]
[79,{"$f":"'Hit Squad'!$A$25","v":4},{"$f":"'Hit Squad'!$D$1","v":"Hit Squad"},{"$f":"'Hit Squad'!$D$25","v":"Amber "},{"$f":"'Hit Squad'!$D$26","v":"Romero"},{"$f":"'Hit Squad'!$H$28","v":0.2857142857142857},{"$f":"'Hit Squad'!$H$25","v":7},{"$f":"'Hit Squad'!$F$8","v":3},{"$f":"IF(K98<(H98*2.5),\"N\",\"Y\")","v":"N"},{"$f":"'Hit Squad'!$H$26","v":2},{"$f":"'Hit Squad'!$H$27","v":7},{"$f":"'Hit Squad'!$D$28","v":"f"}]
[13,{"$f":"'Bad Pitches'!$A$61","v":13},{"$f":"'Bad Pitches'!$D$1","v":"Bad Pitches"},{"$f":"'Bad Pitches'!$D$61","v":"Britt"},{"$f":"'Bad Pitches'!$D$62","v":"Call"},{"$f":"'Bad Pitches'!$H$64","v":0.25},{"$f":"'Bad Pitches'!$H$61","v":4},{"$f":"'Bad Pitches'!$F$8","v":3},"N",{"$f":"'Bad Pitches'!$H$62","v":1},{"$f":"'Bad Pitches'!$H$63","v":4},{"$f":"'Bad Pitches'!$D$64","v":"f"}]
[65,{"$f":"'Ghetto Bombers'!$A$69","v":15},{"$f":"'Ghetto Bombers'!$D$1","v":"Ghetto Bombers"},{"$f":"'Ghetto Bombers'!$D$69","v":"Heidi"},{"$f":"'Ghetto Bombers'!$D$70","v":"Talor"},{"$f":"'Ghetto Bombers'!$H$72","v":0.22222222222222221},{"$f":"'Ghetto Bombers'!$H$69","v":9},{"$f":"'Ghetto Bombers'!$F$8","v":4},"N",{"$f":"'Ghetto Bombers'!$H$70","v":2},{"$f":"'Ghetto Bombers'!$H$71","v":9},{"$f":"'Ghetto Bombers'!$D$72","v":"f"}]
[83,{"$f":"'Hit Squad'!$A$41","v":8},{"$f":"'Hit Squad'!$D$1","v":"Hit Squad"},{"$f":"'Hit Squad'!$D$41","v":"Kelly"},{"$f":"'Hit Squad'!$D$42","v":"Noakes"},{"$f":"'Hit Squad'!$H$44","v":0.2},{"$f":"'Hit Squad'!$H$41","v":5},{"$f":"'Hit Squad'!$F$8","v":3},"N",{"$f":"'Hit Squad'!$H$42","v":1},{"$f":"'Hit Squad'!$H$43","v":5},{"$f":"'Hit Squad'!$D$44","v":"f"}]
[77,{"$f":"'Hit Squad'!$A$17","v":2},{"$f":"'Hit Squad'!$D$1","v":"Hit Squad"},{"$f":"'Hit Squad'!$D$17","v":"Miche"},{"$f":"'Hit Squad'!$D$18","v":"Ferrin"},{"$f":"'Hit Squad'!$H$20","v":0.14285714285714285},{"$f":"'Hit Squad'!$H$17","v":7},{"$f":"'Hit Squad'!$F$8","v":3},"N",{"$f":"'Hit Squad'!$H$18","v":1},{"$f":"'Hit Squad'!$H$19","v":7},{"$f":"'Hit Squad'!$D$20","v":"f"}]
[60,{"$f":"'Ghetto Bombers'!$A$49","v":10},{"$f":"'Ghetto Bombers'!$D$1","v":"Ghetto Bombers"},{"$f":"'Ghetto Bombers'!$D$49","v":"Hope"},{"$f":"'Ghetto Bombers'!$D$50","v":"Curtis"},{"$f":"'Ghetto Bombers'!$H$52","v":0},{"$f":"'Ghetto Bombers'!$H$49","v":1},{"$f":"'Ghetto Bombers'!$F$8","v":4},"N",{"$f":"'Ghetto Bombers'!$H$50","v":0},{"$f":"'Ghetto Bombers'!$H$51","v":3},{"$f":"'Ghetto Bombers'!$D$52","v":"f"}]
[10,{"$f":"'Bad Pitches'!$A$49","v":10},{"$f":"'Bad Pitches'!$D$1","v":"Bad Pitches"},{"$f":"'Bad Pitches'!$D$49","v":"Emma"},{"$f":"'Bad Pitches'!$D$50","v":"Larsen"},{"$f":"'Bad Pitches'!$H$52","v":0},{"$f":"'Bad Pitches'!$H$49","v":4},{"$f":"'Bad Pitches'!$F$8","v":3},"N",{"$f":"'Bad Pitches'!$H$50","v":0},{"$f":"'Bad Pitches'!$H$51","v":4},{"$f":"'Bad Pitches'!$D$52","v":"f"}]
[206,{"$f":"'Team 7'!$A$33","v":6},{"$f":"'Team 7'!$D$1","v":" "},{"$f":"'Team 7'!$D$33","v":"Julie"},{"$f":"'Team 7'!$D$34","v":0},{"$f":"'Team 7'!$H$36","v":0},{"$f":"'Team 7'!$H$33","v":10},{"$f":"'Team 7'!$F$8","v":8},"N",{"$f":"'Team 7'!$H$34","v":0},{"$f":"'Team 7'!$H$35","v":10},{"$f":"'Team 7'!$D$36","v":"f"}]
[202,{"$f":"'Team 7'!$A$17","v":2},{"$f":"'Team 7'!$D$1","v":" "},{"$f":"'Team 7'!$D$17","v":"Dorothy"},{"$f":"'Team 7'!$D$18","v":0},{"$f":"'Team 7'!$H$20","v":0},{"$f":"'Team 7'!$H$17","v":10},{"$f":"'Team 7'!$F$8","v":8},"N",{"$f":"'Team 7'!$H$18","v":0},{"$f":"'Team 7'!$H$19","v":10},{"$f":"'Team 7'!$D$20","v":"f"}]
[208,{"$f":"'Team 7'!$A$41","v":8},{"$f":"'Team 7'!$D$1","v":" "},{"$f":"'Team 7'!$D$41","v":"Sheri"},{"$f":"'Team 7'!$D$42","v":0},{"$f":"'Team 7'!$H$44","v":0},{"$f":"'Team 7'!$H$41","v":10},{"$f":"'Team 7'!$F$8","v":8},"N",{"$f":"'Team 7'!$H$42","v":0},{"$f":"'Team 7'!$H$43","v":10},{"$f":"'Team 7'!$D$44","v":"f"}]
[127,{"$f":"'Team 6'!$A$17","v":2},{"$f":"'Team 6'!$D$1","v":"Team 6"},{"$f":"'Team 6'!$D$17","v":"Mary"},{"$f":"'Team 6'!$D$18","v":0},{"$f":"'Team 6'!$H$20","v":0},{"$f":"'Team 6'!$H$17","v":10},{"$f":"'Team 6'!$F$8","v":8},"N",{"$f":"'Team 6'!$H$18","v":0},{"$f":"'Team 6'!$H$19","v":10},{"$f":"'Team 6'!$D$20","v":"f"}]
[211,{"$f":"'Team 7'!$A$53","v":11},{"$f":"'Team 7'!$D$1","v":" "},{"$f":"'Team 7'!$D$53","v":0},{"$f":"'Team 7'!$D$54","v":0},{"$f":"'Team 7'!$H$56","v":0},{"$f":"'Team 7'!$H$53","v":10},{"$f":"'Team 7'!$F$8","v":8},"N",{"$f":"'Team 7'!$H$54","v":0},{"$f":"'Team 7'!$H$55","v":10},{"$f":"'Team 7'!$D$56","v":"f"}]
[204,{"$f":"'Team 7'!$A$25","v":4},{"$f":"'Team 7'!$D$1","v":" "},{"$f":"'Team 7'!$D$25","v":"Jill"},{"$f":"'Team 7'!$D$26","v":0},{"$f":"'Team 7'!$H$28","v":0},{"$f":"'Team 7'!$H$25","v":10},{"$f":"'Team 7'!$F$8","v":8},"N",{"$f":"'Team 7'!$H$26","v":0},{"$f":"'Team 7'!$H$27","v":10},{"$f":"'Team 7'!$D$28","v":"f"}]
[131,{"$f":"'Team 6'!$A$33","v":6},{"$f":"'Team 6'!$D$1","v":"Team 6"},{"$f":"'Team 6'!$D$33","v":"Heidi"},{"$f":"'Team 6'!$D$34","v":0},{"$f":"'Team 6'!$H$36","v":0},{"$f":"'Team 6'!$H$33","v":10},{"$f":"'Team 6'!$F$8","v":8},"N",{"$f":"'Team 6'!$H$34","v":0},{"$f":"'Team 6'!$H$35","v":10},{"$f":"'Team 6'!$D$36","v":"f"}]
[133,{"$f":"'Team 6'!$A$41","v":8},{"$f":"'Team 6'!$D$1","v":"Team 6"},{"$f":"'Team 6'!$D$41","v":"Christine"},{"$f":"'Team 6'!$D$42","v":0},{"$f":"'Team 6'!$H$44","v":0},{"$f":"'Team 6'!$H$41","v":10},{"$f":"'Team 6'!$F$8","v":8},"N",{"$f":"'Team 6'!$H$42","v":0},{"$f":"'Team 6'!$H$43","v":10},{"$f":"'Team 6'!$D$44","v":"f"}]
[184,{"$f":"'Team 8'!$A$45","v":9},{"$f":"'Team 8'!$D$1","v":" "},{"$f":"'Team 8'!$D$45","v":"Kenzie"},{"$f":"'Team 8'!$D$46","v":0},{"$f":"'Team 8'!$H$48","v":0},{"$f":"'Team 8'!$H$45","v":10},{"$f":"'Team 8'!$F$8","v":8},"N",{"$f":"'Team 8'!$H$46","v":0},{"$f":"'Team 8'!$H$47","v":10},{"$f":"'Team 8'!$D$48","v":"f"}]
[180,{"$f":"'Team 8'!$A$29","v":5},{"$f":"'Team 8'!$D$1","v":" "},{"$f":"'Team 8'!$D$29","v":"Lori"},{"$f":"'Team 8'!$D$30","v":0},{"$f":"'Team 8'!$H$32","v":0},{"$f":"'Team 8'!$H$29","v":10},{"$f":"'Team 8'!$F$8","v":8},"N",{"$f":"'Team 8'!$H$30","v":0},{"$f":"'Team 8'!$H$31","v":10},{"$f":"'Team 8'!$D$32","v":"f"}]
[178,{"$f":"'Team 8'!$A$21","v":3},{"$f":"'Team 8'!$D$1","v":" "},{"$f":"'Team 8'!$D$21","v":"Kylie"},{"$f":"'Team 8'!$D$22","v":0},{"$f":"'Team 8'!$H$24","v":0},{"$f":"'Team 8'!$H$21","v":10},{"$f":"'Team 8'!$F$8","v":8},"N",{"$f":"'Team 8'!$H$22","v":0},{"$f":"'Team 8'!$H$23","v":10},{"$f":"'Team 8'!$D$24","v":"f"}]
[176,{"$f":"'Team 8'!$A$13","v":1},{"$f":"'Team 8'!$D$1","v":" "},{"$f":"'Team 8'!$D$13","v":"Linda"},{"$f":"'Team 8'!$D$14","v":0},{"$f":"'Team 8'!$H$16","v":0},{"$f":"'Team 8'!$H$13","v":10},{"$f":"'Team 8'!$F$8","v":8},"N",{"$f":"'Team 8'!$H$14","v":0},{"$f":"'Team 8'!$H$15","v":10},{"$f":"'Team 8'!$D$16","v":"f"}]
[182,{"$f":"'Team 8'!$A$37","v":7},{"$f":"'Team 8'!$D$1","v":" "},{"$f":"'Team 8'!$D$37","v":"Kim"},{"$f":"'Team 8'!$D$38","v":0},{"$f":"'Team 8'!$H$40","v":0},{"$f":"'Team 8'!$H$37","v":10},{"$f":"'Team 8'!$F$8","v":8},"N",{"$f":"'Team 8'!$H$38","v":0},{"$f":"'Team 8'!$H$39","v":10},{"$f":"'Team 8'!$D$40","v":"f"}]
[135,{"$f":"'Team 6'!$A$49","v":10},{"$f":"'Team 6'!$D$1","v":"Team 6"},{"$f":"'Team 6'!$D$49","v":"Laurie"},{"$f":"'Team 6'!$D$50","v":0},{"$f":"'Team 6'!$H$52","v":0},{"$f":"'Team 6'!$H$49","v":10},{"$f":"'Team 6'!$F$8","v":8},"N",{"$f":"'Team 6'!$H$50","v":0},{"$f":"'Team 6'!$H$51","v":10},{"$f":"'Team 6'!$D$52","v":"f"}]
[129,{"$f":"'Team 6'!$A$25","v":4},{"$f":"'Team 6'!$D$1","v":"Team 6"},{"$f":"'Team 6'!$D$25","v":"Pat"},{"$f":"'Team 6'!$D$26","v":0},{"$f":"'Team 6'!$H$28","v":0},{"$f":"'Team 6'!$H$25","v":10},{"$f":"'Team 6'!$F$8","v":8},"N",{"$f":"'Team 6'!$H$26","v":0},{"$f":"'Team 6'!$H$27","v":10},{"$f":"'Team 6'!$D$28","v":"f"}]
[81,{"$f":"'Hit Squad'!$A$33","v":6},{"$f":"'Hit Squad'!$D$1","v":"Hit Squad"},{"$f":"'Hit Squad'!$D$33","v":"Michelle"},{"$f":"'Hit Squad'!$D$34","v":"Mears"},{"$f":"'Hit Squad'!$H$36","v":0},{"$f":"'Hit Squad'!$H$33","v":7},{"$f":"'Hit Squad'!$F$8","v":3},"N",{"$f":"'Hit Squad'!$H$34","v":0},{"$f":"'Hit Squad'!$H$35","v":7},{"$f":"'Hit Squad'!$D$36","v":"f"}]
[87,{"$f":"'Hit Squad'!$A$57","v":12},{"$f":"'Hit Squad'!$D$1","v":"Hit Squad"},{"$f":"'Hit Squad'!$D$57","v":"Kelli"},{"$f":"'Hit Squad'!$D$58","v":"Hansen"},{"$f":"'Hit Squad'!$H$60","v":0},{"$f":"'Hit Squad'!$H$57","v":2},{"$f":"'Hit Squad'!$F$8","v":3},"N",{"$f":"'Hit Squad'!$H$58","v":0},{"$f":"'Hit Squad'!$H$59","v":2},{"$f":"'Hit Squad'!$D$60","v":"f"}]
[210,{"$f":"'Team 7'!$A$49","v":10},{"$f":"'Team 7'!$D$1","v":" "},{"$f":"'Team 7'!$D$49","v":"Trish"},{"$f":"'Team 7'!$D$50","v":0},{"$f":"'Team 7'!$H$52","v":0},{"$f":"'Team 7'!$H$49","v":10},{"$f":"'Team 7'!$F$8","v":8},"N",{"$f":"'Team 7'!$H$50","v":0},{"$f":"'Team 7'!$H$51","v":10},{"$f":"'Team 7'!$D$52","v":"f"}]
[88,{"$f":"'Hit Squad'!$A$61","v":13},{"$f":"'Hit Squad'!$D$1","v":"Hit Squad"},{"$f":"'Hit Squad'!$D$61","v":"Kellie"},{"$f":"'Hit Squad'!$D$62","v":"Molis"},{"$f":"'Hit Squad'!$H$64","v":0},{"$f":"'Hit Squad'!$H$61","v":1},{"$f":"'Hit Squad'!$F$8","v":3},"N",{"$f":"'Hit Squad'!$H$62","v":0},{"$f":"'Hit Squad'!$H$63","v":1},{"$f":"'Hit Squad'!$D$64","v":"f"}]
[114,{"$f":"Sticks!$A$65","v":14},{"$f":"Sticks!$D$1","v":"Sticks"},{"$f":"Sticks!$D$65","v":"Jaime"},{"$f":"Sticks!$D$66","v":"Holdaway"},{"$f":"Sticks!$H$68","v":0},{"$f":"Sticks!$H$65","v":3},{"$f":"Sticks!$F$8","v":4},"N",{"$f":"Sticks!$H$66","v":0},{"$f":"Sticks!$H$67","v":3},{"$f":"Sticks!$D$68","v":"f"}]
[90,{"$f":"'Hit Squad'!$A$69","v":15},{"$f":"'Hit Squad'!$D$1","v":"Hit Squad"},{"$f":"'Hit Squad'!$D$69","v":"Rachel "},{"$f":"'Hit Squad'!$D$70","v":"Russell"},{"$f":"'Hit Squad'!$H$72","v":0},{"$f":"'Hit Squad'!$H$69","v":2},{"$f":"'Hit Squad'!$F$8","v":3},"N",{"$f":"'Hit Squad'!$H$70","v":0},{"$f":"'Hit Squad'!$H$71","v":2},{"$f":"'Hit Squad'!$D$72","v":"f"}]
[63,{"$f":"'Ghetto Bombers'!$A$61","v":13},{"$f":"'Ghetto Bombers'!$D$1","v":"Ghetto Bombers"},{"$f":"'Ghetto Bombers'!$D$61","v":"Ryan"},{"$f":"'Ghetto Bombers'!$D$62","v":"Newbold"},{"$f":"'Ghetto Bombers'!$H$64","v":0.90909090909090906},{"$f":"'Ghetto Bombers'!$H$61","v":11},{"$f":"'Ghetto Bombers'!$F$8","v":4},"Y",{"$f":"'Ghetto Bombers'!$H$62","v":10},{"$f":"'Ghetto Bombers'!$H$63","v":11},{"$f":"'Ghetto Bombers'!$D$64","v":"m"}]
[76,{"$f":"'Hit Squad'!$A$13","v":1},{"$f":"'Hit Squad'!$D$1","v":"Hit Squad"},{"$f":"'Hit Squad'!$D$13","v":"Ryan "},{"$f":"'Hit Squad'!$D$14","v":"Cusick"},{"$f":"'Hit Squad'!$H$16","v":0.875},{"$f":"'Hit Squad'!$H$13","v":8},{"$f":"'Hit Squad'!$F$8","v":3},"Y",{"$f":"'Hit Squad'!$H$14","v":7},{"$f":"'Hit Squad'!$H$15","v":8},{"$f":"'Hit Squad'!$D$16","v":"m"}]
[34,{"$f":"BCBC!$A$45","v":9},{"$f":"BCBC!$D$1","v":"BCBC"},{"$f":"BCBC!$D$45","v":"Dustin"},{"$f":"BCBC!$D$46","v":"Hunter"},{"$f":"BCBC!$H$48","v":0.8666666666666667},{"$f":"BCBC!$H$45","v":15},{"$f":"BCBC!$F$8","v":4},"Y",{"$f":"BCBC!$H$46","v":13},{"$f":"BCBC!$H$47","v":15},{"$f":"BCBC!$D$48","v":"m"}]
[102,{"$f":"Sticks!$A$17","v":2},{"$f":"Sticks!$D$1","v":"Sticks"},{"$f":"Sticks!$D$17","v":"Tommy"},{"$f":"Sticks!$D$18","v":"Gonzales"},{"$f":"Sticks!$H$20","v":0.8571428571428571},{"$f":"Sticks!$H$17","v":14},{"$f":"Sticks!$F$8","v":4},"Y",{"$f":"Sticks!$H$18","v":12},{"$f":"Sticks!$H$19","v":14},{"$f":"Sticks!$D$20","v":"m"}]
[106,{"$f":"Sticks!$A$33","v":6},{"$f":"Sticks!$D$1","v":"Sticks"},{"$f":"Sticks!$D$33","v":"Sean"},{"$f":"Sticks!$D$34","v":"Adams"},{"$f":"Sticks!$H$36","v":0.83333333333333337},{"$f":"Sticks!$H$33","v":12},{"$f":"Sticks!$F$8","v":4},{"$f":"IF(K130<(H130*2.5),\"N\",\"Y\")","v":"Y"},{"$f":"Sticks!$H$34","v":10},{"$f":"Sticks!$H$35","v":13},{"$f":"Sticks!$D$36","v":"m"}]
[108,{"$f":"Sticks!$A$41","v":8},{"$f":"Sticks!$D$1","v":"Sticks"},{"$f":"Sticks!$D$41","v":"Tim"},{"$f":"Sticks!$D$42","v":"Arnold"},{"$f":"Sticks!$H$44","v":0.83333333333333337},{"$f":"Sticks!$H$41","v":12},{"$f":"Sticks!$F$8","v":4},"Y",{"$f":"Sticks!$H$42","v":10},{"$f":"Sticks!$H$43","v":13},{"$f":"Sticks!$D$44","v":"m"}]
[51,{"$f":"'Ghetto Bombers'!$A$13","v":1},{"$f":"'Ghetto Bombers'!$D$1","v":"Ghetto Bombers"},{"$f":"'Ghetto Bombers'!$D$13","v":"Mac"},{"$f":"'Ghetto Bombers'!$D$14","v":"Estrada"},{"$f":"'Ghetto Bombers'!$H$16","v":0.8},{"$f":"'Ghetto Bombers'!$H$13","v":15},{"$f":"'Ghetto Bombers'!$F$8","v":4},"Y",{"$f":"'Ghetto Bombers'!$H$14","v":12},{"$f":"'Ghetto Bombers'!$H$15","v":15},{"$f":"'Ghetto Bombers'!$D$16","v":"m"}]
[28,{"$f":"BCBC!$A$21","v":3},{"$f":"BCBC!$D$1","v":"BCBC"},{"$f":"BCBC!$D$21","v":"Shane"},{"$f":"BCBC!$D$22","v":"Singer"},{"$f":"BCBC!$H$24","v":0.75},{"$f":"BCBC!$H$21","v":16},{"$f":"BCBC!$F$8","v":4},"Y",{"$f":"BCBC!$H$22","v":12},{"$f":"BCBC!$H$23","v":16},{"$f":"BCBC!$D$24","v":"m"}]
[30,{"$f":"BCBC!$A$29","v":5},{"$f":"BCBC!$D$1","v":"BCBC"},{"$f":"BCBC!$D$29","v":"Ben"},{"$f":"BCBC!$D$30","v":"Magnum"},{"$f":"BCBC!$H$32","v":0.69230769230769229},{"$f":"BCBC!$H$29","v":13},{"$f":"BCBC!$F$8","v":4},"Y",{"$f":"BCBC!$H$30","v":9},{"$f":"BCBC!$H$31","v":13},{"$f":"BCBC!$D$32","v":"m"}]
[53,{"$f":"'Ghetto Bombers'!$A$21","v":3},{"$f":"'Ghetto Bombers'!$D$1","v":"Ghetto Bombers"},{"$f":"'Ghetto Bombers'!$D$21","v":"Chet"},{"$f":"'Ghetto Bombers'!$D$22","v":"Wanlass"},{"$f":"'Ghetto Bombers'!$H$24","v":0.6875},{"$f":"'Ghetto Bombers'!$H$21","v":16},{"$f":"'Ghetto Bombers'!$F$8","v":4},"Y",{"$f":"'Ghetto Bombers'!$H$22","v":11},{"$f":"'Ghetto Bombers'!$H$23","v":16},{"$f":"'Ghetto Bombers'!$D$24","v":"m"}]
[104,{"$f":"Sticks!$A$25","v":4},{"$f":"Sticks!$D$1","v":"Sticks"},{"$f":"Sticks!$D$25","v":"Nic"},{"$f":"Sticks!$D$26","v":"Johnston"},{"$f":"Sticks!$H$28","v":0.66666666666666663},{"$f":"Sticks!$H$25","v":12},{"$f":"Sticks!$F$8","v":4},"Y",{"$f":"Sticks!$H$26","v":8},{"$f":"Sticks!$H$27","v":12},{"$f":"Sticks!$D$28","v":"m"}]
[110,{"$f":"Sticks!$A$49","v":10},{"$f":"Sticks!$D$1","v":"Sticks"},{"$f":"Sticks!$D$49","v":"Tyler"},{"$f":"Sticks!$D$50","v":"Wardle"},{"$f":"Sticks!$H$52","v":0.63636363636363635},{"$f":"Sticks!$H$49","v":11},{"$f":"Sticks!$F$8","v":4},"Y",{"$f":"Sticks!$H$50","v":7},{"$f":"Sticks!$H$51","v":12},{"$f":"Sticks!$D$52","v":"m"}]
[26,{"$f":"BCBC!$A$13","v":1},{"$f":"BCBC!$D$1","v":"BCBC"},{"$f":"BCBC!$D$13","v":"Jordan"},{"$f":"BCBC!$D$14","v":"Rodgers"},{"$f":"BCBC!$H$16","v":0.63636363636363635},{"$f":"BCBC!$H$13","v":11},{"$f":"BCBC!$F$8","v":4},"Y",{"$f":"BCBC!$H$14","v":7},{"$f":"BCBC!$H$15","v":11},{"$f":"BCBC!$D$16","v":"m"}]
[7,{"$f":"'Bad Pitches'!$A$37","v":7},{"$f":"'Bad Pitches'!$D$1","v":"Bad Pitches"},{"$f":"'Bad Pitches'!$D$37","v":"Brian"},{"$f":"'Bad Pitches'!$D$38","v":"Godfrey"},{"$f":"'Bad Pitches'!$H$40","v":0.625},{"$f":"'Bad Pitches'!$H$37","v":8},{"$f":"'Bad Pitches'!$F$8","v":3},"Y",{"$f":"'Bad Pitches'!$H$38","v":5},{"$f":"'Bad Pitches'!$H$39","v":8},{"$f":"'Bad Pitches'!$D$40","v":"m"}]
[1,{"$f":"'Bad Pitches'!$A$13","v":1},{"$f":"'Bad Pitches'!$D$1","v":"Bad Pitches"},{"$f":"'Bad Pitches'!$D$13","v":"Ryan "},{"$f":"'Bad Pitches'!$D$14","v":"Watt"},{"$f":"'Bad Pitches'!$H$16","v":0.61538461538461542},{"$f":"'Bad Pitches'!$H$13","v":13},{"$f":"'Bad Pitches'!$F$8","v":3},"Y",{"$f":"'Bad Pitches'!$H$14","v":8},{"$f":"'Bad Pitches'!$H$15","v":13},{"$f":"'Bad Pitches'!$D$16","v":"m"}]
[36,{"$f":"BCBC!$A$53","v":11},{"$f":"BCBC!$D$1","v":"BCBC"},{"$f":"BCBC!$D$53","v":"Jace"},{"$f":"BCBC!$D$54","v":"Rogers"},{"$f":"BCBC!$H$56","v":0.6},{"$f":"BCBC!$H$53","v":10},{"$f":"BCBC!$F$8","v":4},"Y",{"$f":"BCBC!$H$54","v":6},{"$f":"BCBC!$H$55","v":10},{"$f":"BCBC!$D$56","v":"m"}]
[55,{"$f":"'Ghetto Bombers'!$A$29","v":5},{"$f":"'Ghetto Bombers'!$D$1","v":"Ghetto Bombers"},{"$f":"'Ghetto Bombers'!$D$29","v":"Jon "},{"$f":"'Ghetto Bombers'!$D$30","v":"Staley"},{"$f":"'Ghetto Bombers'!$H$32","v":0.5714285714285714},{"$f":"'Ghetto Bombers'!$H$29","v":14},{"$f":"'Ghetto Bombers'!$F$8","v":4},"Y",{"$f":"'Ghetto Bombers'!$H$30","v":8},{"$f":"'Ghetto Bombers'!$H$31","v":14},{"$f":"'Ghetto Bombers'!$D$32","v":"m"}]
[3,{"$f":"'Bad Pitches'!$A$21","v":3},{"$f":"'Bad Pitches'!$D$1","v":"Bad Pitches"},{"$f":"'Bad Pitches'!$D$21","v":"Jeff"},{"$f":"'Bad Pitches'!$D$22","v":"Cagle"},{"$f":"'Bad Pitches'!$H$24","v":0.54545454545454541},{"$f":"'Bad Pitches'!$H$21","v":11},{"$f":"'Bad Pitches'!$F$8","v":3},"Y",{"$f":"'Bad Pitches'!$H$22","v":6},{"$f":"'Bad Pitches'!$H$23","v":11},{"$f":"'Bad Pitches'!$D$24","v":"m"}]
[9,{"$f":"'Bad Pitches'!$A$45","v":9},{"$f":"'Bad Pitches'!$D$1","v":"Bad Pitches"},{"$f":"'Bad Pitches'!$D$45","v":"Vincente"},{"$f":"'Bad Pitches'!$D$46","v":"Herrera"},{"$f":"'Bad Pitches'!$H$48","v":0.54545454545454541},{"$f":"'Bad Pitches'!$H$45","v":11},{"$f":"'Bad Pitches'!$F$8","v":3},"Y",{"$f":"'Bad Pitches'!$H$46","v":6},{"$f":"'Bad Pitches'!$H$47","v":12},{"$f":"'Bad Pitches'!$D$48","v":"m"}]
[5,{"$f":"'Bad Pitches'!$A$29","v":5},{"$f":"'Bad Pitches'!$D$1","v":"Bad Pitches"},{"$f":"'Bad Pitches'!$D$29","v":"Aaron"},{"$f":"'Bad Pitches'!$D$30","v":"Montgomery"},{"$f":"'Bad Pitches'!$H$32","v":0.45454545454545453},{"$f":"'Bad Pitches'!$H$29","v":11},{"$f":"'Bad Pitches'!$F$8","v":3},"Y",{"$f":"'Bad Pitches'!$H$30","v":5},{"$f":"'Bad Pitches'!$H$31","v":11},{"$f":"'Bad Pitches'!$D$32","v":"m"}]
[112,{"$f":"Sticks!$A$57","v":12},{"$f":"Sticks!$D$1","v":"Sticks"},{"$f":"Sticks!$D$57","v":"Troy"},{"$f":"Sticks!$D$58","v":"Horne"},{"$f":"Sticks!$H$60","v":0.45454545454545453},{"$f":"Sticks!$H$57","v":11},{"$f":"Sticks!$F$8","v":4},"Y",{"$f":"Sticks!$H$58","v":5},{"$f":"Sticks!$H$59","v":12},{"$f":"Sticks!$D$60","v":"m"}]
[59,{"$f":"'Ghetto Bombers'!$A$45","v":9},{"$f":"'Ghetto Bombers'!$D$1","v":"Ghetto Bombers"},{"$f":"'Ghetto Bombers'!$D$45","v":"Dave"},{"$f":"'Ghetto Bombers'!$D$46","v":"Vu"},{"$f":"'Ghetto Bombers'!$H$48","v":0.44444444444444442},{"$f":"'Ghetto Bombers'!$H$45","v":9},{"$f":"'Ghetto Bombers'!$F$8","v":4},"Y",{"$f":"'Ghetto Bombers'!$H$46","v":4},{"$f":"'Ghetto Bombers'!$H$47","v":13},{"$f":"'Ghetto Bombers'!$D$48","v":"m"}]
[57,{"$f":"'Ghetto Bombers'!$A$37","v":7},{"$f":"'Ghetto Bombers'!$D$1","v":"Ghetto Bombers"},{"$f":"'Ghetto Bombers'!$D$37","v":"Derek"},{"$f":"'Ghetto Bombers'!$D$38","v":"Smith"},{"$f":"'Ghetto Bombers'!$H$40","v":0.42857142857142855},{"$f":"'Ghetto Bombers'!$H$37","v":14},{"$f":"'Ghetto Bombers'!$F$8","v":4},"Y",{"$f":"'Ghetto Bombers'!$H$38","v":6},{"$f":"'Ghetto Bombers'!$H$39","v":14},{"$f":"'Ghetto Bombers'!$D$40","v":"m"}]
[32,{"$f":"BCBC!$A$37","v":7},{"$f":"BCBC!$D$1","v":"BCBC"},{"$f":"BCBC!$D$37","v":"Jeff"},{"$f":"BCBC!$D$38","v":"Nielsen"},{"$f":"BCBC!$H$40","v":0.30769230769230771},{"$f":"BCBC!$H$37","v":13},{"$f":"BCBC!$F$8","v":4},"Y",{"$f":"BCBC!$H$38","v":4},{"$f":"BCBC!$H$39","v":15},{"$f":"BCBC!$D$40","v":"m"}]
[46,{"$f":"BCBC!$A$93","v":21},{"$f":"BCBC!$D$1","v":"BCBC"},{"$f":"BCBC!$D$93","v":0},{"$f":"BCBC!$D$94","v":0},{"$f":"BCBC!$H$96","v":""},{"$f":"BCBC!$H$93","v":0},{"$f":"BCBC!$F$8","v":4},"N",{"$f":"BCBC!$H$94","v":0},{"$f":"BCBC!$H$95","v":0},{"$f":"BCBC!$D$96","v":"m"}]
[48,{"$f":"BCBC!$A$101","v":23},{"$f":"BCBC!$D$1","v":"BCBC"},{"$f":"BCBC!$D$101","v":0},{"$f":"BCBC!$D$102","v":0},{"$f":"BCBC!$H$104","v":""},{"$f":"BCBC!$H$101","v":0},{"$f":"BCBC!$F$8","v":4},"N",{"$f":"BCBC!$H$102","v":0},{"$f":"BCBC!$H$103","v":0},{"$f":"BCBC!$D$104","v":"m"}]
[50,{"$f":"BCBC!$A$109","v":25},{"$f":"BCBC!$D$1","v":"BCBC"},{"$f":"BCBC!$D$109","v":0},{"$f":"BCBC!$D$110","v":0},{"$f":"BCBC!$H$112","v":""},{"$f":"BCBC!$H$109","v":0},{"$f":"BCBC!$F$8","v":4},"N",{"$f":"BCBC!$H$110","v":0},{"$f":"BCBC!$H$111","v":0},{"$f":"BCBC!$D$112","v":"m"}]
[69,{"$f":"'Ghetto Bombers'!$A$85","v":19},{"$f":"'Ghetto Bombers'!$D$1","v":"Ghetto Bombers"},{"$f":"'Ghetto Bombers'!$D$85","v":0},{"$f":"'Ghetto Bombers'!$D$86","v":0},{"$f":"'Ghetto Bombers'!$H$88","v":""},{"$f":"'Ghetto Bombers'!$H$85","v":0},{"$f":"'Ghetto Bombers'!$F$8","v":4},"N",{"$f":"'Ghetto Bombers'!$H$86","v":0},{"$f":"'Ghetto Bombers'!$H$87","v":0},{"$f":"'Ghetto Bombers'!$D$88","v":"m"}]
[44,{"$f":"BCBC!$A$85","v":19},{"$f":"BCBC!$D$1","v":"BCBC"},{"$f":"BCBC!$D$85","v":0},{"$f":"BCBC!$D$86","v":0},{"$f":"BCBC!$H$88","v":""},{"$f":"BCBC!$H$85","v":0},{"$f":"BCBC!$F$8","v":4},"N",{"$f":"BCBC!$H$86","v":0},{"$f":"BCBC!$H$87","v":0},{"$f":"BCBC!$D$88","v":"m"}]
[67,{"$f":"'Ghetto Bombers'!$A$77","v":17},{"$f":"'Ghetto Bombers'!$D$1","v":"Ghetto Bombers"},{"$f":"'Ghetto Bombers'!$D$77","v":0},{"$f":"'Ghetto Bombers'!$D$78","v":0},{"$f":"'Ghetto Bombers'!$H$80","v":""},{"$f":"'Ghetto Bombers'!$H$77","v":0},{"$f":"'Ghetto Bombers'!$F$8","v":4},"N",{"$f":"'Ghetto Bombers'!$H$78","v":0},{"$f":"'Ghetto Bombers'!$H$79","v":0},{"$f":"'Ghetto Bombers'!$D$80","v":"m"}]
[42,{"$f":"BCBC!$A$77","v":17},{"$f":"BCBC!$D$1","v":"BCBC"},{"$f":"BCBC!$D$77","v":0},{"$f":"BCBC!$D$78","v":0},{"$f":"BCBC!$H$80","v":""},{"$f":"BCBC!$H$77","v":0},{"$f":"BCBC!$F$8","v":4},"N",{"$f":"BCBC!$H$78","v":0},{"$f":"BCBC!$H$79","v":0},{"$f":"BCBC!$D$80","v":"m"}]
[71,{"$f":"'Ghetto Bombers'!$A$93","v":21},{"$f":"'Ghetto Bombers'!$D$1","v":"Ghetto Bombers"},{"$f":"'Ghetto Bombers'!$D$93","v":0},{"$f":"'Ghetto Bombers'!$D$94","v":0},{"$f":"'Ghetto Bombers'!$H$96","v":""},{"$f":"'Ghetto Bombers'!$H$93","v":0},{"$f":"'Ghetto Bombers'!$F$8","v":4},"N",{"$f":"'Ghetto Bombers'!$H$94","v":0},{"$f":"'Ghetto Bombers'!$H$95","v":0},{"$f":"'Ghetto Bombers'!$D$96","v":"m"}]
[138,{"$f":"'Team 6'!$A$61","v":13},{"$f":"'Team 6'!$D$1","v":"Team 6"},{"$f":"'Team 6'!$D$61","v":0},{"$f":"'Team 6'!$D$62","v":0},{"$f":"'Team 6'!$H$64","v":""},{"$f":"'Team 6'!$H$61","v":0},{"$f":"'Team 6'!$F$8","v":8},"N",{"$f":"'Team 6'!$H$62","v":0},{"$f":"'Team 6'!$H$63","v":0},{"$f":"'Team 6'!$D$64","v":"m"}]
[19,{"$f":"'Bad Pitches'!$A$85","v":19},{"$f":"'Bad Pitches'!$D$1","v":"Bad Pitches"},{"$f":"'Bad Pitches'!$D$85","v":0},{"$f":"'Bad Pitches'!$D$86","v":0},{"$f":"'Bad Pitches'!$H$88","v":""},{"$f":"'Bad Pitches'!$H$85","v":0},{"$f":"'Bad Pitches'!$F$8","v":3},"N",{"$f":"'Bad Pitches'!$H$86","v":0},{"$f":"'Bad Pitches'!$H$87","v":0},{"$f":"'Bad Pitches'!$D$88","v":"m"}]
[119,{"$f":"Sticks!$A$85","v":19},{"$f":"Sticks!$D$1","v":"Sticks"},{"$f":"Sticks!$D$85","v":0},{"$f":"Sticks!$D$86","v":0},{"$f":"Sticks!$H$88","v":""},{"$f":"Sticks!$H$85","v":0},{"$f":"Sticks!$F$8","v":4},"N",{"$f":"Sticks!$H$86","v":0},{"$f":"Sticks!$H$87","v":0},{"$f":"Sticks!$D$88","v":"m"}]
[18,{"$f":"'Bad Pitches'!$A$81","v":18},{"$f":"'Bad Pitches'!$D$1","v":"Bad Pitches"},{"$f":"'Bad Pitches'!$D$81","v":0},{"$f":"'Bad Pitches'!$D$82","v":0},{"$f":"'Bad Pitches'!$H$84","v":""},{"$f":"'Bad Pitches'!$H$81","v":0},{"$f":"'Bad Pitches'!$F$8","v":3},"N",{"$f":"'Bad Pitches'!$H$82","v":0},{"$f":"'Bad Pitches'!$H$83","v":0},{"$f":"'Bad Pitches'!$D$84","v":"m"}]
[121,{"$f":"Sticks!$A$93","v":21},{"$f":"Sticks!$D$1","v":"Sticks"},{"$f":"Sticks!$D$93","v":0},{"$f":"Sticks!$D$94","v":0},{"$f":"Sticks!$H$96","v":""},{"$f":"Sticks!$H$93","v":0},{"$f":"Sticks!$F$8","v":4},{"$f":"IF(K162<(H162*2.5),\"N\",\"Y\")","v":"N"},{"$f":"Sticks!$H$94","v":0},{"$f":"Sticks!$H$95","v":0},{"$f":"Sticks!$D$96","v":"m"}]
[147,{"$f":"'Team 6'!$A$97","v":22},{"$f":"'Team 6'!$D$1","v":"Team 6"},{"$f":"'Team 6'!$D$97","v":0},{"$f":"'Team 6'!$D$98","v":0},{"$f":"'Team 6'!$H$100","v":""},{"$f":"'Team 6'!$H$97","v":0},{"$f":"'Team 6'!$F$8","v":8},"N",{"$f":"'Team 6'!$H$98","v":0},{"$f":"'Team 6'!$H$99","v":0},{"$f":"'Team 6'!$D$100","v":"m"}]
[92,{"$f":"'Hit Squad'!$A$77","v":17},{"$f":"'Hit Squad'!$D$1","v":"Hit Squad"},{"$f":"'Hit Squad'!$D$77","v":0},{"$f":"'Hit Squad'!$D$78","v":0},{"$f":"'Hit Squad'!$H$80","v":""},{"$f":"'Hit Squad'!$H$77","v":0},{"$f":"'Hit Squad'!$F$8","v":3},"N",{"$f":"'Hit Squad'!$H$78","v":0},{"$f":"'Hit Squad'!$H$79","v":0},{"$f":"'Hit Squad'!$D$80","v":"m"}]
[144,{"$f":"'Team 6'!$A$85","v":19},{"$f":"'Team 6'!$D$1","v":"Team 6"},{"$f":"'Team 6'!$D$85","v":0},{"$f":"'Team 6'!$D$86","v":0},{"$f":"'Team 6'!$H$88","v":""},{"$f":"'Team 6'!$H$85","v":0},{"$f":"'Team 6'!$F$8","v":8},"N",{"$f":"'Team 6'!$H$86","v":0},{"$f":"'Team 6'!$H$87","v":0},{"$f":"'Team 6'!$D$88","v":"m"}]
[142,{"$f":"'Team 6'!$A$77","v":17},{"$f":"'Team 6'!$D$1","v":"Team 6"},{"$f":"'Team 6'!$D$77","v":0},{"$f":"'Team 6'!$D$78","v":0},{"$f":"'Team 6'!$H$80","v":""},{"$f":"'Team 6'!$H$77","v":0},{"$f":"'Team 6'!$F$8","v":8},"N",{"$f":"'Team 6'!$H$78","v":0},{"$f":"'Team 6'!$H$79","v":0},{"$f":"'Team 6'!$D$80","v":"m"}]
[140,{"$f":"'Team 6'!$A$69","v":15},{"$f":"'Team 6'!$D$1","v":"Team 6"},{"$f":"'Team 6'!$D$69","v":0},{"$f":"'Team 6'!$D$70","v":0},{"$f":"'Team 6'!$H$72","v":""},{"$f":"'Team 6'!$H$69","v":0},{"$f":"'Team 6'!$F$8","v":8},"N",{"$f":"'Team 6'!$H$70","v":0},{"$f":"'Team 6'!$H$71","v":0},{"$f":"'Team 6'!$D$72","v":"m"}]
[146,{"$f":"'Team 6'!$A$93","v":21},{"$f":"'Team 6'!$D$1","v":"Team 6"},{"$f":"'Team 6'!$D$93","v":0},{"$f":"'Team 6'!$D$94","v":0},{"$f":"'Team 6'!$H$96","v":""},{"$f":"'Team 6'!$H$93","v":0},{"$f":"'Team 6'!$F$8","v":8},"N",{"$f":"'Team 6'!$H$94","v":0},{"$f":"'Team 6'!$H$95","v":0},{"$f":"'Team 6'!$D$96","v":"m"}]
[136,{"$f":"'Team 6'!$A$53","v":11},{"$f":"'Team 6'!$D$1","v":"Team 6"},{"$f":"'Team 6'!$D$53","v":0},{"$f":"'Team 6'!$D$54","v":0},{"$f":"'Team 6'!$H$56","v":""},{"$f":"'Team 6'!$H$53","v":0},{"$f":"'Team 6'!$F$8","v":8},"N",{"$f":"'Team 6'!$H$54","v":0},{"$f":"'Team 6'!$H$55","v":0},{"$f":"'Team 6'!$D$56","v":"m"}]
[116,{"$f":"Sticks!$A$73","v":16},{"$f":"Sticks!$D$1","v":"Sticks"},{"$f":"Sticks!$D$73","v":0},{"$f":"Sticks!$D$74","v":0},{"$f":"Sticks!$H$76","v":""},{"$f":"Sticks!$H$73","v":0},{"$f":"Sticks!$F$8","v":4},"N",{"$f":"Sticks!$H$74","v":0},{"$f":"Sticks!$H$75","v":0},{"$f":"Sticks!$D$76","v":"m"}]
[93,{"$f":"'Hit Squad'!$A$81","v":18},{"$f":"'Hit Squad'!$D$1","v":"Hit Squad"},{"$f":"'Hit Squad'!$D$81","v":0},{"$f":"'Hit Squad'!$D$82","v":0},{"$f":"'Hit Squad'!$H$84","v":""},{"$f":"'Hit Squad'!$H$81","v":0},{"$f":"'Hit Squad'!$F$8","v":3},"N",{"$f":"'Hit Squad'!$H$82","v":0},{"$f":"'Hit Squad'!$H$83","v":0},{"$f":"'Hit Squad'!$D$84","v":"m"}]
[149,{"$f":"'Team 6'!$A$105","v":24},{"$f":"'Team 6'!$D$1","v":"Team 6"},{"$f":"'Team 6'!$D$105","v":0},{"$f":"'Team 6'!$D$106","v":0},{"$f":"'Team 6'!$H$108","v":""},{"$f":"'Team 6'!$H$105","v":0},{"$f":"'Team 6'!$F$8","v":8},"N",{"$f":"'Team 6'!$H$106","v":0},{"$f":"'Team 6'!$H$107","v":0},{"$f":"'Team 6'!$D$108","v":"m"}]
[139,{"$f":"'Team 6'!$A$65","v":14},{"$f":"'Team 6'!$D$1","v":"Team 6"},{"$f":"'Team 6'!$D$65","v":0},{"$f":"'Team 6'!$D$66","v":0},{"$f":"'Team 6'!$H$68","v":""},{"$f":"'Team 6'!$H$65","v":0},{"$f":"'Team 6'!$F$8","v":8},"N",{"$f":"'Team 6'!$H$66","v":0},{"$f":"'Team 6'!$H$67","v":0},{"$f":"'Team 6'!$D$68","v":"m"}]
[14,{"$f":"'Bad Pitches'!$A$65","v":14},{"$f":"'Bad Pitches'!$D$1","v":"Bad Pitches"},{"$f":"'Bad Pitches'!$D$65","v":0},{"$f":"'Bad Pitches'!$D$66","v":0},{"$f":"'Bad Pitches'!$H$68","v":""},{"$f":"'Bad Pitches'!$H$65","v":0},{"$f":"'Bad Pitches'!$F$8","v":3},"N",{"$f":"'Bad Pitches'!$H$66","v":0},{"$f":"'Bad Pitches'!$H$67","v":0},{"$f":"'Bad Pitches'!$D$68","v":"m"}]
[91,{"$f":"'Hit Squad'!$A$73","v":16},{"$f":"'Hit Squad'!$D$1","v":"Hit Squad"},{"$f":"'Hit Squad'!$D$73","v":"Lars"},{"$f":"'Hit Squad'!$D$74","v":"Peterson"},{"$f":"'Hit Squad'!$H$76","v":1},{"$f":"'Hit Squad'!$H$73","v":2},{"$f":"'Hit Squad'!$F$8","v":3},"N",{"$f":"'Hit Squad'!$H$74","v":2},{"$f":"'Hit Squad'!$H$75","v":2},{"$f":"'Hit Squad'!$D$76","v":"m"}]
[40,{"$f":"BCBC!$A$69","v":15},{"$f":"BCBC!$D$1","v":"BCBC"},{"$f":"BCBC!$D$69","v":"Vinnie"},{"$f":"BCBC!$D$70","v":"Dilworth"},{"$f":"BCBC!$H$72","v":1},{"$f":"BCBC!$H$69","v":4},{"$f":"BCBC!$F$8","v":4},"N",{"$f":"BCBC!$H$70","v":4},{"$f":"BCBC!$H$71","v":5},{"$f":"BCBC!$D$72","v":"m"}]
[66,{"$f":"'Ghetto Bombers'!$A$73","v":16},{"$f":"'Ghetto Bombers'!$D$1","v":"Ghetto Bombers"},{"$f":"'Ghetto Bombers'!$D$73","v":"Matt"},{"$f":"'Ghetto Bombers'!$D$74","v":"Newbold"},{"$f":"'Ghetto Bombers'!$H$76","v":1},{"$f":"'Ghetto Bombers'!$H$73","v":1},{"$f":"'Ghetto Bombers'!$F$8","v":4},"N",{"$f":"'Ghetto Bombers'!$H$74","v":1},{"$f":"'Ghetto Bombers'!$H$75","v":1},{"$f":"'Ghetto Bombers'!$D$76","v":"m"}]
[78,{"$f":"'Hit Squad'!$A$21","v":3},{"$f":"'Hit Squad'!$D$1","v":"Hit Squad"},{"$f":"'Hit Squad'!$D$21","v":"David"},{"$f":"'Hit Squad'!$D$22","v":"Stevens"},{"$f":"'Hit Squad'!$H$24","v":0.7142857142857143},{"$f":"'Hit Squad'!$H$21","v":7},{"$f":"'Hit Squad'!$F$8","v":3},"N",{"$f":"'Hit Squad'!$H$22","v":5},{"$f":"'Hit Squad'!$H$23","v":7},{"$f":"'Hit Squad'!$D$24","v":"m"}]
[84,{"$f":"'Hit Squad'!$A$45","v":9},{"$f":"'Hit Squad'!$D$1","v":"Hit Squad"},{"$f":"'Hit Squad'!$D$45","v":"Chris"},{"$f":"'Hit Squad'!$D$46","v":"Schippers"},{"$f":"'Hit Squad'!$H$48","v":0.7142857142857143},{"$f":"'Hit Squad'!$H$45","v":7},{"$f":"'Hit Squad'!$F$8","v":3},"N",{"$f":"'Hit Squad'!$H$46","v":5},{"$f":"'Hit Squad'!$H$47","v":7},{"$f":"'Hit Squad'!$D$48","v":"m"}]
[61,{"$f":"'Ghetto Bombers'!$A$53","v":11},{"$f":"'Ghetto Bombers'!$D$1","v":"Ghetto Bombers"},{"$f":"'Ghetto Bombers'!$D$53","v":"Tyler"},{"$f":"'Ghetto Bombers'!$D$54","v":"Curtis"},{"$f":"'Ghetto Bombers'!$H$56","v":0.66666666666666663},{"$f":"'Ghetto Bombers'!$H$53","v":3},{"$f":"'Ghetto Bombers'!$F$8","v":4},"N",{"$f":"'Ghetto Bombers'!$H$54","v":2},{"$f":"'Ghetto Bombers'!$H$55","v":3},{"$f":"'Ghetto Bombers'!$D$56","v":"m"}]
[38,{"$f":"BCBC!$A$61","v":13},{"$f":"BCBC!$D$1","v":"BCBC"},{"$f":"BCBC!$D$61","v":"Scotty"},{"$f":"BCBC!$D$62","v":"Garfield"},{"$f":"BCBC!$H$64","v":0.5},{"$f":"BCBC!$H$61","v":2},{"$f":"BCBC!$F$8","v":4},"N",{"$f":"BCBC!$H$62","v":1},{"$f":"BCBC!$H$63","v":2},{"$f":"BCBC!$D$64","v":"m"}]
[80,{"$f":"'Hit Squad'!$A$29","v":5},{"$f":"'Hit Squad'!$D$1","v":"Hit Squad"},{"$f":"'Hit Squad'!$D$29","v":"Jeff"},{"$f":"'Hit Squad'!$D$30","v":"Snedekar"},{"$f":"'Hit Squad'!$H$32","v":0.4},{"$f":"'Hit Squad'!$H$29","v":5},{"$f":"'Hit Squad'!$F$8","v":3},"N",{"$f":"'Hit Squad'!$H$30","v":2},{"$f":"'Hit Squad'!$H$31","v":5},{"$f":"'Hit Squad'!$D$32","v":"m"}]
[86,{"$f":"'Hit Squad'!$A$53","v":11},{"$f":"'Hit Squad'!$D$1","v":"Hit Squad"},{"$f":"'Hit Squad'!$D$53","v":"Dan "},{"$f":"'Hit Squad'!$D$54","v":"Stevens"},{"$f":"'Hit Squad'!$H$56","v":0.33333333333333331},{"$f":"'Hit Squad'!$H$53","v":6},{"$f":"'Hit Squad'!$F$8","v":3},"N",{"$f":"'Hit Squad'!$H$54","v":2},{"$f":"'Hit Squad'!$H$55","v":6},{"$f":"'Hit Squad'!$D$56","v":"m"}]
[82,{"$f":"'Hit Squad'!$A$37","v":7},{"$f":"'Hit Squad'!$D$1","v":"Hit Squad"},{"$f":"'Hit Squad'!$D$37","v":"Dusty"},{"$f":"'Hit Squad'!$D$38","v":"Jorgenson"},{"$f":"'Hit Squad'!$H$40","v":0.14285714285714285},{"$f":"'Hit Squad'!$H$37","v":7},{"$f":"'Hit Squad'!$F$8","v":3},"N",{"$f":"'Hit Squad'!$H$38","v":1},{"$f":"'Hit Squad'!$H$39","v":7},{"$f":"'Hit Squad'!$D$40","v":"m"}]
[64,{"$f":"'Ghetto Bombers'!$A$65","v":14},{"$f":"'Ghetto Bombers'!$D$1","v":"Ghetto Bombers"},{"$f":"'Ghetto Bombers'!$D$65","v":"Alllie"},{"$f":"'Ghetto Bombers'!$D$66","v":"Newbold"},{"$f":"'Ghetto Bombers'!$H$68","v":0},{"$f":"'Ghetto Bombers'!$H$65","v":4},{"$f":"'Ghetto Bombers'!$F$8","v":4},"N",{"$f":"'Ghetto Bombers'!$H$66","v":0},{"$f":"'Ghetto Bombers'!$H$67","v":4},{"$f":"'Ghetto Bombers'!$D$68","v":"m"}]
[11,{"$f":"'Bad Pitches'!$A$53","v":11},{"$f":"'Bad Pitches'!$D$1","v":"Bad Pitches"},{"$f":"'Bad Pitches'!$D$53","v":"Seth"},{"$f":"'Bad Pitches'!$D$54","v":"Kaelin"},{"$f":"'Bad Pitches'!$H$56","v":0},{"$f":"'Bad Pitches'!$H$53","v":4},{"$f":"'Bad Pitches'!$F$8","v":3},"N",{"$f":"'Bad Pitches'!$H$54","v":0},{"$f":"'Bad Pitches'!$H$55","v":4},{"$f":"'Bad Pitches'!$D$56","v":"m"}]
[201,{"$f":"'Team 7'!$A$13","v":1},{"$f":"'Team 7'!$D$1","v":" "},{"$f":"'Team 7'!$D$13","v":"Bob"},{"$f":"'Team 7'!$D$14","v":0},{"$f":"'Team 7'!$H$16","v":0},{"$f":"'Team 7'!$H$13","v":10},{"$f":"'Team 7'!$F$8","v":8},"N",{"$f":"'Team 7'!$H$14","v":0},{"$f":"'Team 7'!$H$15","v":10},{"$f":"'Team 7'!$D$16","v":"m"}]
[205,{"$f":"'Team 7'!$A$29","v":5},{"$f":"'Team 7'!$D$1","v":" "},{"$f":"'Team 7'!$D$29","v":"Mark"},{"$f":"'Team 7'!$D$30","v":0},{"$f":"'Team 7'!$H$32","v":0},{"$f":"'Team 7'!$H$29","v":10},{"$f":"'Team 7'!$F$8","v":8},"N",{"$f":"'Team 7'!$H$30","v":0},{"$f":"'Team 7'!$H$31","v":10},{"$f":"'Team 7'!$D$32","v":"m"}]
[126,{"$f":"'Team 6'!$A$13","v":1},{"$f":"'Team 6'!$D$1","v":"Team 6"},{"$f":"'Team 6'!$D$13","v":"John"},{"$f":"'Team 6'!$D$14","v":0},{"$f":"'Team 6'!$H$16","v":0},{"$f":"'Team 6'!$H$13","v":10},{"$f":"'Team 6'!$F$8","v":8},"N",{"$f":"'Team 6'!$H$14","v":0},{"$f":"'Team 6'!$H$15","v":10},{"$f":"'Team 6'!$D$16","v":"m"}]
[132,{"$f":"'Team 6'!$A$37","v":7},{"$f":"'Team 6'!$D$1","v":"Team 6"},{"$f":"'Team 6'!$D$37","v":"Trent"},{"$f":"'Team 6'!$D$38","v":0},{"$f":"'Team 6'!$H$40","v":0},{"$f":"'Team 6'!$H$37","v":10},{"$f":"'Team 6'!$F$8","v":8},"N",{"$f":"'Team 6'!$H$38","v":0},{"$f":"'Team 6'!$H$39","v":10},{"$f":"'Team 6'!$D$40","v":"m"}]
[209,{"$f":"'Team 7'!$A$45","v":9},{"$f":"'Team 7'!$D$1","v":" "},{"$f":"'Team 7'!$D$45","v":"George"},{"$f":"'Team 7'!$D$46","v":0},{"$f":"'Team 7'!$H$48","v":0},{"$f":"'Team 7'!$H$45","v":10},{"$f":"'Team 7'!$F$8","v":8},"N",{"$f":"'Team 7'!$H$46","v":0},{"$f":"'Team 7'!$H$47","v":10},{"$f":"'Team 7'!$D$48","v":"m"}]
[130,{"$f":"'Team 6'!$A$29","v":5},{"$f":"'Team 6'!$D$1","v":"Team 6"},{"$f":"'Team 6'!$D$29","v":"Mike"},{"$f":"'Team 6'!$D$30","v":0},{"$f":"'Team 6'!$H$32","v":0},{"$f":"'Team 6'!$H$29","v":10},{"$f":"'Team 6'!$F$8","v":8},"N",{"$f":"'Team 6'!$H$30","v":0},{"$f":"'Team 6'!$H$31","v":10},{"$f":"'Team 6'!$D$32","v":"m"}]
[203,{"$f":"'Team 7'!$A$21","v":3},{"$f":"'Team 7'!$D$1","v":" "},{"$f":"'Team 7'!$D$21","v":"Cam"},{"$f":"'Team 7'!$D$22","v":0},{"$f":"'Team 7'!$H$24","v":0},{"$f":"'Team 7'!$H$21","v":10},{"$f":"'Team 7'!$F$8","v":8},"N",{"$f":"'Team 7'!$H$22","v":0},{"$f":"'Team 7'!$H$23","v":10},{"$f":"'Team 7'!$D$24","v":"m"}]
[207,{"$f":"'Team 7'!$A$37","v":7},{"$f":"'Team 7'!$D$1","v":" "},{"$f":"'Team 7'!$D$37","v":"Kent"},{"$f":"'Team 7'!$D$38","v":0},{"$f":"'Team 7'!$H$40","v":0},{"$f":"'Team 7'!$H$37","v":10},{"$f":"'Team 7'!$F$8","v":8},{"$f":"IF(K194<(H194*2.5),\"N\",\"Y\")","v":"N"},{"$f":"'Team 7'!$H$38","v":0},{"$f":"'Team 7'!$H$39","v":10},{"$f":"'Team 7'!$D$40","v":"m"}]
[185,{"$f":"'Team 8'!$A$49","v":10},{"$f":"'Team 8'!$D$1","v":" "},{"$f":"'Team 8'!$D$49","v":"Paul"},{"$f":"'Team 8'!$D$50","v":0},{"$f":"'Team 8'!$H$52","v":0},{"$f":"'Team 8'!$H$49","v":10},{"$f":"'Team 8'!$F$8","v":8},"N",{"$f":"'Team 8'!$H$50","v":0},{"$f":"'Team 8'!$H$51","v":10},{"$f":"'Team 8'!$D$52","v":"m"}]
[179,{"$f":"'Team 8'!$A$25","v":4},{"$f":"'Team 8'!$D$1","v":" "},{"$f":"'Team 8'!$D$25","v":"Dallen"},{"$f":"'Team 8'!$D$26","v":0},{"$f":"'Team 8'!$H$28","v":0},{"$f":"'Team 8'!$H$25","v":10},{"$f":"'Team 8'!$F$8","v":8},"N",{"$f":"'Team 8'!$H$26","v":0},{"$f":"'Team 8'!$H$27","v":10},{"$f":"'Team 8'!$D$28","v":"m"}]
[183,{"$f":"'Team 8'!$A$41","v":8},{"$f":"'Team 8'!$D$1","v":" "},{"$f":"'Team 8'!$D$41","v":"Jeff"},{"$f":"'Team 8'!$D$42","v":0},{"$f":"'Team 8'!$H$44","v":0},{"$f":"'Team 8'!$H$41","v":10},{"$f":"'Team 8'!$F$8","v":8},"N",{"$f":"'Team 8'!$H$42","v":0},{"$f":"'Team 8'!$H$43","v":10},{"$f":"'Team 8'!$D$44","v":"m"}]
[181,{"$f":"'Team 8'!$A$33","v":6},{"$f":"'Team 8'!$D$1","v":" "},{"$f":"'Team 8'!$D$33","v":"Jack"},{"$f":"'Team 8'!$D$34","v":0},{"$f":"'Team 8'!$H$36","v":0},{"$f":"'Team 8'!$H$33","v":10},{"$f":"'Team 8'!$F$8","v":8},"N",{"$f":"'Team 8'!$H$34","v":0},{"$f":"'Team 8'!$H$35","v":10},{"$f":"'Team 8'!$D$36","v":"m"}]
[177,{"$f":"'Team 8'!$A$17","v":2},{"$f":"'Team 8'!$D$1","v":" "},{"$f":"'Team 8'!$D$17","v":"David"},{"$f":"'Team 8'!$D$18","v":0},{"$f":"'Team 8'!$H$20","v":0},{"$f":"'Team 8'!$H$17","v":10},{"$f":"'Team 8'!$F$8","v":8},"N",{"$f":"'Team 8'!$H$18","v":0},{"$f":"'Team 8'!$H$19","v":10},{"$f":"'Team 8'!$D$20","v":"m"}]
[128,{"$f":"'Team 6'!$A$21","v":3},{"$f":"'Team 6'!$D$1","v":"Team 6"},{"$f":"'Team 6'!$D$21","v":"Ron"},{"$f":"'Team 6'!$D$22","v":0},{"$f":"'Team 6'!$H$24","v":0},{"$f":"'Team 6'!$H$21","v":10},{"$f":"'Team 6'!$F$8","v":8},"N",{"$f":"'Team 6'!$H$22","v":0},{"$f":"'Team 6'!$H$23","v":10},{"$f":"'Team 6'!$D$24","v":"m"}]
[134,{"$f":"'Team 6'!$A$45","v":9},{"$f":"'Team 6'!$D$1","v":"Team 6"},{"$f":"'Team 6'!$D$45","v":"Isaac"},{"$f":"'Team 6'!$D$46","v":0},{"$f":"'Team 6'!$H$48","v":0},{"$f":"'Team 6'!$H$45","v":10},{"$f":"'Team 6'!$F$8","v":8},"N",{"$f":"'Team 6'!$H$46","v":0},{"$f":"'Team 6'!$H$47","v":10},{"$f":"'Team 6'!$D$48","v":"m"}]

{"sheet":"Male","index":10,"n_rows":201,"n_cols":12,"rows_kept":201,"cut":false,"hidden":false,"merged":[]}
["counter","roster #","Team Name","L-Name","F-Name","Batting Avg","# of AB's","# of Games","Enough pa's","HITS","# of PA","Male/Female"]
[63,{"$f":"'Ghetto Bombers'!$A$61","v":13},{"$f":"'Ghetto Bombers'!$D$1","v":"Ghetto Bombers"},{"$f":"'Ghetto Bombers'!$D$61","v":"Ryan"},{"$f":"'Ghetto Bombers'!$D$62","v":"Newbold"},{"$f":"'Ghetto Bombers'!$H$64","v":0.90909090909090906},{"$f":"'Ghetto Bombers'!$H$61","v":11},{"$f":"'Ghetto Bombers'!$F$8","v":4},{"$f":"IF(K2<(H2*2.5),\"N\",\"Y\")","v":"Y"},{"$f":"'Ghetto Bombers'!$H$62","v":10},{"$f":"'Ghetto Bombers'!$H$63","v":11},{"$f":"'Ghetto Bombers'!$D$64","v":"m"}]
[76,{"$f":"'Hit Squad'!$A$13","v":1},{"$f":"'Hit Squad'!$D$1","v":"Hit Squad"},{"$f":"'Hit Squad'!$D$13","v":"Ryan "},{"$f":"'Hit Squad'!$D$14","v":"Cusick"},{"$f":"'Hit Squad'!$H$16","v":0.875},{"$f":"'Hit Squad'!$H$13","v":8},{"$f":"'Hit Squad'!$F$8","v":3},"Y",{"$f":"'Hit Squad'!$H$14","v":7},{"$f":"'Hit Squad'!$H$15","v":8},{"$f":"'Hit Squad'!$D$16","v":"m"}]
[34,{"$f":"BCBC!$A$45","v":9},{"$f":"BCBC!$D$1","v":"BCBC"},{"$f":"BCBC!$D$45","v":"Dustin"},{"$f":"BCBC!$D$46","v":"Hunter"},{"$f":"BCBC!$H$48","v":0.8666666666666667},{"$f":"BCBC!$H$45","v":15},{"$f":"BCBC!$F$8","v":4},"Y",{"$f":"BCBC!$H$46","v":13},{"$f":"BCBC!$H$47","v":15},{"$f":"BCBC!$D$48","v":"m"}]
[102,{"$f":"Sticks!$A$17","v":2},{"$f":"Sticks!$D$1","v":"Sticks"},{"$f":"Sticks!$D$17","v":"Tommy"},{"$f":"Sticks!$D$18","v":"Gonzales"},{"$f":"Sticks!$H$20","v":0.8571428571428571},{"$f":"Sticks!$H$17","v":14},{"$f":"Sticks!$F$8","v":4},"Y",{"$f":"Sticks!$H$18","v":12},{"$f":"Sticks!$H$19","v":14},{"$f":"Sticks!$D$20","v":"m"}]
[106,{"$f":"Sticks!$A$33","v":6},{"$f":"Sticks!$D$1","v":"Sticks"},{"$f":"Sticks!$D$33","v":"Sean"},{"$f":"Sticks!$D$34","v":"Adams"},{"$f":"Sticks!$H$36","v":0.83333333333333337},{"$f":"Sticks!$H$33","v":12},{"$f":"Sticks!$F$8","v":4},"Y",{"$f":"Sticks!$H$34","v":10},{"$f":"Sticks!$H$35","v":13},{"$f":"Sticks!$D$36","v":"m"}]
[108,{"$f":"Sticks!$A$41","v":8},{"$f":"Sticks!$D$1","v":"Sticks"},{"$f":"Sticks!$D$41","v":"Tim"},{"$f":"Sticks!$D$42","v":"Arnold"},{"$f":"Sticks!$H$44","v":0.83333333333333337},{"$f":"Sticks!$H$41","v":12},{"$f":"Sticks!$F$8","v":4},"Y",{"$f":"Sticks!$H$42","v":10},{"$f":"Sticks!$H$43","v":13},{"$f":"Sticks!$D$44","v":"m"}]
[51,{"$f":"'Ghetto Bombers'!$A$13","v":1},{"$f":"'Ghetto Bombers'!$D$1","v":"Ghetto Bombers"},{"$f":"'Ghetto Bombers'!$D$13","v":"Mac"},{"$f":"'Ghetto Bombers'!$D$14","v":"Estrada"},{"$f":"'Ghetto Bombers'!$H$16","v":0.8},{"$f":"'Ghetto Bombers'!$H$13","v":15},{"$f":"'Ghetto Bombers'!$F$8","v":4},"Y",{"$f":"'Ghetto Bombers'!$H$14","v":12},{"$f":"'Ghetto Bombers'!$H$15","v":15},{"$f":"'Ghetto Bombers'!$D$16","v":"m"}]
[28,{"$f":"BCBC!$A$21","v":3},{"$f":"BCBC!$D$1","v":"BCBC"},{"$f":"BCBC!$D$21","v":"Shane"},{"$f":"BCBC!$D$22","v":"Singer"},{"$f":"BCBC!$H$24","v":0.75},{"$f":"BCBC!$H$21","v":16},{"$f":"BCBC!$F$8","v":4},"Y",{"$f":"BCBC!$H$22","v":12},{"$f":"BCBC!$H$23","v":16},{"$f":"BCBC!$D$24","v":"m"}]
[30,{"$f":"BCBC!$A$29","v":5},{"$f":"BCBC!$D$1","v":"BCBC"},{"$f":"BCBC!$D$29","v":"Ben"},{"$f":"BCBC!$D$30","v":"Magnum"},{"$f":"BCBC!$H$32","v":0.69230769230769229},{"$f":"BCBC!$H$29","v":13},{"$f":"BCBC!$F$8","v":4},"Y",{"$f":"BCBC!$H$30","v":9},{"$f":"BCBC!$H$31","v":13},{"$f":"BCBC!$D$32","v":"m"}]
[53,{"$f":"'Ghetto Bombers'!$A$21","v":3},{"$f":"'Ghetto Bombers'!$D$1","v":"Ghetto Bombers"},{"$f":"'Ghetto Bombers'!$D$21","v":"Chet"},{"$f":"'Ghetto Bombers'!$D$22","v":"Wanlass"},{"$f":"'Ghetto Bombers'!$H$24","v":0.6875},{"$f":"'Ghetto Bombers'!$H$21","v":16},{"$f":"'Ghetto Bombers'!$F$8","v":4},"Y",{"$f":"'Ghetto Bombers'!$H$22","v":11},{"$f":"'Ghetto Bombers'!$H$23","v":16},{"$f":"'Ghetto Bombers'!$D$24","v":"m"}]
[104,{"$f":"Sticks!$A$25","v":4},{"$f":"Sticks!$D$1","v":"Sticks"},{"$f":"Sticks!$D$25","v":"Nic"},{"$f":"Sticks!$D$26","v":"Johnston"},{"$f":"Sticks!$H$28","v":0.66666666666666663},{"$f":"Sticks!$H$25","v":12},{"$f":"Sticks!$F$8","v":4},"Y",{"$f":"Sticks!$H$26","v":8},{"$f":"Sticks!$H$27","v":12},{"$f":"Sticks!$D$28","v":"m"}]
[110,{"$f":"Sticks!$A$49","v":10},{"$f":"Sticks!$D$1","v":"Sticks"},{"$f":"Sticks!$D$49","v":"Tyler"},{"$f":"Sticks!$D$50","v":"Wardle"},{"$f":"Sticks!$H$52","v":0.63636363636363635},{"$f":"Sticks!$H$49","v":11},{"$f":"Sticks!$F$8","v":4},"Y",{"$f":"Sticks!$H$50","v":7},{"$f":"Sticks!$H$51","v":12},{"$f":"Sticks!$D$52","v":"m"}]
[26,{"$f":"BCBC!$A$13","v":1},{"$f":"BCBC!$D$1","v":"BCBC"},{"$f":"BCBC!$D$13","v":"Jordan"},{"$f":"BCBC!$D$14","v":"Rodgers"},{"$f":"BCBC!$H$16","v":0.63636363636363635},{"$f":"BCBC!$H$13","v":11},{"$f":"BCBC!$F$8","v":4},"Y",{"$f":"BCBC!$H$14","v":7},{"$f":"BCBC!$H$15","v":11},{"$f":"BCBC!$D$16","v":"m"}]
[7,{"$f":"'Bad Pitches'!$A$37","v":7},{"$f":"'Bad Pitches'!$D$1","v":"Bad Pitches"},{"$f":"'Bad Pitches'!$D$37","v":"Brian"},{"$f":"'Bad Pitches'!$D$38","v":"Godfrey"},{"$f":"'Bad Pitches'!$H$40","v":0.625},{"$f":"'Bad Pitches'!$H$37","v":8},{"$f":"'Bad Pitches'!$F$8","v":3},"Y",{"$f":"'Bad Pitches'!$H$38","v":5},{"$f":"'Bad Pitches'!$H$39","v":8},{"$f":"'Bad Pitches'!$D$40","v":"m"}]
[1,{"$f":"'Bad Pitches'!$A$13","v":1},{"$f":"'Bad Pitches'!$D$1","v":"Bad Pitches"},{"$f":"'Bad Pitches'!$D$13","v":"Ryan "},{"$f":"'Bad Pitches'!$D$14","v":"Watt"},{"$f":"'Bad Pitches'!$H$16","v":0.61538461538461542},{"$f":"'Bad Pitches'!$H$13","v":13},{"$f":"'Bad Pitches'!$F$8","v":3},"Y",{"$f":"'Bad Pitches'!$H$14","v":8},{"$f":"'Bad Pitches'!$H$15","v":13},{"$f":"'Bad Pitches'!$D$16","v":"m"}]
[36,{"$f":"BCBC!$A$53","v":11},{"$f":"BCBC!$D$1","v":"BCBC"},{"$f":"BCBC!$D$53","v":"Jace"},{"$f":"BCBC!$D$54","v":"Rogers"},{"$f":"BCBC!$H$56","v":0.6},{"$f":"BCBC!$H$53","v":10},{"$f":"BCBC!$F$8","v":4},"Y",{"$f":"BCBC!$H$54","v":6},{"$f":"BCBC!$H$55","v":10},{"$f":"BCBC!$D$56","v":"m"}]
[55,{"$f":"'Ghetto Bombers'!$A$29","v":5},{"$f":"'Ghetto Bombers'!$D$1","v":"Ghetto Bombers"},{"$f":"'Ghetto Bombers'!$D$29","v":"Jon "},{"$f":"'Ghetto Bombers'!$D$30","v":"Staley"},{"$f":"'Ghetto Bombers'!$H$32","v":0.5714285714285714},{"$f":"'Ghetto Bombers'!$H$29","v":14},{"$f":"'Ghetto Bombers'!$F$8","v":4},"Y",{"$f":"'Ghetto Bombers'!$H$30","v":8},{"$f":"'Ghetto Bombers'!$H$31","v":14},{"$f":"'Ghetto Bombers'!$D$32","v":"m"}]
[3,{"$f":"'Bad Pitches'!$A$21","v":3},{"$f":"'Bad Pitches'!$D$1","v":"Bad Pitches"},{"$f":"'Bad Pitches'!$D$21","v":"Jeff"},{"$f":"'Bad Pitches'!$D$22","v":"Cagle"},{"$f":"'Bad Pitches'!$H$24","v":0.54545454545454541},{"$f":"'Bad Pitches'!$H$21","v":11},{"$f":"'Bad Pitches'!$F$8","v":3},"Y",{"$f":"'Bad Pitches'!$H$22","v":6},{"$f":"'Bad Pitches'!$H$23","v":11},{"$f":"'Bad Pitches'!$D$24","v":"m"}]
[9,{"$f":"'Bad Pitches'!$A$45","v":9},{"$f":"'Bad Pitches'!$D$1","v":"Bad Pitches"},{"$f":"'Bad Pitches'!$D$45","v":"Vincente"},{"$f":"'Bad Pitches'!$D$46","v":"Herrera"},{"$f":"'Bad Pitches'!$H$48","v":0.54545454545454541},{"$f":"'Bad Pitches'!$H$45","v":11},{"$f":"'Bad Pitches'!$F$8","v":3},"Y",{"$f":"'Bad Pitches'!$H$46","v":6},{"$f":"'Bad Pitches'!$H$47","v":12},{"$f":"'Bad Pitches'!$D$48","v":"m"}]
[5,{"$f":"'Bad Pitches'!$A$29","v":5},{"$f":"'Bad Pitches'!$D$1","v":"Bad Pitches"},{"$f":"'Bad Pitches'!$D$29","v":"Aaron"},{"$f":"'Bad Pitches'!$D$30","v":"Montgomery"},{"$f":"'Bad Pitches'!$H$32","v":0.45454545454545453},{"$f":"'Bad Pitches'!$H$29","v":11},{"$f":"'Bad Pitches'!$F$8","v":3},"Y",{"$f":"'Bad Pitches'!$H$30","v":5},{"$f":"'Bad Pitches'!$H$31","v":11},{"$f":"'Bad Pitches'!$D$32","v":"m"}]
[112,{"$f":"Sticks!$A$57","v":12},{"$f":"Sticks!$D$1","v":"Sticks"},{"$f":"Sticks!$D$57","v":"Troy"},{"$f":"Sticks!$D$58","v":"Horne"},{"$f":"Sticks!$H$60","v":0.45454545454545453},{"$f":"Sticks!$H$57","v":11},{"$f":"Sticks!$F$8","v":4},"Y",{"$f":"Sticks!$H$58","v":5},{"$f":"Sticks!$H$59","v":12},{"$f":"Sticks!$D$60","v":"m"}]
[59,{"$f":"'Ghetto Bombers'!$A$45","v":9},{"$f":"'Ghetto Bombers'!$D$1","v":"Ghetto Bombers"},{"$f":"'Ghetto Bombers'!$D$45","v":"Dave"},{"$f":"'Ghetto Bombers'!$D$46","v":"Vu"},{"$f":"'Ghetto Bombers'!$H$48","v":0.44444444444444442},{"$f":"'Ghetto Bombers'!$H$45","v":9},{"$f":"'Ghetto Bombers'!$F$8","v":4},"Y",{"$f":"'Ghetto Bombers'!$H$46","v":4},{"$f":"'Ghetto Bombers'!$H$47","v":13},{"$f":"'Ghetto Bombers'!$D$48","v":"m"}]
[57,{"$f":"'Ghetto Bombers'!$A$37","v":7},{"$f":"'Ghetto Bombers'!$D$1","v":"Ghetto Bombers"},{"$f":"'Ghetto Bombers'!$D$37","v":"Derek"},{"$f":"'Ghetto Bombers'!$D$38","v":"Smith"},{"$f":"'Ghetto Bombers'!$H$40","v":0.42857142857142855},{"$f":"'Ghetto Bombers'!$H$37","v":14},{"$f":"'Ghetto Bombers'!$F$8","v":4},"Y",{"$f":"'Ghetto Bombers'!$H$38","v":6},{"$f":"'Ghetto Bombers'!$H$39","v":14},{"$f":"'Ghetto Bombers'!$D$40","v":"m"}]
[32,{"$f":"BCBC!$A$37","v":7},{"$f":"BCBC!$D$1","v":"BCBC"},{"$f":"BCBC!$D$37","v":"Jeff"},{"$f":"BCBC!$D$38","v":"Nielsen"},{"$f":"BCBC!$H$40","v":0.30769230769230771},{"$f":"BCBC!$H$37","v":13},{"$f":"BCBC!$F$8","v":4},"Y",{"$f":"BCBC!$H$38","v":4},{"$f":"BCBC!$H$39","v":15},{"$f":"BCBC!$D$40","v":"m"}]
[138,{"$f":"'Team 6'!$A$61","v":13},{"$f":"'Team 6'!$D$1","v":"Team 6"},{"$f":"'Team 6'!$D$61","v":0},{"$f":"'Team 6'!$D$62","v":0},{"$f":"'Team 6'!$H$64","v":""},{"$f":"'Team 6'!$H$61","v":0},{"$f":"'Team 6'!$F$8","v":8},"N",{"$f":"'Team 6'!$H$62","v":0},{"$f":"'Team 6'!$H$63","v":0},{"$f":"'Team 6'!$D$64","v":"m"}]
[19,{"$f":"'Bad Pitches'!$A$85","v":19},{"$f":"'Bad Pitches'!$D$1","v":"Bad Pitches"},{"$f":"'Bad Pitches'!$D$85","v":0},{"$f":"'Bad Pitches'!$D$86","v":0},{"$f":"'Bad Pitches'!$H$88","v":""},{"$f":"'Bad Pitches'!$H$85","v":0},{"$f":"'Bad Pitches'!$F$8","v":3},"N",{"$f":"'Bad Pitches'!$H$86","v":0},{"$f":"'Bad Pitches'!$H$87","v":0},{"$f":"'Bad Pitches'!$D$88","v":"m"}]
[18,{"$f":"'Bad Pitches'!$A$81","v":18},{"$f":"'Bad Pitches'!$D$1","v":"Bad Pitches"},{"$f":"'Bad Pitches'!$D$81","v":0},{"$f":"'Bad Pitches'!$D$82","v":0},{"$f":"'Bad Pitches'!$H$84","v":""},{"$f":"'Bad Pitches'!$H$81","v":0},{"$f":"'Bad Pitches'!$F$8","v":3},"N",{"$f":"'Bad Pitches'!$H$82","v":0},{"$f":"'Bad Pitches'!$H$83","v":0},{"$f":"'Bad Pitches'!$D$84","v":"m"}]
[119,{"$f":"Sticks!$A$85","v":19},{"$f":"Sticks!$D$1","v":"Sticks"},{"$f":"Sticks!$D$85","v":0},{"$f":"Sticks!$D$86","v":0},{"$f":"Sticks!$H$88","v":""},{"$f":"Sticks!$H$85","v":0},{"$f":"Sticks!$F$8","v":4},"N",{"$f":"Sticks!$H$86","v":0},{"$f":"Sticks!$H$87","v":0},{"$f":"Sticks!$D$88","v":"m"}]
[121,{"$f":"Sticks!$A$93","v":21},{"$f":"Sticks!$D$1","v":"Sticks"},{"$f":"Sticks!$D$93","v":0},{"$f":"Sticks!$D$94","v":0},{"$f":"Sticks!$H$96","v":""},{"$f":"Sticks!$H$93","v":0},{"$f":"Sticks!$F$8","v":4},"N",{"$f":"Sticks!$H$94","v":0},{"$f":"Sticks!$H$95","v":0},{"$f":"Sticks!$D$96","v":"m"}]
[147,{"$f":"'Team 6'!$A$97","v":22},{"$f":"'Team 6'!$D$1","v":"Team 6"},{"$f":"'Team 6'!$D$97","v":0},{"$f":"'Team 6'!$D$98","v":0},{"$f":"'Team 6'!$H$100","v":""},{"$f":"'Team 6'!$H$97","v":0},{"$f":"'Team 6'!$F$8","v":8},"N",{"$f":"'Team 6'!$H$98","v":0},{"$f":"'Team 6'!$H$99","v":0},{"$f":"'Team 6'!$D$100","v":"m"}]
[92,{"$f":"'Hit Squad'!$A$77","v":17},{"$f":"'Hit Squad'!$D$1","v":"Hit Squad"},{"$f":"'Hit Squad'!$D$77","v":0},{"$f":"'Hit Squad'!$D$78","v":0},{"$f":"'Hit Squad'!$H$80","v":""},{"$f":"'Hit Squad'!$H$77","v":0},{"$f":"'Hit Squad'!$F$8","v":3},"N",{"$f":"'Hit Squad'!$H$78","v":0},{"$f":"'Hit Squad'!$H$79","v":0},{"$f":"'Hit Squad'!$D$80","v":"m"}]
[144,{"$f":"'Team 6'!$A$85","v":19},{"$f":"'Team 6'!$D$1","v":"Team 6"},{"$f":"'Team 6'!$D$85","v":0},{"$f":"'Team 6'!$D$86","v":0},{"$f":"'Team 6'!$H$88","v":""},{"$f":"'Team 6'!$H$85","v":0},{"$f":"'Team 6'!$F$8","v":8},"N",{"$f":"'Team 6'!$H$86","v":0},{"$f":"'Team 6'!$H$87","v":0},{"$f":"'Team 6'!$D$88","v":"m"}]
[142,{"$f":"'Team 6'!$A$77","v":17},{"$f":"'Team 6'!$D$1","v":"Team 6"},{"$f":"'Team 6'!$D$77","v":0},{"$f":"'Team 6'!$D$78","v":0},{"$f":"'Team 6'!$H$80","v":""},{"$f":"'Team 6'!$H$77","v":0},{"$f":"'Team 6'!$F$8","v":8},{"$f":"IF(K34<(H34*2.5),\"N\",\"Y\")","v":"N"},{"$f":"'Team 6'!$H$78","v":0},{"$f":"'Team 6'!$H$79","v":0},{"$f":"'Team 6'!$D$80","v":"m"}]
[140,{"$f":"'Team 6'!$A$69","v":15},{"$f":"'Team 6'!$D$1","v":"Team 6"},{"$f":"'Team 6'!$D$69","v":0},{"$f":"'Team 6'!$D$70","v":0},{"$f":"'Team 6'!$H$72","v":""},{"$f":"'Team 6'!$H$69","v":0},{"$f":"'Team 6'!$F$8","v":8},"N",{"$f":"'Team 6'!$H$70","v":0},{"$f":"'Team 6'!$H$71","v":0},{"$f":"'Team 6'!$D$72","v":"m"}]
[146,{"$f":"'Team 6'!$A$93","v":21},{"$f":"'Team 6'!$D$1","v":"Team 6"},{"$f":"'Team 6'!$D$93","v":0},{"$f":"'Team 6'!$D$94","v":0},{"$f":"'Team 6'!$H$96","v":""},{"$f":"'Team 6'!$H$93","v":0},{"$f":"'Team 6'!$F$8","v":8},"N",{"$f":"'Team 6'!$H$94","v":0},{"$f":"'Team 6'!$H$95","v":0},{"$f":"'Team 6'!$D$96","v":"m"}]
[136,{"$f":"'Team 6'!$A$53","v":11},{"$f":"'Team 6'!$D$1","v":"Team 6"},{"$f":"'Team 6'!$D$53","v":0},{"$f":"'Team 6'!$D$54","v":0},{"$f":"'Team 6'!$H$56","v":""},{"$f":"'Team 6'!$H$53","v":0},{"$f":"'Team 6'!$F$8","v":8},"N",{"$f":"'Team 6'!$H$54","v":0},{"$f":"'Team 6'!$H$55","v":0},{"$f":"'Team 6'!$D$56","v":"m"}]
[116,{"$f":"Sticks!$A$73","v":16},{"$f":"Sticks!$D$1","v":"Sticks"},{"$f":"Sticks!$D$73","v":0},{"$f":"Sticks!$D$74","v":0},{"$f":"Sticks!$H$76","v":""},{"$f":"Sticks!$H$73","v":0},{"$f":"Sticks!$F$8","v":4},"N",{"$f":"Sticks!$H$74","v":0},{"$f":"Sticks!$H$75","v":0},{"$f":"Sticks!$D$76","v":"m"}]
[93,{"$f":"'Hit Squad'!$A$81","v":18},{"$f":"'Hit Squad'!$D$1","v":"Hit Squad"},{"$f":"'Hit Squad'!$D$81","v":0},{"$f":"'Hit Squad'!$D$82","v":0},{"$f":"'Hit Squad'!$H$84","v":""},{"$f":"'Hit Squad'!$H$81","v":0},{"$f":"'Hit Squad'!$F$8","v":3},"N",{"$f":"'Hit Squad'!$H$82","v":0},{"$f":"'Hit Squad'!$H$83","v":0},{"$f":"'Hit Squad'!$D$84","v":"m"}]
[149,{"$f":"'Team 6'!$A$105","v":24},{"$f":"'Team 6'!$D$1","v":"Team 6"},{"$f":"'Team 6'!$D$105","v":0},{"$f":"'Team 6'!$D$106","v":0},{"$f":"'Team 6'!$H$108","v":""},{"$f":"'Team 6'!$H$105","v":0},{"$f":"'Team 6'!$F$8","v":8},"N",{"$f":"'Team 6'!$H$106","v":0},{"$f":"'Team 6'!$H$107","v":0},{"$f":"'Team 6'!$D$108","v":"m"}]
[139,{"$f":"'Team 6'!$A$65","v":14},{"$f":"'Team 6'!$D$1","v":"Team 6"},{"$f":"'Team 6'!$D$65","v":0},{"$f":"'Team 6'!$D$66","v":0},{"$f":"'Team 6'!$H$68","v":""},{"$f":"'Team 6'!$H$65","v":0},{"$f":"'Team 6'!$F$8","v":8},"N",{"$f":"'Team 6'!$H$66","v":0},{"$f":"'Team 6'!$H$67","v":0},{"$f":"'Team 6'!$D$68","v":"m"}]
[14,{"$f":"'Bad Pitches'!$A$65","v":14},{"$f":"'Bad Pitches'!$D$1","v":"Bad Pitches"},{"$f":"'Bad Pitches'!$D$65","v":0},{"$f":"'Bad Pitches'!$D$66","v":0},{"$f":"'Bad Pitches'!$H$68","v":""},{"$f":"'Bad Pitches'!$H$65","v":0},{"$f":"'Bad Pitches'!$F$8","v":3},"N",{"$f":"'Bad Pitches'!$H$66","v":0},{"$f":"'Bad Pitches'!$H$67","v":0},{"$f":"'Bad Pitches'!$D$68","v":"m"}]
[71,{"$f":"'Ghetto Bombers'!$A$93","v":21},{"$f":"'Ghetto Bombers'!$D$1","v":"Ghetto Bombers"},{"$f":"'Ghetto Bombers'!$D$93","v":0},{"$f":"'Ghetto Bombers'!$D$94","v":0},{"$f":"'Ghetto Bombers'!$H$96","v":""},{"$f":"'Ghetto Bombers'!$H$93","v":0},{"$f":"'Ghetto Bombers'!$F$8","v":4},"N",{"$f":"'Ghetto Bombers'!$H$94","v":0},{"$f":"'Ghetto Bombers'!$H$95","v":0},{"$f":"'Ghetto Bombers'!$D$96","v":"m"}]
[42,{"$f":"BCBC!$A$77","v":17},{"$f":"BCBC!$D$1","v":"BCBC"},{"$f":"BCBC!$D$77","v":0},{"$f":"BCBC!$D$78","v":0},{"$f":"BCBC!$H$80","v":""},{"$f":"BCBC!$H$77","v":0},{"$f":"BCBC!$F$8","v":4},"N",{"$f":"BCBC!$H$78","v":0},{"$f":"BCBC!$H$79","v":0},{"$f":"BCBC!$D$80","v":"m"}]
[46,{"$f":"BCBC!$A$93","v":21},{"$f":"BCBC!$D$1","v":"BCBC"},{"$f":"BCBC!$D$93","v":0},{"$f":"BCBC!$D$94","v":0},{"$f":"BCBC!$H$96","v":""},{"$f":"BCBC!$H$93","v":0},{"$f":"BCBC!$F$8","v":4},"N",{"$f":"BCBC!$H$94","v":0},{"$f":"BCBC!$H$95","v":0},{"$f":"BCBC!$D$96","v":"m"}]
[48,{"$f":"BCBC!$A$101","v":23},{"$f":"BCBC!$D$1","v":"BCBC"},{"$f":"BCBC!$D$101","v":0},{"$f":"BCBC!$D$102","v":0},{"$f":"BCBC!$H$104","v":""},{"$f":"BCBC!$H$101","v":0},{"$f":"BCBC!$F$8","v":4},"N",{"$f":"BCBC!$H$102","v":0},{"$f":"BCBC!$H$103","v":0},{"$f":"BCBC!$D$104","v":"m"}]
[50,{"$f":"BCBC!$A$109","v":25},{"$f":"BCBC!$D$1","v":"BCBC"},{"$f":"BCBC!$D$109","v":0},{"$f":"BCBC!$D$110","v":0},{"$f":"BCBC!$H$112","v":""},{"$f":"BCBC!$H$109","v":0},{"$f":"BCBC!$F$8","v":4},"N",{"$f":"BCBC!$H$110","v":0},{"$f":"BCBC!$H$111","v":0},{"$f":"BCBC!$D$112","v":"m"}]
[69,{"$f":"'Ghetto Bombers'!$A$85","v":19},{"$f":"'Ghetto Bombers'!$D$1","v":"Ghetto Bombers"},{"$f":"'Ghetto Bombers'!$D$85","v":0},{"$f":"'Ghetto Bombers'!$D$86","v":0},{"$f":"'Ghetto Bombers'!$H$88","v":""},{"$f":"'Ghetto Bombers'!$H$85","v":0},{"$f":"'Ghetto Bombers'!$F$8","v":4},"N",{"$f":"'Ghetto Bombers'!$H$86","v":0},{"$f":"'Ghetto Bombers'!$H$87","v":0},{"$f":"'Ghetto Bombers'!$D$88","v":"m"}]
[44,{"$f":"BCBC!$A$85","v":19},{"$f":"BCBC!$D$1","v":"BCBC"},{"$f":"BCBC!$D$85","v":0},{"$f":"BCBC!$D$86","v":0},{"$f":"BCBC!$H$88","v":""},{"$f":"BCBC!$H$85","v":0},{"$f":"BCBC!$F$8","v":4},"N",{"$f":"BCBC!$H$86","v":0},{"$f":"BCBC!$H$87","v":0},{"$f":"BCBC!$D$88","v":"m"}]
[67,{"$f":"'Ghetto Bombers'!$A$77","v":17},{"$f":"'Ghetto Bombers'!$D$1","v":"Ghetto Bombers"},{"$f":"'Ghetto Bombers'!$D$77","v":0},{"$f":"'Ghetto Bombers'!$D$78","v":0},{"$f":"'Ghetto Bombers'!$H$80","v":""},{"$f":"'Ghetto Bombers'!$H$77","v":0},{"$f":"'Ghetto Bombers'!$F$8","v":4},"N",{"$f":"'Ghetto Bombers'!$H$78","v":0},{"$f":"'Ghetto Bombers'!$H$79","v":0},{"$f":"'Ghetto Bombers'!$D$80","v":"m"}]
[40,{"$f":"BCBC!$A$69","v":15},{"$f":"BCBC!$D$1","v":"BCBC"},{"$f":"BCBC!$D$69","v":"Vinnie"},{"$f":"BCBC!$D$70","v":"Dilworth"},{"$f":"BCBC!$H$72","v":1},{"$f":"BCBC!$H$69","v":4},{"$f":"BCBC!$F$8","v":4},"N",{"$f":"BCBC!$H$70","v":4},{"$f":"BCBC!$H$71","v":5},{"$f":"BCBC!$D$72","v":"m"}]
[66,{"$f":"'Ghetto Bombers'!$A$73","v":16},{"$f":"'Ghetto Bombers'!$D$1","v":"Ghetto Bombers"},{"$f":"'Ghetto Bombers'!$D$73","v":"Matt"},{"$f":"'Ghetto Bombers'!$D$74","v":"Newbold"},{"$f":"'Ghetto Bombers'!$H$76","v":1},{"$f":"'Ghetto Bombers'!$H$73","v":1},{"$f":"'Ghetto Bombers'!$F$8","v":4},"N",{"$f":"'Ghetto Bombers'!$H$74","v":1},{"$f":"'Ghetto Bombers'!$H$75","v":1},{"$f":"'Ghetto Bombers'!$D$76","v":"m"}]
[91,{"$f":"'Hit Squad'!$A$73","v":16},{"$f":"'Hit Squad'!$D$1","v":"Hit Squad"},{"$f":"'Hit Squad'!$D$73","v":"Lars"},{"$f":"'Hit Squad'!$D$74","v":"Peterson"},{"$f":"'Hit Squad'!$H$76","v":1},{"$f":"'Hit Squad'!$H$73","v":2},{"$f":"'Hit Squad'!$F$8","v":3},"N",{"$f":"'Hit Squad'!$H$74","v":2},{"$f":"'Hit Squad'!$H$75","v":2},{"$f":"'Hit Squad'!$D$76","v":"m"}]
[78,{"$f":"'Hit Squad'!$A$21","v":3},{"$f":"'Hit Squad'!$D$1","v":"Hit Squad"},{"$f":"'Hit Squad'!$D$21","v":"David"},{"$f":"'Hit Squad'!$D$22","v":"Stevens"},{"$f":"'Hit Squad'!$H$24","v":0.7142857142857143},{"$f":"'Hit Squad'!$H$21","v":7},{"$f":"'Hit Squad'!$F$8","v":3},"N",{"$f":"'Hit Squad'!$H$22","v":5},{"$f":"'Hit Squad'!$H$23","v":7},{"$f":"'Hit Squad'!$D$24","v":"m"}]
[84,{"$f":"'Hit Squad'!$A$45","v":9},{"$f":"'Hit Squad'!$D$1","v":"Hit Squad"},{"$f":"'Hit Squad'!$D$45","v":"Chris"},{"$f":"'Hit Squad'!$D$46","v":"Schippers"},{"$f":"'Hit Squad'!$H$48","v":0.7142857142857143},{"$f":"'Hit Squad'!$H$45","v":7},{"$f":"'Hit Squad'!$F$8","v":3},"N",{"$f":"'Hit Squad'!$H$46","v":5},{"$f":"'Hit Squad'!$H$47","v":7},{"$f":"'Hit Squad'!$D$48","v":"m"}]
[61,{"$f":"'Ghetto Bombers'!$A$53","v":11},{"$f":"'Ghetto Bombers'!$D$1","v":"Ghetto Bombers"},{"$f":"'Ghetto Bombers'!$D$53","v":"Tyler"},{"$f":"'Ghetto Bombers'!$D$54","v":"Curtis"},{"$f":"'Ghetto Bombers'!$H$56","v":0.66666666666666663},{"$f":"'Ghetto Bombers'!$H$53","v":3},{"$f":"'Ghetto Bombers'!$F$8","v":4},"N",{"$f":"'Ghetto Bombers'!$H$54","v":2},{"$f":"'Ghetto Bombers'!$H$55","v":3},{"$f":"'Ghetto Bombers'!$D$56","v":"m"}]
[38,{"$f":"BCBC!$A$61","v":13},{"$f":"BCBC!$D$1","v":"BCBC"},{"$f":"BCBC!$D$61","v":"Scotty"},{"$f":"BCBC!$D$62","v":"Garfield"},{"$f":"BCBC!$H$64","v":0.5},{"$f":"BCBC!$H$61","v":2},{"$f":"BCBC!$F$8","v":4},"N",{"$f":"BCBC!$H$62","v":1},{"$f":"BCBC!$H$63","v":2},{"$f":"BCBC!$D$64","v":"m"}]
[80,{"$f":"'Hit Squad'!$A$29","v":5},{"$f":"'Hit Squad'!$D$1","v":"Hit Squad"},{"$f":"'Hit Squad'!$D$29","v":"Jeff"},{"$f":"'Hit Squad'!$D$30","v":"Snedekar"},{"$f":"'Hit Squad'!$H$32","v":0.4},{"$f":"'Hit Squad'!$H$29","v":5},{"$f":"'Hit Squad'!$F$8","v":3},"N",{"$f":"'Hit Squad'!$H$30","v":2},{"$f":"'Hit Squad'!$H$31","v":5},{"$f":"'Hit Squad'!$D$32","v":"m"}]
[86,{"$f":"'Hit Squad'!$A$53","v":11},{"$f":"'Hit Squad'!$D$1","v":"Hit Squad"},{"$f":"'Hit Squad'!$D$53","v":"Dan "},{"$f":"'Hit Squad'!$D$54","v":"Stevens"},{"$f":"'Hit Squad'!$H$56","v":0.33333333333333331},{"$f":"'Hit Squad'!$H$53","v":6},{"$f":"'Hit Squad'!$F$8","v":3},"N",{"$f":"'Hit Squad'!$H$54","v":2},{"$f":"'Hit Squad'!$H$55","v":6},{"$f":"'Hit Squad'!$D$56","v":"m"}]
[82,{"$f":"'Hit Squad'!$A$37","v":7},{"$f":"'Hit Squad'!$D$1","v":"Hit Squad"},{"$f":"'Hit Squad'!$D$37","v":"Dusty"},{"$f":"'Hit Squad'!$D$38","v":"Jorgenson"},{"$f":"'Hit Squad'!$H$40","v":0.14285714285714285},{"$f":"'Hit Squad'!$H$37","v":7},{"$f":"'Hit Squad'!$F$8","v":3},"N",{"$f":"'Hit Squad'!$H$38","v":1},{"$f":"'Hit Squad'!$H$39","v":7},{"$f":"'Hit Squad'!$D$40","v":"m"}]
[201,{"$f":"'Team 7'!$A$13","v":1},{"$f":"'Team 7'!$D$1","v":" "},{"$f":"'Team 7'!$D$13","v":"Bob"},{"$f":"'Team 7'!$D$14","v":0},{"$f":"'Team 7'!$H$16","v":0},{"$f":"'Team 7'!$H$13","v":10},{"$f":"'Team 7'!$F$8","v":8},"N",{"$f":"'Team 7'!$H$14","v":0},{"$f":"'Team 7'!$H$15","v":10},{"$f":"'Team 7'!$D$16","v":"m"}]
[205,{"$f":"'Team 7'!$A$29","v":5},{"$f":"'Team 7'!$D$1","v":" "},{"$f":"'Team 7'!$D$29","v":"Mark"},{"$f":"'Team 7'!$D$30","v":0},{"$f":"'Team 7'!$H$32","v":0},{"$f":"'Team 7'!$H$29","v":10},{"$f":"'Team 7'!$F$8","v":8},"N",{"$f":"'Team 7'!$H$30","v":0},{"$f":"'Team 7'!$H$31","v":10},{"$f":"'Team 7'!$D$32","v":"m"}]
[126,{"$f":"'Team 6'!$A$13","v":1},{"$f":"'Team 6'!$D$1","v":"Team 6"},{"$f":"'Team 6'!$D$13","v":"John"},{"$f":"'Team 6'!$D$14","v":0},{"$f":"'Team 6'!$H$16","v":0},{"$f":"'Team 6'!$H$13","v":10},{"$f":"'Team 6'!$F$8","v":8},"N",{"$f":"'Team 6'!$H$14","v":0},{"$f":"'Team 6'!$H$15","v":10},{"$f":"'Team 6'!$D$16","v":"m"}]
[132,{"$f":"'Team 6'!$A$37","v":7},{"$f":"'Team 6'!$D$1","v":"Team 6"},{"$f":"'Team 6'!$D$37","v":"Trent"},{"$f":"'Team 6'!$D$38","v":0},{"$f":"'Team 6'!$H$40","v":0},{"$f":"'Team 6'!$H$37","v":10},{"$f":"'Team 6'!$F$8","v":8},"N",{"$f":"'Team 6'!$H$38","v":0},{"$f":"'Team 6'!$H$39","v":10},{"$f":"'Team 6'!$D$40","v":"m"}]
[209,{"$f":"'Team 7'!$A$45","v":9},{"$f":"'Team 7'!$D$1","v":" "},{"$f":"'Team 7'!$D$45","v":"George"},{"$f":"'Team 7'!$D$46","v":0},{"$f":"'Team 7'!$H$48","v":0},{"$f":"'Team 7'!$H$45","v":10},{"$f":"'Team 7'!$F$8","v":8},"N",{"$f":"'Team 7'!$H$46","v":0},{"$f":"'Team 7'!$H$47","v":10},{"$f":"'Team 7'!$D$48","v":"m"}]
[130,{"$f":"'Team 6'!$A$29","v":5},{"$f":"'Team 6'!$D$1","v":"Team 6"},{"$f":"'Team 6'!$D$29","v":"Mike"},{"$f":"'Team 6'!$D$30","v":0},{"$f":"'Team 6'!$H$32","v":0},{"$f":"'Team 6'!$H$29","v":10},{"$f":"'Team 6'!$F$8","v":8},{"$f":"IF(K66<(H66*2.5),\"N\",\"Y\")","v":"N"},{"$f":"'Team 6'!$H$30","v":0},{"$f":"'Team 6'!$H$31","v":10},{"$f":"'Team 6'!$D$32","v":"m"}]
[203,{"$f":"'Team 7'!$A$21","v":3},{"$f":"'Team 7'!$D$1","v":" "},{"$f":"'Team 7'!$D$21","v":"Cam"},{"$f":"'Team 7'!$D$22","v":0},{"$f":"'Team 7'!$H$24","v":0},{"$f":"'Team 7'!$H$21","v":10},{"$f":"'Team 7'!$F$8","v":8},"N",{"$f":"'Team 7'!$H$22","v":0},{"$f":"'Team 7'!$H$23","v":10},{"$f":"'Team 7'!$D$24","v":"m"}]
[207,{"$f":"'Team 7'!$A$37","v":7},{"$f":"'Team 7'!$D$1","v":" "},{"$f":"'Team 7'!$D$37","v":"Kent"},{"$f":"'Team 7'!$D$38","v":0},{"$f":"'Team 7'!$H$40","v":0},{"$f":"'Team 7'!$H$37","v":10},{"$f":"'Team 7'!$F$8","v":8},"N",{"$f":"'Team 7'!$H$38","v":0},{"$f":"'Team 7'!$H$39","v":10},{"$f":"'Team 7'!$D$40","v":"m"}]
[185,{"$f":"'Team 8'!$A$49","v":10},{"$f":"'Team 8'!$D$1","v":" "},{"$f":"'Team 8'!$D$49","v":"Paul"},{"$f":"'Team 8'!$D$50","v":0},{"$f":"'Team 8'!$H$52","v":0},{"$f":"'Team 8'!$H$49","v":10},{"$f":"'Team 8'!$F$8","v":8},"N",{"$f":"'Team 8'!$H$50","v":0},{"$f":"'Team 8'!$H$51","v":10},{"$f":"'Team 8'!$D$52","v":"m"}]
[179,{"$f":"'Team 8'!$A$25","v":4},{"$f":"'Team 8'!$D$1","v":" "},{"$f":"'Team 8'!$D$25","v":"Dallen"},{"$f":"'Team 8'!$D$26","v":0},{"$f":"'Team 8'!$H$28","v":0},{"$f":"'Team 8'!$H$25","v":10},{"$f":"'Team 8'!$F$8","v":8},"N",{"$f":"'Team 8'!$H$26","v":0},{"$f":"'Team 8'!$H$27","v":10},{"$f":"'Team 8'!$D$28","v":"m"}]
[183,{"$f":"'Team 8'!$A$41","v":8},{"$f":"'Team 8'!$D$1","v":" "},{"$f":"'Team 8'!$D$41","v":"Jeff"},{"$f":"'Team 8'!$D$42","v":0},{"$f":"'Team 8'!$H$44","v":0},{"$f":"'Team 8'!$H$41","v":10},{"$f":"'Team 8'!$F$8","v":8},"N",{"$f":"'Team 8'!$H$42","v":0},{"$f":"'Team 8'!$H$43","v":10},{"$f":"'Team 8'!$D$44","v":"m"}]
[181,{"$f":"'Team 8'!$A$33","v":6},{"$f":"'Team 8'!$D$1","v":" "},{"$f":"'Team 8'!$D$33","v":"Jack"},{"$f":"'Team 8'!$D$34","v":0},{"$f":"'Team 8'!$H$36","v":0},{"$f":"'Team 8'!$H$33","v":10},{"$f":"'Team 8'!$F$8","v":8},"N",{"$f":"'Team 8'!$H$34","v":0},{"$f":"'Team 8'!$H$35","v":10},{"$f":"'Team 8'!$D$36","v":"m"}]
[177,{"$f":"'Team 8'!$A$17","v":2},{"$f":"'Team 8'!$D$1","v":" "},{"$f":"'Team 8'!$D$17","v":"David"},{"$f":"'Team 8'!$D$18","v":0},{"$f":"'Team 8'!$H$20","v":0},{"$f":"'Team 8'!$H$17","v":10},{"$f":"'Team 8'!$F$8","v":8},"N",{"$f":"'Team 8'!$H$18","v":0},{"$f":"'Team 8'!$H$19","v":10},{"$f":"'Team 8'!$D$20","v":"m"}]
[128,{"$f":"'Team 6'!$A$21","v":3},{"$f":"'Team 6'!$D$1","v":"Team 6"},{"$f":"'Team 6'!$D$21","v":"Ron"},{"$f":"'Team 6'!$D$22","v":0},{"$f":"'Team 6'!$H$24","v":0},{"$f":"'Team 6'!$H$21","v":10},{"$f":"'Team 6'!$F$8","v":8},"N",{"$f":"'Team 6'!$H$22","v":0},{"$f":"'Team 6'!$H$23","v":10},{"$f":"'Team 6'!$D$24","v":"m"}]
[134,{"$f":"'Team 6'!$A$45","v":9},{"$f":"'Team 6'!$D$1","v":"Team 6"},{"$f":"'Team 6'!$D$45","v":"Isaac"},{"$f":"'Team 6'!$D$46","v":0},{"$f":"'Team 6'!$H$48","v":0},{"$f":"'Team 6'!$H$45","v":10},{"$f":"'Team 6'!$F$8","v":8},"N",{"$f":"'Team 6'!$H$46","v":0},{"$f":"'Team 6'!$H$47","v":10},{"$f":"'Team 6'!$D$48","v":"m"}]
[11,{"$f":"'Bad Pitches'!$A$53","v":11},{"$f":"'Bad Pitches'!$D$1","v":"Bad Pitches"},{"$f":"'Bad Pitches'!$D$53","v":"Seth"},{"$f":"'Bad Pitches'!$D$54","v":"Kaelin"},{"$f":"'Bad Pitches'!$H$56","v":0},{"$f":"'Bad Pitches'!$H$53","v":4},{"$f":"'Bad Pitches'!$F$8","v":3},"N",{"$f":"'Bad Pitches'!$H$54","v":0},{"$f":"'Bad Pitches'!$H$55","v":4},{"$f":"'Bad Pitches'!$D$56","v":"m"}]
[64,{"$f":"'Ghetto Bombers'!$A$65","v":14},{"$f":"'Ghetto Bombers'!$D$1","v":"Ghetto Bombers"},{"$f":"'Ghetto Bombers'!$D$65","v":"Alllie"},{"$f":"'Ghetto Bombers'!$D$66","v":"Newbold"},{"$f":"'Ghetto Bombers'!$H$68","v":0},{"$f":"'Ghetto Bombers'!$H$65","v":4},{"$f":"'Ghetto Bombers'!$F$8","v":4},"N",{"$f":"'Ghetto Bombers'!$H$66","v":0},{"$f":"'Ghetto Bombers'!$H$67","v":4},{"$f":"'Ghetto Bombers'!$D$68","v":"m"}]
[8,{"$f":"'Bad Pitches'!$A$41","v":8},{"$f":"'Bad Pitches'!$D$1","v":"Bad Pitches"},{"$f":"'Bad Pitches'!$D$41","v":"Calliane"},{"$f":"'Bad Pitches'!$D$42","v":"Hodson"},{"$f":"'Bad Pitches'!$H$44","v":0.875},{"$f":"'Bad Pitches'!$H$41","v":8},{"$f":"'Bad Pitches'!$F$8","v":3},"Y",{"$f":"'Bad Pitches'!$H$42","v":7},{"$f":"'Bad Pitches'!$H$43","v":8},{"$f":"'Bad Pitches'!$D$44","v":"f"}]
[52,{"$f":"'Ghetto Bombers'!$A$17","v":2},{"$f":"'Ghetto Bombers'!$D$1","v":"Ghetto Bombers"},{"$f":"'Ghetto Bombers'!$D$17","v":"Calleigh"},{"$f":"'Ghetto Bombers'!$D$18","v":"DeYoung"},{"$f":"'Ghetto Bombers'!$H$20","v":0.875},{"$f":"'Ghetto Bombers'!$H$17","v":8},{"$f":"'Ghetto Bombers'!$F$8","v":4},"Y",{"$f":"'Ghetto Bombers'!$H$18","v":7},{"$f":"'Ghetto Bombers'!$H$19","v":12},{"$f":"'Ghetto Bombers'!$D$20","v":"f"}]
[29,{"$f":"BCBC!$A$25","v":4},{"$f":"BCBC!$D$1","v":"BCBC"},{"$f":"BCBC!$D$25","v":"Maree"},{"$f":"BCBC!$D$26","v":"Achermann"},{"$f":"BCBC!$H$28","v":0.625},{"$f":"BCBC!$H$25","v":16},{"$f":"BCBC!$F$8","v":4},"Y",{"$f":"BCBC!$H$26","v":10},{"$f":"BCBC!$H$27","v":16},{"$f":"BCBC!$D$28","v":"f"}]
[31,{"$f":"BCBC!$A$33","v":6},{"$f":"BCBC!$D$1","v":"BCBC"},{"$f":"BCBC!$D$33","v":"Sunni"},{"$f":"BCBC!$D$34","v":"Jackson"},{"$f":"BCBC!$H$36","v":0.5714285714285714},{"$f":"BCBC!$H$33","v":14},{"$f":"BCBC!$F$8","v":4},"Y",{"$f":"BCBC!$H$34","v":8},{"$f":"BCBC!$H$35","v":15},{"$f":"BCBC!$D$36","v":"f"}]
[37,{"$f":"BCBC!$A$57","v":12},{"$f":"BCBC!$D$1","v":"BCBC"},{"$f":"BCBC!$D$57","v":"Mel"},{"$f":"BCBC!$D$58","v":"Maile"},{"$f":"BCBC!$H$60","v":0.53846153846153844},{"$f":"BCBC!$H$57","v":13},{"$f":"BCBC!$F$8","v":4},"Y",{"$f":"BCBC!$H$58","v":7},{"$f":"BCBC!$H$59","v":13},{"$f":"BCBC!$D$60","v":"f"}]
[33,{"$f":"BCBC!$A$41","v":8},{"$f":"BCBC!$D$1","v":"BCBC"},{"$f":"BCBC!$D$41","v":"Casey"},{"$f":"BCBC!$D$42","v":"Velarde"},{"$f":"BCBC!$H$44","v":0.5},{"$f":"BCBC!$H$41","v":10},{"$f":"BCBC!$F$8","v":4},"Y",{"$f":"BCBC!$H$42","v":5},{"$f":"BCBC!$H$43","v":10},{"$f":"BCBC!$D$44","v":"f"}]
[101,{"$f":"Sticks!$A$13","v":1},{"$f":"Sticks!$D$1","v":"Sticks"},{"$f":"Sticks!$D$13","v":"Kacee"},{"$f":"Sticks!$D$14","v":"Robinson"},{"$f":"Sticks!$H$16","v":0.46666666666666667},{"$f":"Sticks!$H$13","v":15},{"$f":"Sticks!$F$8","v":4},"Y",{"$f":"Sticks!$H$14","v":7},{"$f":"Sticks!$H$15","v":16},{"$f":"Sticks!$D$16","v":"f"}]
[58,{"$f":"'Ghetto Bombers'!$A$41","v":8},{"$f":"'Ghetto Bombers'!$D$1","v":"Ghetto Bombers"},{"$f":"'Ghetto Bombers'!$D$41","v":"Brandi"},{"$f":"'Ghetto Bombers'!$D$42","v":"Hall"},{"$f":"'Ghetto Bombers'!$H$44","v":0.46153846153846156},{"$f":"'Ghetto Bombers'!$H$41","v":13},{"$f":"'Ghetto Bombers'!$F$8","v":4},"Y",{"$f":"'Ghetto Bombers'!$H$42","v":6},{"$f":"'Ghetto Bombers'!$H$43","v":13},{"$f":"'Ghetto Bombers'!$D$44","v":"f"}]
[39,{"$f":"BCBC!$A$65","v":14},{"$f":"BCBC!$D$1","v":"BCBC"},{"$f":"BCBC!$D$65","v":"Tiffany"},{"$f":"BCBC!$D$66","v":"Morton"},{"$f":"BCBC!$H$68","v":0.36363636363636365},{"$f":"BCBC!$H$65","v":11},{"$f":"BCBC!$F$8","v":4},"Y",{"$f":"BCBC!$H$66","v":4},{"$f":"BCBC!$H$67","v":11},{"$f":"BCBC!$D$68","v":"f"}]
[35,{"$f":"BCBC!$A$49","v":10},{"$f":"BCBC!$D$1","v":"BCBC"},{"$f":"BCBC!$D$49","v":"Robyne"},{"$f":"BCBC!$D$50","v":"Oostveen"},{"$f":"BCBC!$H$52","v":0.35714285714285715},{"$f":"BCBC!$H$49","v":14},{"$f":"BCBC!$F$8","v":4},"Y",{"$f":"BCBC!$H$50","v":5},{"$f":"BCBC!$H$51","v":14},{"$f":"BCBC!$D$52","v":"f"}]
[6,{"$f":"'Bad Pitches'!$A$33","v":6},{"$f":"'Bad Pitches'!$D$1","v":"Bad Pitches"},{"$f":"'Bad Pitches'!$D$33","v":"Paige"},{"$f":"'Bad Pitches'!$D$34","v":"Reynolds"},{"$f":"'Bad Pitches'!$H$36","v":0.33333333333333331},{"$f":"'Bad Pitches'!$H$33","v":12},{"$f":"'Bad Pitches'!$F$8","v":3},"Y",{"$f":"'Bad Pitches'!$H$34","v":4},{"$f":"'Bad Pitches'!$H$35","v":12},{"$f":"'Bad Pitches'!$D$36","v":"f"}]
[107,{"$f":"Sticks!$A$37","v":7},{"$f":"Sticks!$D$1","v":"Sticks"},{"$f":"Sticks!$D$37","v":"Shar"},{"$f":"Sticks!$D$38","v":"Norton"},{"$f":"Sticks!$H$40","v":0.33333333333333331},{"$f":"Sticks!$H$37","v":12},{"$f":"Sticks!$F$8","v":4},"Y",{"$f":"Sticks!$H$38","v":4},{"$f":"Sticks!$H$39","v":13},{"$f":"Sticks!$D$40","v":"f"}]
[54,{"$f":"'Ghetto Bombers'!$A$25","v":4},{"$f":"'Ghetto Bombers'!$D$1","v":"Ghetto Bombers"},{"$f":"'Ghetto Bombers'!$D$25","v":"JoJo"},{"$f":"'Ghetto Bombers'!$D$26","v":"Carlson"},{"$f":"'Ghetto Bombers'!$H$28","v":0.3125},{"$f":"'Ghetto Bombers'!$H$25","v":16},{"$f":"'Ghetto Bombers'!$F$8","v":4},"Y",{"$f":"'Ghetto Bombers'!$H$26","v":5},{"$f":"'Ghetto Bombers'!$H$27","v":16},{"$f":"'Ghetto Bombers'!$D$28","v":"f"}]
[2,{"$f":"'Bad Pitches'!$A$17","v":2},{"$f":"'Bad Pitches'!$D$1","v":"Bad Pitches"},{"$f":"'Bad Pitches'!$D$17","v":"Tayce"},{"$f":"'Bad Pitches'!$D$18","v":"Shamo"},{"$f":"'Bad Pitches'!$H$20","v":0.30769230769230771},{"$f":"'Bad Pitches'!$H$17","v":13},{"$f":"'Bad Pitches'!$F$8","v":3},"Y",{"$f":"'Bad Pitches'!$H$18","v":4},{"$f":"'Bad Pitches'!$H$19","v":13},{"$f":"'Bad Pitches'!$D$20","v":"f"}]
[62,{"$f":"'Ghetto Bombers'!$A$57","v":12},{"$f":"'Ghetto Bombers'!$D$1","v":"Ghetto Bombers"},{"$f":"'Ghetto Bombers'!$D$57","v":"Ali"},{"$f":"'Ghetto Bombers'!$D$58","v":"Smith"},{"$f":"'Ghetto Bombers'!$H$60","v":0.27272727272727271},{"$f":"'Ghetto Bombers'!$H$57","v":11},{"$f":"'Ghetto Bombers'!$F$8","v":4},"Y",{"$f":"'Ghetto Bombers'!$H$58","v":3},{"$f":"'Ghetto Bombers'!$H$59","v":13},{"$f":"'Ghetto Bombers'!$D$60","v":"f"}]
[103,{"$f":"Sticks!$A$21","v":3},{"$f":"Sticks!$D$1","v":"Sticks"},{"$f":"Sticks!$D$21","v":"Whitney"},{"$f":"Sticks!$D$22","v":"Larson"},{"$f":"Sticks!$H$24","v":0.25},{"$f":"Sticks!$H$21","v":12},{"$f":"Sticks!$F$8","v":4},"Y",{"$f":"Sticks!$H$22","v":3},{"$f":"Sticks!$H$23","v":12},{"$f":"Sticks!$D$24","v":"f"}]
[4,{"$f":"'Bad Pitches'!$A$25","v":4},{"$f":"'Bad Pitches'!$D$1","v":"Bad Pitches"},{"$f":"'Bad Pitches'!$D$25","v":"Stephanie"},{"$f":"'Bad Pitches'!$D$26","v":"Bonham"},{"$f":"'Bad Pitches'!$H$28","v":0.25},{"$f":"'Bad Pitches'!$H$25","v":12},{"$f":"'Bad Pitches'!$F$8","v":3},"Y",{"$f":"'Bad Pitches'!$H$26","v":3},{"$f":"'Bad Pitches'!$H$27","v":12},{"$f":"'Bad Pitches'!$D$28","v":"f"}]
[111,{"$f":"Sticks!$A$53","v":11},{"$f":"Sticks!$D$1","v":"Sticks"},{"$f":"Sticks!$D$53","v":"Melinda"},{"$f":"Sticks!$D$54","v":"Adams"},{"$f":"Sticks!$H$56","v":0.2},{"$f":"Sticks!$H$53","v":10},{"$f":"Sticks!$F$8","v":4},"Y",{"$f":"Sticks!$H$54","v":2},{"$f":"Sticks!$H$55","v":12},{"$f":"Sticks!$D$56","v":"f"}]
[56,{"$f":"'Ghetto Bombers'!$A$33","v":6},{"$f":"'Ghetto Bombers'!$D$1","v":"Ghetto Bombers"},{"$f":"'Ghetto Bombers'!$D$33","v":"Angela"},{"$f":"'Ghetto Bombers'!$D$34","v":"Ahmadpour"},{"$f":"'Ghetto Bombers'!$H$36","v":0.1},{"$f":"'Ghetto Bombers'!$H$33","v":10},{"$f":"'Ghetto Bombers'!$F$8","v":4},"Y",{"$f":"'Ghetto Bombers'!$H$34","v":1},{"$f":"'Ghetto Bombers'!$H$35","v":10},{"$f":"'Ghetto Bombers'!$D$36","v":"f"}]
[137,{"$f":"'Team 6'!$A$57","v":12},{"$f":"'Team 6'!$D$1","v":"Team 6"},{"$f":"'Team 6'!$D$57","v":0},{"$f":"'Team 6'!$D$58","v":0},{"$f":"'Team 6'!$H$60","v":""},{"$f":"'Team 6'!$H$57","v":0},{"$f":"'Team 6'!$F$8","v":8},"N",{"$f":"'Team 6'!$H$58","v":0},{"$f":"'Team 6'!$H$59","v":0},{"$f":"'Team 6'!$D$60","v":"f"}]
[216,{"$f":"'Team 7'!$A$73","v":16},{"$f":"'Team 7'!$D$1","v":" "},{"$f":"'Team 7'!$D$73","v":0},{"$f":"'Team 7'!$D$74","v":0},{"$f":"'Team 7'!$H$76","v":""},{"$f":"'Team 7'!$H$73","v":0},{"$f":"'Team 7'!$F$8","v":8},{"$f":"IF(K98<(H98*2.5),\"N\",\"Y\")","v":"N"},{"$f":"'Team 7'!$H$74","v":0},{"$f":"'Team 7'!$H$75","v":0},{"$f":"'Team 7'!$D$76","v":"f"}]
[214,{"$f":"'Team 7'!$A$65","v":14},{"$f":"'Team 7'!$D$1","v":" "},{"$f":"'Team 7'!$D$65","v":0},{"$f":"'Team 7'!$D$66","v":0},{"$f":"'Team 7'!$H$68","v":""},{"$f":"'Team 7'!$H$65","v":0},{"$f":"'Team 7'!$F$8","v":8},"N",{"$f":"'Team 7'!$H$66","v":0},{"$f":"'Team 7'!$H$67","v":0},{"$f":"'Team 7'!$D$68","v":"f"}]
[186,{"$f":"'Team 8'!$A$53","v":11},{"$f":"'Team 8'!$D$1","v":" "},{"$f":"'Team 8'!$D$53","v":0},{"$f":"'Team 8'!$D$54","v":0},{"$f":"'Team 8'!$H$56","v":""},{"$f":"'Team 8'!$H$53","v":0},{"$f":"'Team 8'!$F$8","v":8},"N",{"$f":"'Team 8'!$H$54","v":0},{"$f":"'Team 8'!$H$55","v":0},{"$f":"'Team 8'!$D$56","v":"f"}]
[21,{"$f":"'Bad Pitches'!$A$93","v":21},{"$f":"'Bad Pitches'!$D$1","v":"Bad Pitches"},{"$f":"'Bad Pitches'!$D$93","v":0},{"$f":"'Bad Pitches'!$D$94","v":0},{"$f":"'Bad Pitches'!$H$96","v":""},{"$f":"'Bad Pitches'!$H$93","v":0},{"$f":"'Bad Pitches'!$F$8","v":3},"N",{"$f":"'Bad Pitches'!$H$94","v":0},{"$f":"'Bad Pitches'!$H$95","v":0},{"$f":"'Bad Pitches'!$D$96","v":"f"}]
[22,{"$f":"'Bad Pitches'!$A$97","v":22},{"$f":"'Bad Pitches'!$D$1","v":"Bad Pitches"},{"$f":"'Bad Pitches'!$D$97","v":0},{"$f":"'Bad Pitches'!$D$98","v":0},{"$f":"'Bad Pitches'!$H$100","v":""},{"$f":"'Bad Pitches'!$H$97","v":0},{"$f":"'Bad Pitches'!$F$8","v":3},"N",{"$f":"'Bad Pitches'!$H$98","v":0},{"$f":"'Bad Pitches'!$H$99","v":0},{"$f":"'Bad Pitches'!$D$100","v":"f"}]
[23,{"$f":"'Bad Pitches'!$A$101","v":23},{"$f":"'Bad Pitches'!$D$1","v":"Bad Pitches"},{"$f":"'Bad Pitches'!$D$101","v":0},{"$f":"'Bad Pitches'!$D$102","v":0},{"$f":"'Bad Pitches'!$H$104","v":""},{"$f":"'Bad Pitches'!$H$101","v":0},{"$f":"'Bad Pitches'!$F$8","v":3},"N",{"$f":"'Bad Pitches'!$H$102","v":0},{"$f":"'Bad Pitches'!$H$103","v":0},{"$f":"'Bad Pitches'!$D$104","v":"f"}]
[24,{"$f":"'Bad Pitches'!$A$105","v":24},{"$f":"'Bad Pitches'!$D$1","v":"Bad Pitches"},{"$f":"'Bad Pitches'!$D$105","v":0},{"$f":"'Bad Pitches'!$D$106","v":0},{"$f":"'Bad Pitches'!$H$108","v":""},{"$f":"'Bad Pitches'!$H$105","v":0},{"$f":"'Bad Pitches'!$F$8","v":3},"N",{"$f":"'Bad Pitches'!$H$106","v":0},{"$f":"'Bad Pitches'!$H$107","v":0},{"$f":"'Bad Pitches'!$D$108","v":"f"}]
[25,{"$f":"'Bad Pitches'!$A$109","v":25},{"$f":"'Bad Pitches'!$D$1","v":"Bad Pitches"},{"$f":"'Bad Pitches'!$D$109","v":0},{"$f":"'Bad Pitches'!$D$110","v":0},{"$f":"'Bad Pitches'!$H$112","v":""},{"$f":"'Bad Pitches'!$H$109","v":0},{"$f":"'Bad Pitches'!$F$8","v":3},"N",{"$f":"'Bad Pitches'!$H$110","v":0},{"$f":"'Bad Pitches'!$H$111","v":0},{"$f":"'Bad Pitches'!$D$112","v":"f"}]
[72,{"$f":"'Ghetto Bombers'!$A$97","v":22},{"$f":"'Ghetto Bombers'!$D$1","v":"Ghetto Bombers"},{"$f":"'Ghetto Bombers'!$D$97","v":0},{"$f":"'Ghetto Bombers'!$D$98","v":0},{"$f":"'Ghetto Bombers'!$H$100","v":""},{"$f":"'Ghetto Bombers'!$H$97","v":0},{"$f":"'Ghetto Bombers'!$F$8","v":4},"N",{"$f":"'Ghetto Bombers'!$H$98","v":0},{"$f":"'Ghetto Bombers'!$H$99","v":0},{"$f":"'Ghetto Bombers'!$D$100","v":"f"}]
[73,{"$f":"'Ghetto Bombers'!$A$101","v":23},{"$f":"'Ghetto Bombers'!$D$1","v":"Ghetto Bombers"},{"$f":"'Ghetto Bombers'!$D$101","v":0},{"$f":"'Ghetto Bombers'!$D$102","v":0},{"$f":"'Ghetto Bombers'!$H$104","v":""},{"$f":"'Ghetto Bombers'!$H$101","v":0},{"$f":"'Ghetto Bombers'!$F$8","v":4},"N",{"$f":"'Ghetto Bombers'!$H$102","v":0},{"$f":"'Ghetto Bombers'!$H$103","v":0},{"$f":"'Ghetto Bombers'!$D$104","v":"f"}]
[74,{"$f":"'Ghetto Bombers'!$A$105","v":24},{"$f":"'Ghetto Bombers'!$D$1","v":"Ghetto Bombers"},{"$f":"'Ghetto Bombers'!$D$105","v":0},{"$f":"'Ghetto Bombers'!$D$106","v":0},{"$f":"'Ghetto Bombers'!$H$108","v":""},{"$f":"'Ghetto Bombers'!$H$105","v":0},{"$f":"'Ghetto Bombers'!$F$8","v":4},"N",{"$f":"'Ghetto Bombers'!$H$106","v":0},{"$f":"'Ghetto Bombers'!$H$107","v":0},{"$f":"'Ghetto Bombers'!$D$108","v":"f"}]
[75,{"$f":"'Ghetto Bombers'!$A$109","v":25},{"$f":"'Ghetto Bombers'!$D$1","v":"Ghetto Bombers"},{"$f":"'Ghetto Bombers'!$D$109","v":0},{"$f":"'Ghetto Bombers'!$D$110","v":0},{"$f":"'Ghetto Bombers'!$H$112","v":""},{"$f":"'Ghetto Bombers'!$H$109","v":0},{"$f":"'Ghetto Bombers'!$F$8","v":4},"N",{"$f":"'Ghetto Bombers'!$H$110","v":0},{"$f":"'Ghetto Bombers'!$H$111","v":0},{"$f":"'Ghetto Bombers'!$D$112","v":"f"}]
[95,{"$f":"'Hit Squad'!$A$89","v":20},{"$f":"'Hit Squad'!$D$1","v":"Hit Squad"},{"$f":"'Hit Squad'!$D$89","v":0},{"$f":"'Hit Squad'!$D$90","v":0},{"$f":"'Hit Squad'!$H$92","v":""},{"$f":"'Hit Squad'!$H$89","v":0},{"$f":"'Hit Squad'!$F$8","v":3},"N",{"$f":"'Hit Squad'!$H$90","v":0},{"$f":"'Hit Squad'!$H$91","v":0},{"$f":"'Hit Squad'!$D$92","v":"f"}]
[96,{"$f":"'Hit Squad'!$A$93","v":21},{"$f":"'Hit Squad'!$D$1","v":"Hit Squad"},{"$f":"'Hit Squad'!$D$93","v":0},{"$f":"'Hit Squad'!$D$94","v":0},{"$f":"'Hit Squad'!$H$96","v":""},{"$f":"'Hit Squad'!$H$93","v":0},{"$f":"'Hit Squad'!$F$8","v":3},"N",{"$f":"'Hit Squad'!$H$94","v":0},{"$f":"'Hit Squad'!$H$95","v":0},{"$f":"'Hit Squad'!$D$96","v":"f"}]
[97,{"$f":"'Hit Squad'!$A$97","v":22},{"$f":"'Hit Squad'!$D$1","v":"Hit Squad"},{"$f":"'Hit Squad'!$D$97","v":0},{"$f":"'Hit Squad'!$D$98","v":0},{"$f":"'Hit Squad'!$H$100","v":""},{"$f":"'Hit Squad'!$H$97","v":0},{"$f":"'Hit Squad'!$F$8","v":3},"N",{"$f":"'Hit Squad'!$H$98","v":0},{"$f":"'Hit Squad'!$H$99","v":0},{"$f":"'Hit Squad'!$D$100","v":"f"}]
[98,{"$f":"'Hit Squad'!$A$101","v":23},{"$f":"'Hit Squad'!$D$1","v":"Hit Squad"},{"$f":"'Hit Squad'!$D$101","v":0},{"$f":"'Hit Squad'!$D$102","v":0},{"$f":"'Hit Squad'!$H$104","v":""},{"$f":"'Hit Squad'!$H$101","v":0},{"$f":"'Hit Squad'!$F$8","v":3},"N",{"$f":"'Hit Squad'!$H$102","v":0},{"$f":"'Hit Squad'!$H$103","v":0},{"$f":"'Hit Squad'!$D$104","v":"f"}]
[99,{"$f":"'Hit Squad'!$A$105","v":24},{"$f":"'Hit Squad'!$D$1","v":"Hit Squad"},{"$f":"'Hit Squad'!$D$105","v":0},{"$f":"'Hit Squad'!$D$106","v":0},{"$f":"'Hit Squad'!$H$108","v":""},{"$f":"'Hit Squad'!$H$105","v":0},{"$f":"'Hit Squad'!$F$8","v":3},"N",{"$f":"'Hit Squad'!$H$106","v":0},{"$f":"'Hit Squad'!$H$107","v":0},{"$f":"'Hit Squad'!$D$108","v":"f"}]
[100,{"$f":"'Hit Squad'!$A$109","v":25},{"$f":"'Hit Squad'!$D$1","v":"Hit Squad"},{"$f":"'Hit Squad'!$D$109","v":0},{"$f":"'Hit Squad'!$D$110","v":0},{"$f":"'Hit Squad'!$H$112","v":""},{"$f":"'Hit Squad'!$H$109","v":0},{"$f":"'Hit Squad'!$F$8","v":3},"N",{"$f":"'Hit Squad'!$H$110","v":0},{"$f":"'Hit Squad'!$H$111","v":0},{"$f":"'Hit Squad'!$D$112","v":"f"}]
[122,{"$f":"Sticks!$A$97","v":22},{"$f":"Sticks!$D$1","v":"Sticks"},{"$f":"Sticks!$D$97","v":0},{"$f":"Sticks!$D$98","v":0},{"$f":"Sticks!$H$100","v":""},{"$f":"Sticks!$H$97","v":0},{"$f":"Sticks!$F$8","v":4},"N",{"$f":"Sticks!$H$98","v":0},{"$f":"Sticks!$H$99","v":0},{"$f":"Sticks!$D$100","v":"f"}]
[123,{"$f":"Sticks!$A$101","v":23},{"$f":"Sticks!$D$1","v":"Sticks"},{"$f":"Sticks!$D$101","v":0},{"$f":"Sticks!$D$102","v":0},{"$f":"Sticks!$H$104","v":""},{"$f":"Sticks!$H$101","v":0},{"$f":"Sticks!$F$8","v":4},"N",{"$f":"Sticks!$H$102","v":0},{"$f":"Sticks!$H$103","v":0},{"$f":"Sticks!$D$104","v":"f"}]
[124,{"$f":"Sticks!$A$105","v":24},{"$f":"Sticks!$D$1","v":"Sticks"},{"$f":"Sticks!$D$105","v":0},{"$f":"Sticks!$D$106","v":0},{"$f":"Sticks!$H$108","v":""},{"$f":"Sticks!$H$105","v":0},{"$f":"Sticks!$F$8","v":4},"N",{"$f":"Sticks!$H$106","v":0},{"$f":"Sticks!$H$107","v":0},{"$f":"Sticks!$D$108","v":"f"}]
[125,{"$f":"Sticks!$A$109","v":25},{"$f":"Sticks!$D$1","v":"Sticks"},{"$f":"Sticks!$D$109","v":0},{"$f":"Sticks!$D$110","v":0},{"$f":"Sticks!$H$112","v":""},{"$f":"Sticks!$H$109","v":0},{"$f":"Sticks!$F$8","v":4},"N",{"$f":"Sticks!$H$110","v":0},{"$f":"Sticks!$H$111","v":0},{"$f":"Sticks!$D$112","v":"f"}]
[150,{"$f":"'Team 6'!$A$109","v":25},{"$f":"'Team 6'!$D$1","v":"Team 6"},{"$f":"'Team 6'!$D$109","v":0},{"$f":"'Team 6'!$D$110","v":0},{"$f":"'Team 6'!$H$112","v":""},{"$f":"'Team 6'!$H$109","v":0},{"$f":"'Team 6'!$F$8","v":8},"N",{"$f":"'Team 6'!$H$110","v":0},{"$f":"'Team 6'!$H$111","v":0},{"$f":"'Team 6'!$D$112","v":"f"}]
[189,{"$f":"'Team 8'!$A$65","v":14},{"$f":"'Team 8'!$D$1","v":" "},{"$f":"'Team 8'!$D$65","v":0},{"$f":"'Team 8'!$D$66","v":0},{"$f":"'Team 8'!$H$68","v":""},{"$f":"'Team 8'!$H$65","v":0},{"$f":"'Team 8'!$F$8","v":8},"N",{"$f":"'Team 8'!$H$66","v":0},{"$f":"'Team 8'!$H$67","v":0},{"$f":"'Team 8'!$D$68","v":"f"}]
[190,{"$f":"'Team 8'!$A$69","v":15},{"$f":"'Team 8'!$D$1","v":" "},{"$f":"'Team 8'!$D$69","v":0},{"$f":"'Team 8'!$D$70","v":0},{"$f":"'Team 8'!$H$72","v":""},{"$f":"'Team 8'!$H$69","v":0},{"$f":"'Team 8'!$F$8","v":8},"N",{"$f":"'Team 8'!$H$70","v":0},{"$f":"'Team 8'!$H$71","v":0},{"$f":"'Team 8'!$D$72","v":"f"}]
[191,{"$f":"'Team 8'!$A$73","v":16},{"$f":"'Team 8'!$D$1","v":" "},{"$f":"'Team 8'!$D$73","v":0},{"$f":"'Team 8'!$D$74","v":0},{"$f":"'Team 8'!$H$76","v":""},{"$f":"'Team 8'!$H$73","v":0},{"$f":"'Team 8'!$F$8","v":8},"N",{"$f":"'Team 8'!$H$74","v":0},{"$f":"'Team 8'!$H$75","v":0},{"$f":"'Team 8'!$D$76","v":"f"}]
[192,{"$f":"'Team 8'!$A$77","v":17},{"$f":"'Team 8'!$D$1","v":" "},{"$f":"'Team 8'!$D$77","v":0},{"$f":"'Team 8'!$D$78","v":0},{"$f":"'Team 8'!$H$80","v":""},{"$f":"'Team 8'!$H$77","v":0},{"$f":"'Team 8'!$F$8","v":8},"N",{"$f":"'Team 8'!$H$78","v":0},{"$f":"'Team 8'!$H$79","v":0},{"$f":"'Team 8'!$D$80","v":"f"}]
[193,{"$f":"'Team 8'!$A$81","v":18},{"$f":"'Team 8'!$D$1","v":" "},{"$f":"'Team 8'!$D$81","v":0},{"$f":"'Team 8'!$D$82","v":0},{"$f":"'Team 8'!$H$84","v":""},{"$f":"'Team 8'!$H$81","v":0},{"$f":"'Team 8'!$F$8","v":8},"N",{"$f":"'Team 8'!$H$82","v":0},{"$f":"'Team 8'!$H$83","v":0},{"$f":"'Team 8'!$D$84","v":"f"}]
[194,{"$f":"'Team 8'!$A$85","v":19},{"$f":"'Team 8'!$D$1","v":" "},{"$f":"'Team 8'!$D$85","v":0},{"$f":"'Team 8'!$D$86","v":0},{"$f":"'Team 8'!$H$88","v":""},{"$f":"'Team 8'!$H$85","v":0},{"$f":"'Team 8'!$F$8","v":8},"N",{"$f":"'Team 8'!$H$86","v":0},{"$f":"'Team 8'!$H$87","v":0},{"$f":"'Team 8'!$D$88","v":"f"}]
[195,{"$f":"'Team 8'!$A$89","v":20},{"$f":"'Team 8'!$D$1","v":" "},{"$f":"'Team 8'!$D$89","v":0},{"$f":"'Team 8'!$D$90","v":0},{"$f":"'Team 8'!$H$92","v":""},{"$f":"'Team 8'!$H$89","v":0},{"$f":"'Team 8'!$F$8","v":8},"N",{"$f":"'Team 8'!$H$90","v":0},{"$f":"'Team 8'!$H$91","v":0},{"$f":"'Team 8'!$D$92","v":"f"}]
[196,{"$f":"'Team 8'!$A$93","v":21},{"$f":"'Team 8'!$D$1","v":" "},{"$f":"'Team 8'!$D$93","v":0},{"$f":"'Team 8'!$D$94","v":0},{"$f":"'Team 8'!$H$96","v":""},{"$f":"'Team 8'!$H$93","v":0},{"$f":"'Team 8'!$F$8","v":8},"N",{"$f":"'Team 8'!$H$94","v":0},{"$f":"'Team 8'!$H$95","v":0},{"$f":"'Team 8'!$D$96","v":"f"}]
[197,{"$f":"'Team 8'!$A$97","v":22},{"$f":"'Team 8'!$D$1","v":" "},{"$f":"'Team 8'!$D$97","v":0},{"$f":"'Team 8'!$D$98","v":0},{"$f":"'Team 8'!$H$100","v":""},{"$f":"'Team 8'!$H$97","v":0},{"$f":"'Team 8'!$F$8","v":8},"N",{"$f":"'Team 8'!$H$98","v":0},{"$f":"'Team 8'!$H$99","v":0},{"$f":"'Team 8'!$D$100","v":"f"}]
[198,{"$f":"'Team 8'!$A$101","v":23},{"$f":"'Team 8'!$D$1","v":" "},{"$f":"'Team 8'!$D$101","v":0},{"$f":"'Team 8'!$D$102","v":0},{"$f":"'Team 8'!$H$104","v":""},{"$f":"'Team 8'!$H$101","v":0},{"$f":"'Team 8'!$F$8","v":8},{"$f":"IF(K130<(H130*2.5),\"N\",\"Y\")","v":"N"},{"$f":"'Team 8'!$H$102","v":0},{"$f":"'Team 8'!$H$103","v":0},{"$f":"'Team 8'!$D$104","v":"f"}]
[199,{"$f":"'Team 8'!$A$105","v":24},{"$f":"'Team 8'!$D$1","v":" "},{"$f":"'Team 8'!$D$105","v":0},{"$f":"'Team 8'!$D$106","v":0},{"$f":"'Team 8'!$H$108","v":""},{"$f":"'Team 8'!$H$105","v":0},{"$f":"'Team 8'!$F$8","v":8},"N",{"$f":"'Team 8'!$H$106","v":0},{"$f":"'Team 8'!$H$107","v":0},{"$f":"'Team 8'!$D$108","v":"f"}]
[200,{"$f":"'Team 8'!$A$109","v":25},{"$f":"'Team 8'!$D$1","v":" "},{"$f":"'Team 8'!$D$109","v":0},{"$f":"'Team 8'!$D$110","v":0},{"$f":"'Team 8'!$H$112","v":""},{"$f":"'Team 8'!$H$109","v":0},{"$f":"'Team 8'!$F$8","v":8},"N",{"$f":"'Team 8'!$H$110","v":0},{"$f":"'Team 8'!$H$111","v":0},{"$f":"'Team 8'!$D$112","v":"f"}]
[218,{"$f":"'Team 7'!$A$81","v":18},{"$f":"'Team 7'!$D$1","v":" "},{"$f":"'Team 7'!$D$81","v":0},{"$f":"'Team 7'!$D$82","v":0},{"$f":"'Team 7'!$H$84","v":""},{"$f":"'Team 7'!$H$81","v":0},{"$f":"'Team 7'!$F$8","v":8},"N",{"$f":"'Team 7'!$H$82","v":0},{"$f":"'Team 7'!$H$83","v":0},{"$f":"'Team 7'!$D$84","v":"f"}]
[219,{"$f":"'Team 7'!$A$85","v":19},{"$f":"'Team 7'!$D$1","v":" "},{"$f":"'Team 7'!$D$85","v":0},{"$f":"'Team 7'!$D$86","v":0},{"$f":"'Team 7'!$H$88","v":""},{"$f":"'Team 7'!$H$85","v":0},{"$f":"'Team 7'!$F$8","v":8},"N",{"$f":"'Team 7'!$H$86","v":0},{"$f":"'Team 7'!$H$87","v":0},{"$f":"'Team 7'!$D$88","v":"f"}]
[220,{"$f":"'Team 7'!$A$89","v":20},{"$f":"'Team 7'!$D$1","v":" "},{"$f":"'Team 7'!$D$89","v":0},{"$f":"'Team 7'!$D$90","v":0},{"$f":"'Team 7'!$H$92","v":""},{"$f":"'Team 7'!$H$89","v":0},{"$f":"'Team 7'!$F$8","v":8},"N",{"$f":"'Team 7'!$H$90","v":0},{"$f":"'Team 7'!$H$91","v":0},{"$f":"'Team 7'!$D$92","v":"f"}]
[221,{"$f":"'Team 7'!$A$93","v":21},{"$f":"'Team 7'!$D$1","v":" "},{"$f":"'Team 7'!$D$93","v":0},{"$f":"'Team 7'!$D$94","v":0},{"$f":"'Team 7'!$H$96","v":""},{"$f":"'Team 7'!$H$93","v":0},{"$f":"'Team 7'!$F$8","v":8},"N",{"$f":"'Team 7'!$H$94","v":0},{"$f":"'Team 7'!$H$95","v":0},{"$f":"'Team 7'!$D$96","v":"f"}]
[222,{"$f":"'Team 7'!$A$97","v":22},{"$f":"'Team 7'!$D$1","v":" "},{"$f":"'Team 7'!$D$97","v":0},{"$f":"'Team 7'!$D$98","v":0},{"$f":"'Team 7'!$H$100","v":""},{"$f":"'Team 7'!$H$97","v":0},{"$f":"'Team 7'!$F$8","v":8},"N",{"$f":"'Team 7'!$H$98","v":0},{"$f":"'Team 7'!$H$99","v":0},{"$f":"'Team 7'!$D$100","v":"f"}]
[223,{"$f":"'Team 7'!$A$101","v":23},{"$f":"'Team 7'!$D$1","v":" "},{"$f":"'Team 7'!$D$101","v":0},{"$f":"'Team 7'!$D$102","v":0},{"$f":"'Team 7'!$H$104","v":""},{"$f":"'Team 7'!$H$101","v":0},{"$f":"'Team 7'!$F$8","v":8},"N",{"$f":"'Team 7'!$H$102","v":0},{"$f":"'Team 7'!$H$103","v":0},{"$f":"'Team 7'!$D$104","v":"f"}]
[224,{"$f":"'Team 7'!$A$105","v":24},{"$f":"'Team 7'!$D$1","v":" "},{"$f":"'Team 7'!$D$105","v":0},{"$f":"'Team 7'!$D$106","v":0},{"$f":"'Team 7'!$H$108","v":""},{"$f":"'Team 7'!$H$105","v":0},{"$f":"'Team 7'!$F$8","v":8},"N",{"$f":"'Team 7'!$H$106","v":0},{"$f":"'Team 7'!$H$107","v":0},{"$f":"'Team 7'!$D$108","v":"f"}]
[225,{"$f":"'Team 7'!$A$109","v":25},{"$f":"'Team 7'!$D$1","v":" "},{"$f":"'Team 7'!$D$109","v":0},{"$f":"'Team 7'!$D$110","v":0},{"$f":"'Team 7'!$H$112","v":""},{"$f":"'Team 7'!$H$109","v":0},{"$f":"'Team 7'!$F$8","v":8},"N",{"$f":"'Team 7'!$H$110","v":0},{"$f":"'Team 7'!$H$111","v":0},{"$f":"'Team 7'!$D$112","v":"f"}]
[187,{"$f":"'Team 8'!$A$57","v":12},{"$f":"'Team 8'!$D$1","v":" "},{"$f":"'Team 8'!$D$57","v":0},{"$f":"'Team 8'!$D$58","v":0},{"$f":"'Team 8'!$H$60","v":""},{"$f":"'Team 8'!$H$57","v":0},{"$f":"'Team 8'!$F$8","v":8},"N",{"$f":"'Team 8'!$H$58","v":0},{"$f":"'Team 8'!$H$59","v":0},{"$f":"'Team 8'!$D$60","v":"f"}]
[188,{"$f":"'Team 8'!$A$61","v":13},{"$f":"'Team 8'!$D$1","v":" "},{"$f":"'Team 8'!$D$61","v":0},{"$f":"'Team 8'!$D$62","v":0},{"$f":"'Team 8'!$H$64","v":""},{"$f":"'Team 8'!$H$61","v":0},{"$f":"'Team 8'!$F$8","v":8},"N",{"$f":"'Team 8'!$H$62","v":0},{"$f":"'Team 8'!$H$63","v":0},{"$f":"'Team 8'!$D$64","v":"f"}]
[213,{"$f":"'Team 7'!$A$61","v":13},{"$f":"'Team 7'!$D$1","v":" "},{"$f":"'Team 7'!$D$61","v":0},{"$f":"'Team 7'!$D$62","v":0},{"$f":"'Team 7'!$H$64","v":""},{"$f":"'Team 7'!$H$61","v":0},{"$f":"'Team 7'!$F$8","v":8},"N",{"$f":"'Team 7'!$H$62","v":0},{"$f":"'Team 7'!$H$63","v":0},{"$f":"'Team 7'!$D$64","v":"f"}]
[215,{"$f":"'Team 7'!$A$69","v":15},{"$f":"'Team 7'!$D$1","v":" "},{"$f":"'Team 7'!$D$69","v":0},{"$f":"'Team 7'!$D$70","v":0},{"$f":"'Team 7'!$H$72","v":""},{"$f":"'Team 7'!$H$69","v":0},{"$f":"'Team 7'!$F$8","v":8},"N",{"$f":"'Team 7'!$H$70","v":0},{"$f":"'Team 7'!$H$71","v":0},{"$f":"'Team 7'!$D$72","v":"f"}]
[217,{"$f":"'Team 7'!$A$77","v":17},{"$f":"'Team 7'!$D$1","v":" "},{"$f":"'Team 7'!$D$77","v":0},{"$f":"'Team 7'!$D$78","v":0},{"$f":"'Team 7'!$H$80","v":""},{"$f":"'Team 7'!$H$77","v":0},{"$f":"'Team 7'!$F$8","v":8},"N",{"$f":"'Team 7'!$H$78","v":0},{"$f":"'Team 7'!$H$79","v":0},{"$f":"'Team 7'!$D$80","v":"f"}]
[118,{"$f":"Sticks!$A$81","v":18},{"$f":"Sticks!$D$1","v":"Sticks"},{"$f":"Sticks!$D$81","v":0},{"$f":"Sticks!$D$82","v":0},{"$f":"Sticks!$H$84","v":""},{"$f":"Sticks!$H$81","v":0},{"$f":"Sticks!$F$8","v":4},"N",{"$f":"Sticks!$H$82","v":0},{"$f":"Sticks!$H$83","v":0},{"$f":"Sticks!$D$84","v":"f"}]
[17,{"$f":"'Bad Pitches'!$A$77","v":17},{"$f":"'Bad Pitches'!$D$1","v":"Bad Pitches"},{"$f":"'Bad Pitches'!$D$77","v":0},{"$f":"'Bad Pitches'!$D$78","v":0},{"$f":"'Bad Pitches'!$H$80","v":""},{"$f":"'Bad Pitches'!$H$77","v":0},{"$f":"'Bad Pitches'!$F$8","v":3},"N",{"$f":"'Bad Pitches'!$H$78","v":0},{"$f":"'Bad Pitches'!$H$79","v":0},{"$f":"'Bad Pitches'!$D$80","v":"f"}]
[120,{"$f":"Sticks!$A$89","v":20},{"$f":"Sticks!$D$1","v":"Sticks"},{"$f":"Sticks!$D$89","v":0},{"$f":"Sticks!$D$90","v":0},{"$f":"Sticks!$H$92","v":""},{"$f":"Sticks!$H$89","v":0},{"$f":"Sticks!$F$8","v":4},"N",{"$f":"Sticks!$H$90","v":0},{"$f":"Sticks!$H$91","v":0},{"$f":"Sticks!$D$92","v":"f"}]
[117,{"$f":"Sticks!$A$77","v":17},{"$f":"Sticks!$D$1","v":"Sticks"},{"$f":"Sticks!$D$77","v":0},{"$f":"Sticks!$D$78","v":0},{"$f":"Sticks!$H$80","v":""},{"$f":"Sticks!$H$77","v":0},{"$f":"Sticks!$F$8","v":4},"N",{"$f":"Sticks!$H$78","v":0},{"$f":"Sticks!$H$79","v":0},{"$f":"Sticks!$D$80","v":"f"}]
[20,{"$f":"'Bad Pitches'!$A$89","v":20},{"$f":"'Bad Pitches'!$D$1","v":"Bad Pitches"},{"$f":"'Bad Pitches'!$D$89","v":0},{"$f":"'Bad Pitches'!$D$90","v":0},{"$f":"'Bad Pitches'!$H$92","v":""},{"$f":"'Bad Pitches'!$H$89","v":0},{"$f":"'Bad Pitches'!$F$8","v":3},"N",{"$f":"'Bad Pitches'!$H$90","v":0},{"$f":"'Bad Pitches'!$H$91","v":0},{"$f":"'Bad Pitches'!$D$92","v":"f"}]
[94,{"$f":"'Hit Squad'!$A$85","v":19},{"$f":"'Hit Squad'!$D$1","v":"Hit Squad"},{"$f":"'Hit Squad'!$D$85","v":0},{"$f":"'Hit Squad'!$D$86","v":0},{"$f":"'Hit Squad'!$H$88","v":""},{"$f":"'Hit Squad'!$H$85","v":0},{"$f":"'Hit Squad'!$F$8","v":3},"N",{"$f":"'Hit Squad'!$H$86","v":0},{"$f":"'Hit Squad'!$H$87","v":0},{"$f":"'Hit Squad'!$D$88","v":"f"}]
[16,{"$f":"'Bad Pitches'!$A$73","v":16},{"$f":"'Bad Pitches'!$D$1","v":"Bad Pitches"},{"$f":"'Bad Pitches'!$D$73","v":0},{"$f":"'Bad Pitches'!$D$74","v":0},{"$f":"'Bad Pitches'!$H$76","v":""},{"$f":"'Bad Pitches'!$H$73","v":0},{"$f":"'Bad Pitches'!$F$8","v":3},"N",{"$f":"'Bad Pitches'!$H$74","v":0},{"$f":"'Bad Pitches'!$H$75","v":0},{"$f":"'Bad Pitches'!$D$76","v":"f"}]
[143,{"$f":"'Team 6'!$A$81","v":18},{"$f":"'Team 6'!$D$1","v":"Team 6"},{"$f":"'Team 6'!$D$81","v":0},{"$f":"'Team 6'!$D$82","v":0},{"$f":"'Team 6'!$H$84","v":""},{"$f":"'Team 6'!$H$81","v":0},{"$f":"'Team 6'!$F$8","v":8},"N",{"$f":"'Team 6'!$H$82","v":0},{"$f":"'Team 6'!$H$83","v":0},{"$f":"'Team 6'!$D$84","v":"f"}]
[212,{"$f":"'Team 7'!$A$57","v":12},{"$f":"'Team 7'!$D$1","v":" "},{"$f":"'Team 7'!$D$57","v":0},{"$f":"'Team 7'!$D$58","v":0},{"$f":"'Team 7'!$H$60","v":""},{"$f":"'Team 7'!$H$57","v":0},{"$f":"'Team 7'!$F$8","v":8},"N",{"$f":"'Team 7'!$H$58","v":0},{"$f":"'Team 7'!$H$59","v":0},{"$f":"'Team 7'!$D$60","v":"f"}]
[148,{"$f":"'Team 6'!$A$101","v":23},{"$f":"'Team 6'!$D$1","v":"Team 6"},{"$f":"'Team 6'!$D$101","v":0},{"$f":"'Team 6'!$D$102","v":0},{"$f":"'Team 6'!$H$104","v":""},{"$f":"'Team 6'!$H$101","v":0},{"$f":"'Team 6'!$F$8","v":8},"N",{"$f":"'Team 6'!$H$102","v":0},{"$f":"'Team 6'!$H$103","v":0},{"$f":"'Team 6'!$D$104","v":"f"}]
[145,{"$f":"'Team 6'!$A$89","v":20},{"$f":"'Team 6'!$D$1","v":"Team 6"},{"$f":"'Team 6'!$D$89","v":0},{"$f":"'Team 6'!$D$90","v":0},{"$f":"'Team 6'!$H$92","v":""},{"$f":"'Team 6'!$H$89","v":0},{"$f":"'Team 6'!$F$8","v":8},"N",{"$f":"'Team 6'!$H$90","v":0},{"$f":"'Team 6'!$H$91","v":0},{"$f":"'Team 6'!$D$92","v":"f"}]
[115,{"$f":"Sticks!$A$69","v":15},{"$f":"Sticks!$D$1","v":"Sticks"},{"$f":"Sticks!$D$69","v":0},{"$f":"Sticks!$D$70","v":0},{"$f":"Sticks!$H$72","v":""},{"$f":"Sticks!$H$69","v":0},{"$f":"Sticks!$F$8","v":4},"N",{"$f":"Sticks!$H$70","v":0},{"$f":"Sticks!$H$71","v":0},{"$f":"Sticks!$D$72","v":"f"}]
[141,{"$f":"'Team 6'!$A$73","v":16},{"$f":"'Team 6'!$D$1","v":"Team 6"},{"$f":"'Team 6'!$D$73","v":0},{"$f":"'Team 6'!$D$74","v":0},{"$f":"'Team 6'!$H$76","v":""},{"$f":"'Team 6'!$H$73","v":0},{"$f":"'Team 6'!$F$8","v":8},"N",{"$f":"'Team 6'!$H$74","v":0},{"$f":"'Team 6'!$H$75","v":0},{"$f":"'Team 6'!$D$76","v":"f"}]
[15,{"$f":"'Bad Pitches'!$A$69","v":15},{"$f":"'Bad Pitches'!$D$1","v":"Bad Pitches"},{"$f":"'Bad Pitches'!$D$69","v":0},{"$f":"'Bad Pitches'!$D$70","v":0},{"$f":"'Bad Pitches'!$H$72","v":""},{"$f":"'Bad Pitches'!$H$69","v":0},{"$f":"'Bad Pitches'!$F$8","v":3},"N",{"$f":"'Bad Pitches'!$H$70","v":0},{"$f":"'Bad Pitches'!$H$71","v":0},{"$f":"'Bad Pitches'!$D$72","v":"f"}]
[68,{"$f":"'Ghetto Bombers'!$A$81","v":18},{"$f":"'Ghetto Bombers'!$D$1","v":"Ghetto Bombers"},{"$f":"'Ghetto Bombers'!$D$81","v":0},{"$f":"'Ghetto Bombers'!$D$82","v":0},{"$f":"'Ghetto Bombers'!$H$84","v":""},{"$f":"'Ghetto Bombers'!$H$81","v":0},{"$f":"'Ghetto Bombers'!$F$8","v":4},"N",{"$f":"'Ghetto Bombers'!$H$82","v":0},{"$f":"'Ghetto Bombers'!$H$83","v":0},{"$f":"'Ghetto Bombers'!$D$84","v":"f"}]
[43,{"$f":"BCBC!$A$81","v":18},{"$f":"BCBC!$D$1","v":"BCBC"},{"$f":"BCBC!$D$81","v":0},{"$f":"BCBC!$D$82","v":0},{"$f":"BCBC!$H$84","v":""},{"$f":"BCBC!$H$81","v":0},{"$f":"BCBC!$F$8","v":4},"N",{"$f":"BCBC!$H$82","v":0},{"$f":"BCBC!$H$83","v":0},{"$f":"BCBC!$D$84","v":"f"}]
[45,{"$f":"BCBC!$A$89","v":20},{"$f":"BCBC!$D$1","v":"BCBC"},{"$f":"BCBC!$D$89","v":0},{"$f":"BCBC!$D$90","v":0},{"$f":"BCBC!$H$92","v":""},{"$f":"BCBC!$H$89","v":0},{"$f":"BCBC!$F$8","v":4},{"$f":"IF(K162<(H162*2.5),\"N\",\"Y\")","v":"N"},{"$f":"BCBC!$H$90","v":0},{"$f":"BCBC!$H$91","v":0},{"$f":"BCBC!$D$92","v":"f"}]
[47,{"$f":"BCBC!$A$97","v":22},{"$f":"BCBC!$D$1","v":"BCBC"},{"$f":"BCBC!$D$97","v":0},{"$f":"BCBC!$D$98","v":0},{"$f":"BCBC!$H$100","v":""},{"$f":"BCBC!$H$97","v":0},{"$f":"BCBC!$F$8","v":4},"N",{"$f":"BCBC!$H$98","v":0},{"$f":"BCBC!$H$99","v":0},{"$f":"BCBC!$D$100","v":"f"}]
[49,{"$f":"BCBC!$A$105","v":24},{"$f":"BCBC!$D$1","v":"BCBC"},{"$f":"BCBC!$D$105","v":0},{"$f":"BCBC!$D$106","v":0},{"$f":"BCBC!$H$108","v":""},{"$f":"BCBC!$H$105","v":0},{"$f":"BCBC!$F$8","v":4},"N",{"$f":"BCBC!$H$106","v":0},{"$f":"BCBC!$H$107","v":0},{"$f":"BCBC!$D$108","v":"f"}]
[70,{"$f":"'Ghetto Bombers'!$A$89","v":20},{"$f":"'Ghetto Bombers'!$D$1","v":"Ghetto Bombers"},{"$f":"'Ghetto Bombers'!$D$89","v":0},{"$f":"'Ghetto Bombers'!$D$90","v":0},{"$f":"'Ghetto Bombers'!$H$92","v":""},{"$f":"'Ghetto Bombers'!$H$89","v":0},{"$f":"'Ghetto Bombers'!$F$8","v":4},"N",{"$f":"'Ghetto Bombers'!$H$90","v":0},{"$f":"'Ghetto Bombers'!$H$91","v":0},{"$f":"'Ghetto Bombers'!$D$92","v":"f"}]
[41,{"$f":"BCBC!$A$73","v":16},{"$f":"BCBC!$D$1","v":"BCBC"},{"$f":"BCBC!$D$73","v":0},{"$f":"BCBC!$D$74","v":0},{"$f":"BCBC!$H$76","v":""},{"$f":"BCBC!$H$73","v":0},{"$f":"BCBC!$F$8","v":4},"N",{"$f":"BCBC!$H$74","v":0},{"$f":"BCBC!$H$75","v":0},{"$f":"BCBC!$D$76","v":"f"}]
[89,{"$f":"'Hit Squad'!$A$65","v":14},{"$f":"'Hit Squad'!$D$1","v":"Hit Squad"},{"$f":"'Hit Squad'!$D$65","v":"Shannon"},{"$f":"'Hit Squad'!$D$66","v":"Adair"},{"$f":"'Hit Squad'!$H$68","v":0.66666666666666663},{"$f":"'Hit Squad'!$H$65","v":3},{"$f":"'Hit Squad'!$F$8","v":3},"N",{"$f":"'Hit Squad'!$H$66","v":2},{"$f":"'Hit Squad'!$H$67","v":3},{"$f":"'Hit Squad'!$D$68","v":"f"}]
[105,{"$f":"Sticks!$A$29","v":5},{"$f":"Sticks!$D$1","v":"Sticks"},{"$f":"Sticks!$D$29","v":"Taylor"},{"$f":"Sticks!$D$30","v":"Hensley"},{"$f":"Sticks!$H$32","v":0.66666666666666663},{"$f":"Sticks!$H$29","v":6},{"$f":"Sticks!$F$8","v":4},"N",{"$f":"Sticks!$H$30","v":4},{"$f":"Sticks!$H$31","v":7},{"$f":"Sticks!$D$32","v":"f"}]
[109,{"$f":"Sticks!$A$45","v":9},{"$f":"Sticks!$D$1","v":"Sticks"},{"$f":"Sticks!$D$45","v":"Whitney"},{"$f":"Sticks!$D$46","v":"Bean"},{"$f":"Sticks!$H$48","v":0.44444444444444442},{"$f":"Sticks!$H$45","v":9},{"$f":"Sticks!$F$8","v":4},"N",{"$f":"Sticks!$H$46","v":4},{"$f":"Sticks!$H$47","v":9},{"$f":"Sticks!$D$48","v":"f"}]
[85,{"$f":"'Hit Squad'!$A$49","v":10},{"$f":"'Hit Squad'!$D$1","v":"Hit Squad"},{"$f":"'Hit Squad'!$D$49","v":"Tasha"},{"$f":"'Hit Squad'!$D$50","v":"Harbaugh"},{"$f":"'Hit Squad'!$H$52","v":0.42857142857142855},{"$f":"'Hit Squad'!$H$49","v":7},{"$f":"'Hit Squad'!$F$8","v":3},"N",{"$f":"'Hit Squad'!$H$50","v":3},{"$f":"'Hit Squad'!$H$51","v":7},{"$f":"'Hit Squad'!$D$52","v":"f"}]
[27,{"$f":"BCBC!$A$17","v":2},{"$f":"BCBC!$D$1","v":"BCBC"},{"$f":"BCBC!$D$17","v":"Karen"},{"$f":"BCBC!$D$18","v":"Springer"},{"$f":"BCBC!$H$20","v":0.4},{"$f":"BCBC!$H$17","v":5},{"$f":"BCBC!$F$8","v":4},"N",{"$f":"BCBC!$H$18","v":2},{"$f":"BCBC!$H$19","v":5},{"$f":"BCBC!$D$20","v":"f"}]
[12,{"$f":"'Bad Pitches'!$A$57","v":12},{"$f":"'Bad Pitches'!$D$1","v":"Bad Pitches"},{"$f":"'Bad Pitches'!$D$57","v":"Sandra "},{"$f":"'Bad Pitches'!$D$58","v":"Chavez"},{"$f":"'Bad Pitches'!$H$60","v":0.33333333333333331},{"$f":"'Bad Pitches'!$H$57","v":3},{"$f":"'Bad Pitches'!$F$8","v":3},"N",{"$f":"'Bad Pitches'!$H$58","v":1},{"$f":"'Bad Pitches'!$H$59","v":3},{"$f":"'Bad Pitches'!$D$60","v":"f"}]
[113,{"$f":"Sticks!$A$61","v":13},{"$f":"Sticks!$D$1","v":"Sticks"},{"$f":"Sticks!$D$61","v":"Kate"},{"$f":"Sticks!$D$62","v":"Nygaard"},{"$f":"Sticks!$H$64","v":0.2857142857142857},{"$f":"Sticks!$H$61","v":7},{"$f":"Sticks!$F$8","v":4},"N",{"$f":"Sticks!$H$62","v":2},{"$f":"Sticks!$H$63","v":7},{"$f":"Sticks!$D$64","v":"f"}]
[79,{"$f":"'Hit Squad'!$A$25","v":4},{"$f":"'Hit Squad'!$D$1","v":"Hit Squad"},{"$f":"'Hit Squad'!$D$25","v":"Amber "},{"$f":"'Hit Squad'!$D$26","v":"Romero"},{"$f":"'Hit Squad'!$H$28","v":0.2857142857142857},{"$f":"'Hit Squad'!$H$25","v":7},{"$f":"'Hit Squad'!$F$8","v":3},"N",{"$f":"'Hit Squad'!$H$26","v":2},{"$f":"'Hit Squad'!$H$27","v":7},{"$f":"'Hit Squad'!$D$28","v":"f"}]
[13,{"$f":"'Bad Pitches'!$A$61","v":13},{"$f":"'Bad Pitches'!$D$1","v":"Bad Pitches"},{"$f":"'Bad Pitches'!$D$61","v":"Britt"},{"$f":"'Bad Pitches'!$D$62","v":"Call"},{"$f":"'Bad Pitches'!$H$64","v":0.25},{"$f":"'Bad Pitches'!$H$61","v":4},{"$f":"'Bad Pitches'!$F$8","v":3},"N",{"$f":"'Bad Pitches'!$H$62","v":1},{"$f":"'Bad Pitches'!$H$63","v":4},{"$f":"'Bad Pitches'!$D$64","v":"f"}]
[65,{"$f":"'Ghetto Bombers'!$A$69","v":15},{"$f":"'Ghetto Bombers'!$D$1","v":"Ghetto Bombers"},{"$f":"'Ghetto Bombers'!$D$69","v":"Heidi"},{"$f":"'Ghetto Bombers'!$D$70","v":"Talor"},{"$f":"'Ghetto Bombers'!$H$72","v":0.22222222222222221},{"$f":"'Ghetto Bombers'!$H$69","v":9},{"$f":"'Ghetto Bombers'!$F$8","v":4},"N",{"$f":"'Ghetto Bombers'!$H$70","v":2},{"$f":"'Ghetto Bombers'!$H$71","v":9},{"$f":"'Ghetto Bombers'!$D$72","v":"f"}]
[83,{"$f":"'Hit Squad'!$A$41","v":8},{"$f":"'Hit Squad'!$D$1","v":"Hit Squad"},{"$f":"'Hit Squad'!$D$41","v":"Kelly"},{"$f":"'Hit Squad'!$D$42","v":"Noakes"},{"$f":"'Hit Squad'!$H$44","v":0.2},{"$f":"'Hit Squad'!$H$41","v":5},{"$f":"'Hit Squad'!$F$8","v":3},"N",{"$f":"'Hit Squad'!$H$42","v":1},{"$f":"'Hit Squad'!$H$43","v":5},{"$f":"'Hit Squad'!$D$44","v":"f"}]
[77,{"$f":"'Hit Squad'!$A$17","v":2},{"$f":"'Hit Squad'!$D$1","v":"Hit Squad"},{"$f":"'Hit Squad'!$D$17","v":"Miche"},{"$f":"'Hit Squad'!$D$18","v":"Ferrin"},{"$f":"'Hit Squad'!$H$20","v":0.14285714285714285},{"$f":"'Hit Squad'!$H$17","v":7},{"$f":"'Hit Squad'!$F$8","v":3},"N",{"$f":"'Hit Squad'!$H$18","v":1},{"$f":"'Hit Squad'!$H$19","v":7},{"$f":"'Hit Squad'!$D$20","v":"f"}]
[90,{"$f":"'Hit Squad'!$A$69","v":15},{"$f":"'Hit Squad'!$D$1","v":"Hit Squad"},{"$f":"'Hit Squad'!$D$69","v":"Rachel "},{"$f":"'Hit Squad'!$D$70","v":"Russell"},{"$f":"'Hit Squad'!$H$72","v":0},{"$f":"'Hit Squad'!$H$69","v":2},{"$f":"'Hit Squad'!$F$8","v":3},"N",{"$f":"'Hit Squad'!$H$70","v":0},{"$f":"'Hit Squad'!$H$71","v":2},{"$f":"'Hit Squad'!$D$72","v":"f"}]
[114,{"$f":"Sticks!$A$65","v":14},{"$f":"Sticks!$D$1","v":"Sticks"},{"$f":"Sticks!$D$65","v":"Jaime"},{"$f":"Sticks!$D$66","v":"Holdaway"},{"$f":"Sticks!$H$68","v":0},{"$f":"Sticks!$H$65","v":3},{"$f":"Sticks!$F$8","v":4},"N",{"$f":"Sticks!$H$66","v":0},{"$f":"Sticks!$H$67","v":3},{"$f":"Sticks!$D$68","v":"f"}]
[88,{"$f":"'Hit Squad'!$A$61","v":13},{"$f":"'Hit Squad'!$D$1","v":"Hit Squad"},{"$f":"'Hit Squad'!$D$61","v":"Kellie"},{"$f":"'Hit Squad'!$D$62","v":"Molis"},{"$f":"'Hit Squad'!$H$64","v":0},{"$f":"'Hit Squad'!$H$61","v":1},{"$f":"'Hit Squad'!$F$8","v":3},"N",{"$f":"'Hit Squad'!$H$62","v":0},{"$f":"'Hit Squad'!$H$63","v":1},{"$f":"'Hit Squad'!$D$64","v":"f"}]
[60,{"$f":"'Ghetto Bombers'!$A$49","v":10},{"$f":"'Ghetto Bombers'!$D$1","v":"Ghetto Bombers"},{"$f":"'Ghetto Bombers'!$D$49","v":"Hope"},{"$f":"'Ghetto Bombers'!$D$50","v":"Curtis"},{"$f":"'Ghetto Bombers'!$H$52","v":0},{"$f":"'Ghetto Bombers'!$H$49","v":1},{"$f":"'Ghetto Bombers'!$F$8","v":4},"N",{"$f":"'Ghetto Bombers'!$H$50","v":0},{"$f":"'Ghetto Bombers'!$H$51","v":3},{"$f":"'Ghetto Bombers'!$D$52","v":"f"}]
[10,{"$f":"'Bad Pitches'!$A$49","v":10},{"$f":"'Bad Pitches'!$D$1","v":"Bad Pitches"},{"$f":"'Bad Pitches'!$D$49","v":"Emma"},{"$f":"'Bad Pitches'!$D$50","v":"Larsen"},{"$f":"'Bad Pitches'!$H$52","v":0},{"$f":"'Bad Pitches'!$H$49","v":4},{"$f":"'Bad Pitches'!$F$8","v":3},"N",{"$f":"'Bad Pitches'!$H$50","v":0},{"$f":"'Bad Pitches'!$H$51","v":4},{"$f":"'Bad Pitches'!$D$52","v":"f"}]
[206,{"$f":"'Team 7'!$A$33","v":6},{"$f":"'Team 7'!$D$1","v":" "},{"$f":"'Team 7'!$D$33","v":"Julie"},{"$f":"'Team 7'!$D$34","v":0},{"$f":"'Team 7'!$H$36","v":0},{"$f":"'Team 7'!$H$33","v":10},{"$f":"'Team 7'!$F$8","v":8},"N",{"$f":"'Team 7'!$H$34","v":0},{"$f":"'Team 7'!$H$35","v":10},{"$f":"'Team 7'!$D$36","v":"f"}]
[202,{"$f":"'Team 7'!$A$17","v":2},{"$f":"'Team 7'!$D$1","v":" "},{"$f":"'Team 7'!$D$17","v":"Dorothy"},{"$f":"'Team 7'!$D$18","v":0},{"$f":"'Team 7'!$H$20","v":0},{"$f":"'Team 7'!$H$17","v":10},{"$f":"'Team 7'!$F$8","v":8},"N",{"$f":"'Team 7'!$H$18","v":0},{"$f":"'Team 7'!$H$19","v":10},{"$f":"'Team 7'!$D$20","v":"f"}]
[208,{"$f":"'Team 7'!$A$41","v":8},{"$f":"'Team 7'!$D$1","v":" "},{"$f":"'Team 7'!$D$41","v":"Sheri"},{"$f":"'Team 7'!$D$42","v":0},{"$f":"'Team 7'!$H$44","v":0},{"$f":"'Team 7'!$H$41","v":10},{"$f":"'Team 7'!$F$8","v":8},"N",{"$f":"'Team 7'!$H$42","v":0},{"$f":"'Team 7'!$H$43","v":10},{"$f":"'Team 7'!$D$44","v":"f"}]
[127,{"$f":"'Team 6'!$A$17","v":2},{"$f":"'Team 6'!$D$1","v":"Team 6"},{"$f":"'Team 6'!$D$17","v":"Mary"},{"$f":"'Team 6'!$D$18","v":0},{"$f":"'Team 6'!$H$20","v":0},{"$f":"'Team 6'!$H$17","v":10},{"$f":"'Team 6'!$F$8","v":8},"N",{"$f":"'Team 6'!$H$18","v":0},{"$f":"'Team 6'!$H$19","v":10},{"$f":"'Team 6'!$D$20","v":"f"}]
[211,{"$f":"'Team 7'!$A$53","v":11},{"$f":"'Team 7'!$D$1","v":" "},{"$f":"'Team 7'!$D$53","v":0},{"$f":"'Team 7'!$D$54","v":0},{"$f":"'Team 7'!$H$56","v":0},{"$f":"'Team 7'!$H$53","v":10},{"$f":"'Team 7'!$F$8","v":8},"N",{"$f":"'Team 7'!$H$54","v":0},{"$f":"'Team 7'!$H$55","v":10},{"$f":"'Team 7'!$D$56","v":"f"}]
[204,{"$f":"'Team 7'!$A$25","v":4},{"$f":"'Team 7'!$D$1","v":" "},{"$f":"'Team 7'!$D$25","v":"Jill"},{"$f":"'Team 7'!$D$26","v":0},{"$f":"'Team 7'!$H$28","v":0},{"$f":"'Team 7'!$H$25","v":10},{"$f":"'Team 7'!$F$8","v":8},"N",{"$f":"'Team 7'!$H$26","v":0},{"$f":"'Team 7'!$H$27","v":10},{"$f":"'Team 7'!$D$28","v":"f"}]
[131,{"$f":"'Team 6'!$A$33","v":6},{"$f":"'Team 6'!$D$1","v":"Team 6"},{"$f":"'Team 6'!$D$33","v":"Heidi"},{"$f":"'Team 6'!$D$34","v":0},{"$f":"'Team 6'!$H$36","v":0},{"$f":"'Team 6'!$H$33","v":10},{"$f":"'Team 6'!$F$8","v":8},"N",{"$f":"'Team 6'!$H$34","v":0},{"$f":"'Team 6'!$H$35","v":10},{"$f":"'Team 6'!$D$36","v":"f"}]
[133,{"$f":"'Team 6'!$A$41","v":8},{"$f":"'Team 6'!$D$1","v":"Team 6"},{"$f":"'Team 6'!$D$41","v":"Christine"},{"$f":"'Team 6'!$D$42","v":0},{"$f":"'Team 6'!$H$44","v":0},{"$f":"'Team 6'!$H$41","v":10},{"$f":"'Team 6'!$F$8","v":8},"N",{"$f":"'Team 6'!$H$42","v":0},{"$f":"'Team 6'!$H$43","v":10},{"$f":"'Team 6'!$D$44","v":"f"}]
[184,{"$f":"'Team 8'!$A$45","v":9},{"$f":"'Team 8'!$D$1","v":" "},{"$f":"'Team 8'!$D$45","v":"Kenzie"},{"$f":"'Team 8'!$D$46","v":0},{"$f":"'Team 8'!$H$48","v":0},{"$f":"'Team 8'!$H$45","v":10},{"$f":"'Team 8'!$F$8","v":8},"N",{"$f":"'Team 8'!$H$46","v":0},{"$f":"'Team 8'!$H$47","v":10},{"$f":"'Team 8'!$D$48","v":"f"}]
[180,{"$f":"'Team 8'!$A$29","v":5},{"$f":"'Team 8'!$D$1","v":" "},{"$f":"'Team 8'!$D$29","v":"Lori"},{"$f":"'Team 8'!$D$30","v":0},{"$f":"'Team 8'!$H$32","v":0},{"$f":"'Team 8'!$H$29","v":10},{"$f":"'Team 8'!$F$8","v":8},"N",{"$f":"'Team 8'!$H$30","v":0},{"$f":"'Team 8'!$H$31","v":10},{"$f":"'Team 8'!$D$32","v":"f"}]
[178,{"$f":"'Team 8'!$A$21","v":3},{"$f":"'Team 8'!$D$1","v":" "},{"$f":"'Team 8'!$D$21","v":"Kylie"},{"$f":"'Team 8'!$D$22","v":0},{"$f":"'Team 8'!$H$24","v":0},{"$f":"'Team 8'!$H$21","v":10},{"$f":"'Team 8'!$F$8","v":8},{"$f":"IF(K194<(H194*2.5),\"N\",\"Y\")","v":"N"},{"$f":"'Team 8'!$H$22","v":0},{"$f":"'Team 8'!$H$23","v":10},{"$f":"'Team 8'!$D$24","v":"f"}]
[176,{"$f":"'Team 8'!$A$13","v":1},{"$f":"'Team 8'!$D$1","v":" "},{"$f":"'Team 8'!$D$13","v":"Linda"},{"$f":"'Team 8'!$D$14","v":0},{"$f":"'Team 8'!$H$16","v":0},{"$f":"'Team 8'!$H$13","v":10},{"$f":"'Team 8'!$F$8","v":8},"N",{"$f":"'Team 8'!$H$14","v":0},{"$f":"'Team 8'!$H$15","v":10},{"$f":"'Team 8'!$D$16","v":"f"}]
[182,{"$f":"'Team 8'!$A$37","v":7},{"$f":"'Team 8'!$D$1","v":" "},{"$f":"'Team 8'!$D$37","v":"Kim"},{"$f":"'Team 8'!$D$38","v":0},{"$f":"'Team 8'!$H$40","v":0},{"$f":"'Team 8'!$H$37","v":10},{"$f":"'Team 8'!$F$8","v":8},"N",{"$f":"'Team 8'!$H$38","v":0},{"$f":"'Team 8'!$H$39","v":10},{"$f":"'Team 8'!$D$40","v":"f"}]
[135,{"$f":"'Team 6'!$A$49","v":10},{"$f":"'Team 6'!$D$1","v":"Team 6"},{"$f":"'Team 6'!$D$49","v":"Laurie"},{"$f":"'Team 6'!$D$50","v":0},{"$f":"'Team 6'!$H$52","v":0},{"$f":"'Team 6'!$H$49","v":10},{"$f":"'Team 6'!$F$8","v":8},"N",{"$f":"'Team 6'!$H$50","v":0},{"$f":"'Team 6'!$H$51","v":10},{"$f":"'Team 6'!$D$52","v":"f"}]
[129,{"$f":"'Team 6'!$A$25","v":4},{"$f":"'Team 6'!$D$1","v":"Team 6"},{"$f":"'Team 6'!$D$25","v":"Pat"},{"$f":"'Team 6'!$D$26","v":0},{"$f":"'Team 6'!$H$28","v":0},{"$f":"'Team 6'!$H$25","v":10},{"$f":"'Team 6'!$F$8","v":8},"N",{"$f":"'Team 6'!$H$26","v":0},{"$f":"'Team 6'!$H$27","v":10},{"$f":"'Team 6'!$D$28","v":"f"}]
[81,{"$f":"'Hit Squad'!$A$33","v":6},{"$f":"'Hit Squad'!$D$1","v":"Hit Squad"},{"$f":"'Hit Squad'!$D$33","v":"Michelle"},{"$f":"'Hit Squad'!$D$34","v":"Mears"},{"$f":"'Hit Squad'!$H$36","v":0},{"$f":"'Hit Squad'!$H$33","v":7},{"$f":"'Hit Squad'!$F$8","v":3},"N",{"$f":"'Hit Squad'!$H$34","v":0},{"$f":"'Hit Squad'!$H$35","v":7},{"$f":"'Hit Squad'!$D$36","v":"f"}]
[87,{"$f":"'Hit Squad'!$A$57","v":12},{"$f":"'Hit Squad'!$D$1","v":"Hit Squad"},{"$f":"'Hit Squad'!$D$57","v":"Kelli"},{"$f":"'Hit Squad'!$D$58","v":"Hansen"},{"$f":"'Hit Squad'!$H$60","v":0},{"$f":"'Hit Squad'!$H$57","v":2},{"$f":"'Hit Squad'!$F$8","v":3},"N",{"$f":"'Hit Squad'!$H$58","v":0},{"$f":"'Hit Squad'!$H$59","v":2},{"$f":"'Hit Squad'!$D$60","v":"f"}]
[210,{"$f":"'Team 7'!$A$49","v":10},{"$f":"'Team 7'!$D$1","v":" "},{"$f":"'Team 7'!$D$49","v":"Trish"},{"$f":"'Team 7'!$D$50","v":0},{"$f":"'Team 7'!$H$52","v":0},{"$f":"'Team 7'!$H$49","v":10},{"$f":"'Team 7'!$F$8","v":8},"N",{"$f":"'Team 7'!$H$50","v":0},{"$f":"'Team 7'!$H$51","v":10},{"$f":"'Team 7'!$D$52","v":"f"}]

{"sheet":"Sheet1","index":11,"n_rows":0,"n_cols":0,"rows_kept":0,"cut":false,"hidden":false,"merged":[]}

{"sheet":"STANDINGS","index":12,"n_rows":9,"n_cols":6,"rows_kept":9,"cut":false,"hidden":false,"merged":[]}
["COUNTER","TEAM","WINS","LOSSES","Winning Percentage","TEAM B/A"]
[2,{"$f":"BCBC!$D$1","v":"BCBC"},{"$f":"BCBC!$F$3","v":4},{"$f":"BCBC!$F$4","v":0},{"$f":"((C2/(C2+D2)))","v":1},{"$f":"BCBC!$F$10","v":0.58083832335329344}]
[1,{"$f":"'Bad Pitches'!$D$1","v":"Bad Pitches"},{"$f":"'Bad Pitches'!$F$3","v":2},{"$f":"'Bad Pitches'!$F$4","v":1},0.66666666666666663,{"$f":"'Bad Pitches'!$F$10","v":0.43859649122807015}]
[5,{"$f":"Sticks!$D$1","v":"Sticks"},{"$f":"Sticks!$F$3","v":2},{"$f":"Sticks!$F$4","v":2},0.5,{"$f":"Sticks!$F$10","v":0.53424657534246578}]
[3,{"$f":"'Ghetto Bombers'!$D$1","v":"Ghetto Bombers"},{"$f":"'Ghetto Bombers'!$F$3","v":1},{"$f":"'Ghetto Bombers'!$F$4","v":3},0.25,{"$f":"'Ghetto Bombers'!$F$10","v":0.50322580645161286}]
[7,{"$f":"'Team 7'!$D$1","v":" "},{"$f":"'Team 7'!$F$3","v":0},{"$f":"'Team 7'!$F$4","v":8},0,{"$f":"'Team 7'!$F$10","v":0}]
[8,{"$f":"'Team 8'!$D$1","v":" "},{"$f":"'Team 8'!$F$3","v":0},{"$f":"'Team 8'!$F$4","v":8},0,{"$f":"'Team 8'!$F$10","v":0}]
[4,{"$f":"'Hit Squad'!$D$1","v":"Hit Squad"},{"$f":"'Hit Squad'!$F$3","v":0},{"$f":"'Hit Squad'!$F$4","v":3},0,{"$f":"'Hit Squad'!$F$10","v":0.39759036144578314}]
[6,{"$f":"'Team 6'!$D$1","v":"Team 6"},{"$f":"'Team 6'!$F$3","v":0},{"$f":"'Team 6'!$F$4","v":8},0,{"$f":"'Team 6'!$F$10","v":0}]

{"sheet":"print","index":13,"n_rows":49,"n_cols":7,"rows_kept":49,"cut":false,"hidden":false,"merged":[]}
["Statistics as of:",{"$f":"Start!$A$2","v":"2023-05-04"}]
[]
["LEAGUE LEADING HITTERS - Female"]
[]
["Players Name",null,"TEAM","AVG","AB","HITS","PA"]
[{"$f":"Female!D2","v":"Calliane"},{"$f":"Female!E2","v":"Hodson"},{"$f":"Female!C2","v":"Bad Pitches"},{"$f":"Female!F2","v":0.875},{"$f":"Female!G2","v":8},{"$f":"Female!J2","v":7},{"$f":"Female!K2","v":8}]
[{"$f":"Female!D3","v":"Calleigh"},{"$f":"Female!E3","v":"DeYoung"},{"$f":"Female!C3","v":"Ghetto Bombers"},{"$f":"Female!F3","v":0.875},{"$f":"Female!G3","v":8},{"$f":"Female!J3","v":7},{"$f":"Female!K3","v":12}]
[{"$f":"Female!D4","v":"Maree"},{"$f":"Female!E4","v":"Achermann"},{"$f":"Female!C4","v":"BCBC"},{"$f":"Female!F4","v":0.625},{"$f":"Female!G4","v":16},{"$f":"Female!J4","v":10},{"$f":"Female!K4","v":16}]
[{"$f":"Female!D5","v":"Sunni"},{"$f":"Female!E5","v":"Jackson"},{"$f":"Female!C5","v":"BCBC"},{"$f":"Female!F5","v":0.5714285714285714},{"$f":"Female!G5","v":14},{"$f":"Female!J5","v":8},{"$f":"Female!K5","v":15}]
[{"$f":"Female!D6","v":"Mel"},{"$f":"Female!E6","v":"Maile"},{"$f":"Female!C6","v":"BCBC"},{"$f":"Female!F6","v":0.53846153846153844},{"$f":"Female!G6","v":13},{"$f":"Female!J6","v":7},{"$f":"Female!K6","v":13}]
[{"$f":"Female!D7","v":"Casey"},{"$f":"Female!E7","v":"Velarde"},{"$f":"Female!C7","v":"BCBC"},{"$f":"Female!F7","v":0.5},{"$f":"Female!G7","v":10},{"$f":"Female!J7","v":5},{"$f":"Female!K7","v":10}]
[{"$f":"Female!D8","v":"Kacee"},{"$f":"Female!E8","v":"Robinson"},{"$f":"Female!C8","v":"Sticks"},{"$f":"Female!F8","v":0.46666666666666667},{"$f":"Female!G8","v":15},{"$f":"Female!J8","v":7},{"$f":"Female!K8","v":16}]
[{"$f":"Female!D9","v":"Brandi"},{"$f":"Female!E9","v":"Hall"},{"$f":"Female!C9","v":"Ghetto Bombers"},{"$f":"Female!F9","v":0.46153846153846156},{"$f":"Female!G9","v":13},{"$f":"Female!J9","v":6},{"$f":"Female!K9","v":13}]
[{"$f":"Female!D10","v":"Tiffany"},{"$f":"Female!E10","v":"Morton"},{"$f":"Female!C10","v":"BCBC"},{"$f":"Female!F10","v":0.36363636363636365},{"$f":"Female!G10","v":11},{"$f":"Female!J10","v":4},{"$f":"Female!K10","v":11}]
[{"$f":"Female!D11","v":"Robyne"},{"$f":"Female!E11","v":"Oostveen"},{"$f":"Female!C11","v":"BCBC"},{"$f":"Female!F11","v":0.35714285714285715},{"$f":"Female!G11","v":14},{"$f":"Female!J11","v":5},{"$f":"Female!K11","v":14}]
[{"$f":"Female!D12","v":"Paige"},{"$f":"Female!E12","v":"Reynolds"},{"$f":"Female!C12","v":"Bad Pitches"},{"$f":"Female!F12","v":0.33333333333333331},{"$f":"Female!G12","v":12},{"$f":"Female!J12","v":4},{"$f":"Female!K12","v":12}]
[]
[]
["LEAGUE LEADING HITTERS - Male"]
[]
["Players Name",null,"TEAM","AVG","AB","HITS","PA"]
[{"$f":"Male!D2","v":"Ryan"},{"$f":"Male!E2","v":"Newbold"},{"$f":"Male!C2","v":"Ghetto Bombers"},{"$f":"Male!F2","v":0.90909090909090906},{"$f":"Male!G2","v":11},{"$f":"Male!J2","v":10},{"$f":"Male!K2","v":11}]
[{"$f":"Male!D3","v":"Ryan "},{"$f":"Male!E3","v":"Cusick"},{"$f":"Male!C3","v":"Hit Squad"},{"$f":"Male!F3","v":0.875},{"$f":"Male!G3","v":8},{"$f":"Male!J3","v":7},{"$f":"Male!K3","v":8}]
[{"$f":"Male!D4","v":"Dustin"},{"$f":"Male!E4","v":"Hunter"},{"$f":"Male!C4","v":"BCBC"},{"$f":"Male!F4","v":0.8666666666666667},{"$f":"Male!G4","v":15},{"$f":"Male!J4","v":13},{"$f":"Male!K4","v":15}]
[{"$f":"Male!D5","v":"Tommy"},{"$f":"Male!E5","v":"Gonzales"},{"$f":"Male!C5","v":"Sticks"},{"$f":"Male!F5","v":0.8571428571428571},{"$f":"Male!G5","v":14},{"$f":"Male!J5","v":12},{"$f":"Male!K5","v":14}]
[{"$f":"Male!D6","v":"Sean"},{"$f":"Male!E6","v":"Adams"},{"$f":"Male!C6","v":"Sticks"},{"$f":"Male!F6","v":0.83333333333333337},{"$f":"Male!G6","v":12},{"$f":"Male!J6","v":10},{"$f":"Male!K6","v":13}]
[{"$f":"Male!D7","v":"Tim"},{"$f":"Male!E7","v":"Arnold"},{"$f":"Male!C7","v":"Sticks"},{"$f":"Male!F7","v":0.83333333333333337},{"$f":"Male!G7","v":12},{"$f":"Male!J7","v":10},{"$f":"Male!K7","v":13}]
[{"$f":"Male!D8","v":"Mac"},{"$f":"Male!E8","v":"Estrada"},{"$f":"Male!C8","v":"Ghetto Bombers"},{"$f":"Male!F8","v":0.8},{"$f":"Male!G8","v":15},{"$f":"Male!J8","v":12},{"$f":"Male!K8","v":15}]
[{"$f":"Male!D9","v":"Shane"},{"$f":"Male!E9","v":"Singer"},{"$f":"Male!C9","v":"BCBC"},{"$f":"Male!F9","v":0.75},{"$f":"Male!G9","v":16},{"$f":"Male!J9","v":12},{"$f":"Male!K9","v":16}]
[{"$f":"Male!D10","v":"Ben"},{"$f":"Male!E10","v":"Magnum"},{"$f":"Male!C10","v":"BCBC"},{"$f":"Male!F10","v":0.69230769230769229},{"$f":"Male!G10","v":13},{"$f":"Male!J10","v":9},{"$f":"Male!K10","v":13}]
[{"$f":"Male!D11","v":"Chet"},{"$f":"Male!E11","v":"Wanlass"},{"$f":"Male!C11","v":"Ghetto Bombers"},{"$f":"Male!F11","v":0.6875},{"$f":"Male!G11","v":16},{"$f":"Male!J11","v":11},{"$f":"Male!K11","v":16}]
[{"$f":"Male!D12","v":"Nic"},{"$f":"Male!E12","v":"Johnston"},{"$f":"Male!C12","v":"Sticks"},{"$f":"Male!F12","v":0.66666666666666663},{"$f":"Male!G12","v":12},{"$f":"Male!J12","v":8},{"$f":"Male!K12","v":12}]
[]
[]
[]
[]
[]
["STANDINGS"]
["TEAMS NAME",null,null,"WINS","LOSSES","TEAM BATTING AVG"]
[{"$f":"STANDINGS!$B2","v":"BCBC"},null,null,{"$f":"STANDINGS!$C2","v":4},{"$f":"STANDINGS!$D2","v":0},{"$f":"STANDINGS!$F2","v":0.58083832335329344}]
[{"$f":"STANDINGS!$B3","v":"Bad Pitches"},null,null,{"$f":"STANDINGS!$C3","v":2},{"$f":"STANDINGS!$D3","v":1},{"$f":"STANDINGS!$F3","v":0.43859649122807015}]
[{"$f":"STANDINGS!$B4","v":"Sticks"},null,null,{"$f":"STANDINGS!$C4","v":2},{"$f":"STANDINGS!$D4","v":2},{"$f":"STANDINGS!$F4","v":0.53424657534246578}]
[{"$f":"STANDINGS!$B5","v":"Ghetto Bombers"},null,null,{"$f":"STANDINGS!$C5","v":1},{"$f":"STANDINGS!$D5","v":3},{"$f":"STANDINGS!$F5","v":0.50322580645161286}]
[{"$f":"STANDINGS!$B6","v":" "},null,null,{"$f":"STANDINGS!$C6","v":0},{"$f":"STANDINGS!$D6","v":8},{"$f":"STANDINGS!$F6","v":0}]
[{"$f":"STANDINGS!$B7","v":" "},null,null,{"$f":"STANDINGS!$C7","v":0},{"$f":"STANDINGS!$D7","v":8},{"$f":"STANDINGS!$F7","v":0}]
[{"$f":"STANDINGS!$B8","v":"Hit Squad"},null,null,{"$f":"STANDINGS!$C8","v":0},{"$f":"STANDINGS!$D8","v":3},{"$f":"STANDINGS!$F8","v":0.39759036144578314}]
[{"$f":"STANDINGS!$B9","v":"Team 6"},null,null,{"$f":"STANDINGS!$C9","v":0},{"$f":"STANDINGS!$D9","v":8},{"$f":"STANDINGS!$F9","v":0}]
[{"$f":"STANDINGS!#REF!","v":{"$error":"#REF!"}},null,null,{"$f":"STANDINGS!#REF!","v":{"$error":"#REF!"}},{"$f":"STANDINGS!#REF!","v":{"$error":"#REF!"}},{"$f":"STANDINGS!#REF!","v":{"$error":"#REF!"}}]
[{"$f":"STANDINGS!#REF!","v":{"$error":"#REF!"}},null,null,{"$f":"STANDINGS!#REF!","v":{"$error":"#REF!"}},{"$f":"STANDINGS!#REF!","v":{"$error":"#REF!"}},{"$f":"STANDINGS!#REF!","v":{"$error":"#REF!"}}]

{"sheet":"Sheet2","index":14,"n_rows":0,"n_cols":0,"rows_kept":0,"cut":false,"hidden":false,"merged":[]}